##TITLE=$$ Begin of the data block
##JCAMP-DX=5.00 $$ ACD/SpecManager v 10.08
##SPECTROMETER/DATA SYSTEM=Alpha
##DATE=27 Jun 2014 15:13:00
##DATA TYPE=INFRARED SPECTRUM
##DATA CLASS=XYDATA
##ORIGIN=
##OWNER=
##NPOINTS=1667
##FIRSTX=599.63549805
##LASTX=3997.56909180
##MAXX=3997.56909180
##MINX=599.63549805
##MAXY=1.13724244
##MINY=0.43264943
##XFACTOR=1.0000000000
##YFACTOR=0.000000010000000
##FIRSTY=1.07759118
##DELTAX=2.03957605
##XUNITS=1/CM
##YUNITS=ARBITRARY UNITS
##XYDATA=(X++(Y..Y))
599.6A07759118k9421P6282J00982J05942J22547J23405J25552J49083J20556K7680
620A08681726k1028K837L0422K7216J5414p987l4941l0482q845k801L147Q106k980
646.5A08659804j0228j7488l2246o7151j00923r2506r3329j40047p5150J30702J8095
669A08179533l07536k87032k16174j64473j25182j46877j74189j63674j47045j35374
689.4A06311977j41966j72735j94359k09140k57492l49653n00429p19368r14049r23169
709.8A01929617p30848n51272m98068m36932k40946R2745M72063P55393Q37243P42733
730.2A02371728O25074N84793N89085N70607N12088M39810L77155L27539K86436K63143
750.6A06947458K35748J84059J37019J02640R1946J19757J38653J08635P1907Q2803
$$ plain form
599.6 107759118 107729697 107805979 107906961 108012903 108135450 108258855 108384407 108533490 108654046 108681726
620 108681726 108660698 108663535 108693957 108721173 108736587 108728600 108693659 108663177 108654332 108651531 108654678 108662784 108659804
646.5 108659804 108649576 108632088 108599842 108532691 108431768 108339262 108245933 108105886 108030736 108161438 108179533
669 108179533 107871997 107584965 107368791 107204318 107079136 106932259 106758070 106594396 106447351 106311977
689.4 106311977 106170011 105997276 105802917 105593777 105336285 104986632 104486203 103766835 102852786 101929617
709.8 101929617 101198769 100647497 100149429 99712497 99471551 99564296 100036359 100791752 101628995 102371728
730.2 102371728 102996802 103581595 104170680 104741287 105253375 105693185 106070340 106397879 106684315 106947458
750.6 106947458 107183206 107367265 107504284 107606924 107698870 107818627 107957280 108065915 108137822 108220625
771A08220625J16146J14762J00279J03092R4307Q5437R8074R6643O5362M9102M6265
793.4A09190094J3936j4877j3590k0325n1320p0274m8756k7156n6196r2065p4398m8697
817.9A08686376n0998k9957K8085N3335J5866m7528j12212j36495r2780m2129k4855
840.3A08246708k1899k7549j7715K3687N6994O1512M9532K6583J0920j800m0650p6902
864.8A08289421q9825j15394j41943j23214p2253j5390M2820P1692P1669Q3148Q6380
887.2A08087111N4132J1528n5635j73330k32721j34849m971L8087L8934K1624j8453
909.6A07631457m9234m3952q035J1933l0184j18756j79017j36411j871J30760J71066
932.1A07377756R8097n817l3021J6999N2631M3666J9252k3889p3958j12116j28722
$$ plain form
771 108220625 108336771 108451533 108551812 108654904 108749211 108834648 108932722 109029365 109094727 109143829 109190094
793.4 109190094 109204030 109189153 109175563 109155238 109103918 109033644 108984888 108957732 108901536 108809471 108735073 108686376
817.9 108686376 108635378 108605421 108633506 108686841 108702707 108655179 108542967 108406472 108313692 108271563 108246708
840.3 108246708 108224809 108197260 108179545 108203232 108260226 108321738 108371270 108397853 108408773 108406973 108366323 108289421
864.8 108289421 108199596 108084202 107942259 107819045 107746792 107731402 107774222 107845914 107917583 108000731 108087111
887.2 108087111 108141243 108152771 108097136 107923806 107691085 107556236 107551265 107589352 107628286 107649910 107631457
909.6 107631457 107582223 107538271 107530236 107542169 107511985 107393229 107214212 107077801 107075930 107206690 107377756
932.1 107377756 107475853 107470036 107437015 107454014 107506645 107550311 107569563 107545674 107471716 107359600 107230878
954.5A07230878j10579o6483j7261J0097J2600m65l0779o3980r0754j12808r9373l0815
979A06630278K8407L7682M6695Q2194J09065Q8012L5942l10j5342l8946q3184j23155
1003.5A06797338j45615j66666j55842o1572L3092N687r7203j50300j23810q7393p8559
1025.9A05769157n2452L22K0015k6381j37984l26050n41293n83446l23129J4281J74260
1048.3A03987300K12932K20680J78397J14477P6258N7149M2832L2663J5247k7037p8213
1070.8A04832685j30987k19381l45063m79651n82731o13307n94938n84138n87642n89621
1091.2A00105226n78493n15431l81798j99908p27J62113K36803K05410P5060j01668
1111.6I9006587k35283k52533j20509J22196L59082M53007L11870j9032l56066o22368
$$ plain form
954.5 107230878 107120299 107053816 107036555 107046652 107059252 107058787 107028008 106964028 106873274 106760466 106661093 106630278
979 106630278 106658685 106696367 106743062 106825256 106934321 107022333 107058275 107057965 107042623 107003677 106920493 106797338
1003.5 106797338 106651723 106485057 106329215 106267643 106300735 106306422 106209219 106058919 105935109 105847716 105769157
1025.9 105769157 105716705 105717027 105737042 105710661 105572677 105246627 104705334 104121888 103798759 103813040 103987300
1048.3 103987300 104200232 104420912 104599309 104713786 104790044 104847193 104890025 104922688 104937935 104910898 104832685
1070.8 104832685 104701698 104482317 104137254 103657603 103074872 102461565 101866627 101282489 100694847 100105226
1091.2 100105226 99526733 99011302 98629504 98429596 98428869 98590982 98827785 99033195 99108255 99006587
1111.6 99006587 98771304 98518771 98398262 98520458 98879540 99332547 99644417 99625385 99269319 98646951
1132I8646951r17721j236099j413554j361382j158237r47267q12447p58219p64221
1150.3H9277804q02535q22419p71499o28429m23575k28119p4327N2298J54090K54720
1170.7H5988009M10634O27119Q18967R34983J008129J036680R88543Q81767P71475
1189.1I3466306O81442O02686N44846N33456N50490N33802M61685L56478K42275J50472
1209.5I8123938R5051O5714N9981N3644N168q0038j61957k11972k17498j91539j70052
1231.9I7370440j65606j55884j02275J1479J48464K66117L47340L82763L67617L15321
1252.3I8785776K54208K10082J90920J84143J67822J37413J22446J36518J54066J57011
1272.7A00500405J43826J14155Q7046J12009K08485L03078L19564K66231J87933J24657
$$ plain form
1132 98646951 97729230 96493131 95079577 93718195 92559958 91612691 90800244 90042025 89277804
1150.3 89277804 88475269 87652850 86881351 86252922 85829347 85601228 85526901 85579199 85733289 85988009
1170.7 85988009 86398643 87025762 87844729 88779712 89787841 90824521 91813064 92694831 93466306
1189.1 93466306 94147748 94750434 95295280 95828736 96379226 96913028 97374713 97731191 97973466 98123938
1209.5 98123938 98218989 98284703 98344684 98398328 98403496 98323458 98161501 97949529 97732031 97540492 97370440
1231.9 97370440 97204834 97048950 96946675 96958154 97106618 97372735 97720075 98102838 98470455 98785776
1252.3 98785776 99039984 99250066 99440986 99625129 99792951 99930364 100052810 100189328 100343394 100500405
1272.7 100500405 100644231 100758386 100845432 100957441 101165926 101469004 101788568 102054799 102242732 102367389
1293.1A02367389Q9836O7401M3845M6778J00815J59014J69491J49525J33061J19507
1313.5A03446662R3151N6672N1725R5081J40130J50049J28591Q6773K3067o4063j59014
1335.9A04048824k23767k04373j08981o2788r5367j24657j22619j09386j08922j00958
1356.3A02787006o6841n3549n9461k7132j8370n9796j14894k95734n51868m86278j1098
1378.7A01041985N28740P95818P60853O39677N30172L74925J64866L9351J11783K51996
1399.1A05240166L67129L91150L03602J19400j63305m77958o37924n66423l61085l672
1419.5A04211080L01731K55108J2338k86603n84603o80112o32692p55417p39706m45676
1439.9A00655448l91435m74781n56505o80202p78741r16892j080882j282692r55296
$$ plain form
1293.1 102367389 102457225 102524626 102568471 102615249 102716064 102875078 103044569 103194094 103327155 103446662
1313.5 103446662 103539813 103596485 103648210 103743291 103883421 104033470 104162061 104248834 104271901 104207838 104048824
1335.9 104048824 103825057 103620684 103511703 103448915 103353548 103228891 103106272 102996886 102887964 102787006
1356.3 102787006 102720165 102666616 102607155 102580023 102561653 102501857 102386963 102091229 101539361 101053083 101041985
1378.7 101041985 101570725 102366543 103127396 103767073 104297245 104672170 104837036 104876387 104988170 105240166
1399.1 105240166 105607295 105998445 106302047 106421447 106258142 105780184 105142260 104575837 104214752 104211080
1419.5 104211080 104512811 104767919 104780257 104493654 103909051 103228939 102596247 101840830 101101124 100655448
1439.9 100655448 100264013 99789232 99232727 98552525 97773784 96856892 95776010 94493318 93538022
1458.3I3538022j96516j92214n35857O7669J712465L159571L828055K903711J574469
1476.6A05859375R64248P05517N50758L87919K12515J16241J79612K05481M3035j38450
1497A09086251p7629J34552K03454M8185o0630J71041K36666J19520q190m5526k7692
1519.5A09780002k7418O1953J02090Q2899P7521j0252o9165P630n7102k56133j34218
1541.9A09557807Q9312J16324N4753o485j251J275o2370j76561K3663K48766J50621
1564.3A09995854L9911q130L1126R4258P868o0951O3180J03975L7265J824L623J0205
1588.8A10320008Q571o223j9634j9741k9277n5004n5360l1376j1885Q702K8109p259
1613.3A10129631j04750j08051J7440q750r8681o5506k7740j049J2076j04570k37835
$$ plain form
1458.3 93538022 93341506 93149292 92613435 92681104 94393569 97553140 101381195 104284906 105859375
1476.6 105859375 106823623 107529140 108079898 108467817 108680332 108796573 108976185 109181666 109224701 109086251
1497 109086251 109008622 109143174 109346628 109394813 109334183 109505224 109741890 109861410 109853220 109807694 109780002
1519.5 109780002 109752584 109814537 109916627 109999526 110077047 110066795 109997630 110005260 109948158 109692025 109557807
1541.9 109557807 109647119 109763443 109818196 109811711 109810460 109811735 109749365 109572804 109596467 109845233 109995854
1564.3 109995854 110035765 110027635 110058761 110153019 110160887 110099936 110163116 110267091 110304356 110306180 110309803 110320008
1588.8 110320008 110328579 110322356 110302722 110282981 110253704 110198700 110143340 110111964 110100079 110108781 110136890 110129631
1613.3 110129631 110024881 109916830 109934270 109925520 109826839 109761333 109733593 109732544 109744620 109640050 109402215
1635.7A09402215o9892N0938m2617j73020l01183j84095J4687j52814k51139R4200
1656.1A08387280J19030l6311j34325p8070j3543p7796k7418J38235J74737J65332
1676.5A08617151J39284K4867j54245k28226n2011l5966j36733j84834l43871m31370
1696.9A07214046m32981m98700l58998l74401m78518m07815l84140m74775p02643j107204
1717.3A01993871j167882j075446j410216j862967k226139k655643l196204m784357
1733.6H3615017n352432m187589m341633m027104k395880o30176J288074L499430N377651
1752G2845358N893933O023395N787820M747254L827131K773743J825786J278555Q99446
1770.3A05902421P00260O04987M76157L39425K61498K31170K05028J71423J35434N8329
$$ plain form
1635.7 109402215 109332323 109383261 109340644 109167624 108866441 108682346 108697033 108544219 108293080 108387280
1656.1 108387280 108506310 108469999 108335674 108257604 108244061 108166265 108138847 108277082 108451819 108617151
1676.5 108617151 108756435 108781302 108627057 108398831 108346820 108310854 108174121 107989287 107645416 107214046
1696.9 107214046 106781065 106282365 105923367 105548966 105070448 104662633 104278493 103803718 103101075 101993871
1717.3 101993871 100825989 99750543 98340327 96477360 94251221 91595578 88399374 83615017
1733.6 83615017 78262585 74074996 69733363 65706259 63310379 62680203 63968277 67467707 72845358
1752 72845358 78739291 84762686 90550506 95297760 99124891 101898634 103724420 105002975 105902421
1770.3 105902421 106602681 107207668 107683825 108023250 108284748 108515918 108720946 108892369 109027803 109086132
1790.7A09086132N5301J31691J38938P9870N4670R6786J10292Q1730M2820M6814P0536
1813.2A09995580O9570N4717N5898M4548J2291O771J3113J7452N9903Q7142N0807L1113
1837.6A10498905K7073r621m4512N448O5779O2514M2927K4807J7250O544J181L242
1862.1A10701537L6k5153l3641K1064N7769L6406J2064Q929M113K980N067q23j1301
1888.6A10779047Q929K6202J0645J4425K1124J0848J67m614j0645j0062O021K0968
1913.1A10873055M316k6882j8012j085J347J9753K5284K742m268N424N520P51j1206
1939.6A10876739k6154p630K4831K7109J4126M434J598j299l624l291J347O0j1742
1966.1A10896504p916N246J4233J9169R394o461j1790q762o604r406j0562j1694n532
$$ plain form
1790.7 109086132 109141433 109273124 109412062 109491932 109546602 109643388 109753680 109835410 109878230 109925044 109995580
1813.2 109995580 110065150 110119867 110175765 110220313 110232604 110239375 110252488 110269940 110329843 110416985 110467792 110498905
1837.6 110498905 110525978 110516357 110471845 110477293 110543072 110605586 110648513 110673320 110690570 110697114 110698295 110701537
1862.1 110701537 110701573 110676420 110642779 110663843 110721612 110758018 110770082 110779011 110783124 110786104 110791171 110790348 110779047
1888.6 110779047 110787976 110814178 110824823 110839248 110860372 110871220 110871387 110866773 110856128 110846066 110852087 110873055
1913.1 110873055 110877371 110850489 110832477 110831392 110832739 110852492 110877776 110880518 110876250 110881674 110887194 110887945 110876739
1939.6 110876739 110850585 110842955 110867786 110894895 110909021 110913455 110915053 110913754 110910130 110906839 110908186 110908246 110896504
1966.1 110896504 110888588 110893834 110908067 110927236 110936630 110930169 110918379 110909617 110903013 110893607 110883045 110871351 110865819
1992.6A10865819J0574R263J192n48n412o128k599k455n222j3065k3568k1112o592
2019.2A10800147J955N72n269j1277q213o44j168j348K742L314M328O306N555N245
2047.7A10802245N472N901O783L278k813n508k491J907M160Q810P260l696l743N937
2076.3A10833502M923K885Q047R274O449K253N675R966L266o568j0825l087R930J2445
2104.8A10888135L565N24L672J132n674n758K301Q094O628l266p355o56J598J871K504
2135.4A10897315l231p439q666p844k897p021j6034p951O687N997j848m888j490K825
2164A10843515M244L410L159L528J884R53l933p725k742J19l087K706J2684R429J609
2194.6A10869753r18L851M995k134j454Q440J1146K86q691l504N054J753m519l612
$$ plain form
1992.6 110865819 110876393 110885656 110886848 110886300 110880888 110874760 110872161 110869706 110864484 110851419 110827851 110806739 110800147
2019.2 110800147 110802102 110802674 110797405 110786128 110777915 110777271 110776103 110774755 110777497 110780811 110785139 110791445 110797000 110802245
2047.7 110802245 110807717 110813618 110820401 110823679 110820866 110815358 110812867 110814774 110818934 110827744 110835004 110831308 110827565 110833502
2076.3 110833502 110838425 110841310 110849357 110858631 110865080 110867333 110873008 110882974 110886240 110879672 110868847 110865760 110875690 110888135
2104.8 110888135 110891700 110892224 110895896 110897028 110891354 110885596 110887897 110895991 110902619 110899353 110891998 110891342 110892940 110894811 110897315
2135.4 110897315 110894084 110886645 110877979 110870135 110867238 110860217 110844183 110836232 110842919 110848916 110847068 110842180 110840690 110843515
2164 110843515 110847759 110851169 110854328 110857856 110859740 110860693 110856760 110849035 110846293 110846412 110843325 110846031 110858715 110868144 110869753
2194.6 110869753 110868835 110872686 110877681 110875547 110874093 110882533 110893679 110893965 110885274 110881770 110886824 110888577 110884058 110880446
2223.1A10880446k265J669N937k62p582o366l695n84J764j562j228L612L481Q4J490
2253.7A10874939N460K086n84N96TK158j193o878l612N829P558l767j2386o640N496
2284.3A10869658J6963K3473K3687K4974K6560K9027L8445M3249M3059N6851Q0991
2306.7A11276937R4842R1279Q2660R0420J22631J58178J65546J27602Q6760J02544
2327.1A12399399J27626J00815N7232M4859M8077N0378L3641q5926k74289k54905K62
2349.6A12247169K68519M05431L88396K87508J27221n1380j75523k43712k92134l16858
2370A12644637l31843l34204k97534k46429k11895j71661j15323o7604l6609j7750
2390.4A10813785j2160r954m29K408l457j812J836o32k134r06m422k146P641N746l397
$$ plain form
2223.1 110880446 110878181 110879850 110885787 110885525 110877943 110871577 110867882 110867298 110869062 110867500 110866272 110869884 110873365 110873449 110874939
2253.7 110874939 110880399 110882485 110881901 110882497 110883093 110885251 110884058 110877180 110873568 110879397 110886955 110883188 110870802 110864162 110869658
2284.3 110869658 110886621 110910094 110933781 110958755 110985315 111014342 111052787 111096036 111139095 111195946 111276937
2306.7 111276937 111371779 111463058 111545718 111636138 111758769 111916947 112082493 112210095 112296855 112399399
2327.1 112399399 112527025 112627840 112685072 112729931 112778008 112828386 112862027 112776101 112501812 112246907 112247169
2349.6 112247169 112515688 112921119 113309515 113597023 113724244 113672864 113497341 113253629 112961495 112644637
2370 112644637 112312794 111978590 111681056 111434627 111222732 111051071 110935748 110868144 110831535 110813785
2390.4 110813785 110801625 110791671 110791242 110793650 110790193 110788381 110790217 110789585 110787451 110786545 110782123 110779977 110787618 110793364 110789967
2421A10789967l994M220P808J264m315k039L088M804L516Q23K420R453L803j0490r227
2451.5A10801101J800J0943Q512p391j6070p379J645j049L004R895n49q750l445n161
2480.1A10787106j4461j5652q547l612j0359j4615J430J3518J228j3733j6641j1659
2504.6A10694003m983m375o127j0514k4271k9350j6546p582p176k957N854P891k634
2531.1A10591233n853k134p367l362M363l064n60J2767P701j1384j9753o378M816m983
2559.6A10556042j8847k1684q702L493l779j8907k6512k3067j5390j0991j2612j9718
2584.1A10379326k1290j1647n996j0324j3447p879o426j6582j4865m006m065j0240
2608.6A10252559j4031j5032k1708k7227j6451l922q285k0254k8384l2127k7311j2624
$$ plain form
2421 110789967 110785973 110790193 110798001 110799265 110794950 110792911 110795999 110800803 110804319 110805142 110807562 110817015 110820818 110810328 110801101
2451.5 110801101 110802901 110813844 110822356 110814965 110798895 110791516 110793161 110792112 110795116 110805011 110804462 110795712 110792267 110787106
2480.1 110787106 110772645 110756993 110748446 110744834 110734475 110719860 110721290 110734808 110736036 110722303 110705662 110694003
2504.6 110694003 110689020 110684645 110678518 110668004 110643733 110614383 110597837 110590255 110583079 110580122 110585976 110593867 110591233
2531.1 110591233 110585380 110583246 110575879 110572517 110576880 110573816 110573256 110586023 110593724 110582340 110562587 110556209 110561025 110556042
2559.6 110556042 110537195 110515511 110506809 110510302 110506523 110487616 110461104 110438037 110422647 110411656 110399044 110379326
2584.1 110379326 110358036 110346389 110340393 110330069 110316622 110308743 110302317 110285735 110270870 110266864 110262799 110252559
2608.6 110252559 110238528 110223496 110201788 110174561 110158110 110154188 110145903 110125649 110097265 110065138 110037827 110025203
2633.1A10025203j19l386j2540r442m577j0598j3232j1707k0718l0554l2138l4917
2657.5A09841275l9828l8945l2962k5153j4877j4651k1195j3197l826o187l291J2577
2682A09639740K7204K7465K2126K2351K5654K4927J7178J2350J3435J2624O485p546
2706.5A09843993j7011j1218m756o878r036j6296k9552l1972l4440k8813k718P224
2731A09658527L553Q678J8382K6393K4653J8358j860k2852j0657N328N126M792Q47
2757.5A09739268j1301k9111l7825k4283j4925l4893o4587p9501o8641m8315n2667
2779.9A09273219p9989r9004j07383j19520j14894j00255j10650j35481j43409j25241
2800.3A08137393j15013j44065j86812k12980k26235k39921k69997l16679l62099m10616
$$ plain form
2633.1 110025203 110025084 110021698 110009158 109999716 109995139 109984541 109971309 109959602 109938884 109908330 109876192 109841275
2657.5 109841275 109801447 109762502 109729540 109704387 109689510 109674859 109653664 109640467 109636641 109630454 109627163 109639740
2682 109639740 109666944 109694409 109716535 109738886 109764540 109789467 109806645 109818995 109832430 109845054 109851539 109843993
2706.5 109843993 109826982 109815764 109811008 109804130 109795094 109778798 109749246 109717274 109682834 109654021 109651303 109658527
2731 109658527 109662080 109670758 109689140 109715533 109740186 109758544 109756684 109733832 109723175 109728503 109733629 109738421 109739268
2757.5 109739268 109727967 109698856 109661031 109636748 109621823 109586930 109522343 109442842 109374201 109325886 109273219
2779.9 109273219 109193230 109094226 108986843 108867323 108752429 108652174 108541524 108406043 108262634 108137393
2800.3 108137393 108022380 107878315 107691503 107478523 107252288 107012367 106742370 106425691 106063592 105652976
2820.7A05652976m77767n58257o46603p57086r06182j101219j387895j858514k568233
2839.1I5391220l531993m665696n662728o122887n734390m315459j972414O98680K905512
2857.4F6989845M165036M441398L963554L026986J975626J233309J087845J346916
2873.7H8230515J477777J179803N92554k0779n29301r12988j200098j410860j549005
2892.1H5857618j626533j673824j737344j845217k001852k219540k514064k889931
2908.4F9349313l340358l823173m230809m382920m098994l317267k125898p64951N21231
2926.8D3786174J606640K454913L154567L739863M093248M145241L919476L442615
2943.1G0342737K746910J893050J043027M53008K81918N00512R65893J513016K020753
$$ plain form
2820.7 105652976 105175209 104616952 103970349 103213263 102307081 101205862 99817967 97959453 95391220
2839.1 95391220 91859227 87193531 81530803 75407916 69673526 65358067 63385653 64084333 66989845
2857.4 66989845 71154881 75596279 79559833 82586819 84562445 85795754 86883599 88230515
2873.7 88230515 89708292 90888095 91480649 91459870 90930569 90017581 88817483 87406623 85857618
2892.1 85857618 84231085 82557261 80819917 78974700 76972848 74753308 72239244 69349313
2908.4 69349313 66008955 62185782 57954973 53572053 49473059 46155792 44029894 43264943 43786174
2926.8 43786174 45392814 47847727 51002294 54742157 58835405 62980646 66900122 70342737
2943.1 70342737 73089647 74982697 76025724 76478732 76760650 77261162 78227055 79740071 81760824
2961.4H1760824K416342K638245K645999K472276K188897J868432J575834J317418
2977.8I8884267J076966Q86536P56490O33204M98772L58390K02954L2783j84012m42624
2998.1A02703726o92081q81386r12261p14868l17544J90270O96790J092982J298643
3016.5A02464271J302051J154649R26102P07531N47897M08900K88630K13659J82092
3034.9A08195782J64520J12534N5277M6409P5256R1303O7484N8592P5733O6137N6899
3057.3A09065926O7556N2214J4138j216L1078P6520Q3137N1963L481k2197R430N6541
3081.8A09488571O7019N2476L0029K2066M5001N5122L1472k528r548J5318J2529k6405
3106.2A09781122l4725P939K4855j5020l5000o628M1783Q3077P9083L4928l099j454
$$ plain form
2961.4 81760824 84177166 86815411 89461410 91933686 94122583 95991015 97566849 98884267
2977.8 98884267 99961233 100847769 101604259 102237463 102736235 103094625 103297579 103330362 103146350 102703726
2998.1 102703726 102011645 101130259 100217998 99503130 99185586 99375856 100072646 101165628 102464271
3016.5 102464271 103766322 104920971 105847073 106554604 107102501 107511401 107800031 108013690 108195782
3034.9 108195782 108360302 108472836 108528113 108574522 108649778 108741081 108808565 108867157 108942890 109009027 109065926
3057.3 109065926 109133482 109185696 109199834 109198618 109229696 109306216 109389353 109441316 109444797 109422600 109432030 109488571
3081.8 109488571 109555590 109608066 109638095 109660161 109705162 109760284 109791756 109789228 109779680 109794998 109807527 109781122
3106.2 109781122 109746397 109754336 109779191 109764171 109729171 109722543 109764326 109847403 109926486 109961414 109958315 109956861
3130.7A09956861K6059J9300k6453l5965J0538M3821L3176O688k7573n2345j6046N2750
3155.2A09990811O3336L0828J4150R787N043K646p39n949J777R405o974j6415P797
3181.7A10105503L1113J8573j0252j0681J6200K5797N138n603K373q47m863L099J5831
3208.2A10191381J8764L314o068J91J4054K2710R882m887l767n830l3176m7242j204
3234.7A10158122M4417L8159J6880q643m1997l6073J8776M8005J9562n734P868K1303
3259.2A10280645J1933n675j8036l3259n6291l8981J1253L4702L6037K3257J824p987
3283.7A10239422j0335j7142l7218m7588k1052K1922N4419M4251k3365r1052p8535
3306.1A10033727P987P5292O9213L1293J4400J0812m41k7525m3738l099L6203J5212
$$ plain form
3130.7 109956861 109982920 110002220 109975767 109939802 109950340 109994161 110027337 110034025 110006452 109954107 109938061 109990811
3155.2 109990811 110054147 110084975 110099125 110108912 110113955 110116601 110115862 110109913 110111690 110121095 110114121 110097706 110105503
3181.7 110105503 110136616 110155189 110144937 110134256 110150456 110176253 110181391 110175788 110178161 110177314 110172451 110175550 110191381
3208.2 110191381 110210145 110213459 110207391 110207582 110221636 110244346 110254228 110249341 110245574 110239744 110206568 110159326 110158122
3234.7 110158122 110202539 110240698 110257578 110248935 110206938 110170865 110189641 110237646 110257208 110251474 110259342 110280645
3259.2 110280645 110292578 110286903 110268867 110235608 110179317 110140336 110151589 110186291 110222328 110245585 110247409 110239422
3283.7 110239422 110229087 110211945 110174727 110127139 110106087 110128009 110182428 110226679 110203314 110112262 110033727
3306.1 110033727 110041714 110117006 110186219 110217512 110231912 110242724 110242283 110214758 110171020 110167921 110204124 110219336
3330.6A10219336r013k0206m9126m7600N007M0781M0138P057n0163m2486K8479M7576
3355.1A10169780N722k2459j4150k0969o0987o4886j478O7019O3861J5104L206J8943
3379.5A10158706K3961K1279R310k9075p6926m7779M1616M2415m2320o7281J4042Q5366
3404A10133314M9913j7905l2127o843K6012M3332J9634j7583k6989k2948k9337m4954
3428.5A10073519l9602l4844n1642j4508N8246P0024L2925j7178m3619j7774m649k0313
3453A09990585k8086m0793m9818l2723l4618r1660j12450j08J36042J31667M4250k7609
3477.4A09884679l0076O7830R8073J9551J6761N6409J8597l9113n7089l8326l6263
3499.9A09961033o3443j43Q5854M6921l9160q6105n5170J4996J3268n3382r3054m4573
$$ plain form
3330.6 110219336 110210323 110190117 110140991 110093391 110098398 110139179 110179317 110186374 110136211 110093725 110122204 110169780
3355.1 110169780 110175502 110153043 110138893 110117924 110056937 109992051 109990573 110057592 110121453 110136557 110139763 110158706
3379.5 110158706 110182667 110203946 110213256 110184181 110107255 110059476 110101092 110143507 110101187 110033906 110047948 110133314
3404 110133314 110183227 110165322 110133195 110126352 110152364 110195696 110215330 110197747 110170758 110147810 110118473 110073519
3428.5 110073519 110033917 109999073 109947431 109932923 109991169 110061193 110094118 110076940 110033321 110015547 110010898 109990585
3453 109990585 109962499 109921706 109871888 109839165 109804547 109712887 109600437 109600329 109736371 109868038 109912288 109884679
3477.4 109884679 109854603 109922433 110020506 110040057 110056818 110113227 110131824 110092711 110035622 109997296 109961033
3499.9 109961033 109897590 109897447 109983301 110030222 109991062 109904957 109849787 109864783 109878051 109824669 109731615 109687042
3524.4A09687042M3178O4671K8860p212k7120j4424R560q273m1556r453Q9001J23799
3548.8A09938073N7662L1650O6840O3181K7061K1756L1638O950J3828Q4627J04558
3571.3A10447824P2420N5968M3238N865j9861k9885k7383K3651O0118K5761o604j2041
3595.7A10639071j0705K1482P9763Q1563L5608J8334J7107Q142J3387R692j324M9568
3620.2A10961688J08075O9272k7394n5933M3154Q1527L8695O247j2255k8443m4036
3642.6A11140597n9819r4760r1445N2321J34122O8998R191J2815L6002N3155K3115
3665.1A11284292n7209r8312l5166N900j239N8627R7656O9809K9790k7549r7966n5337
3689.6A11173296R6822J36852Q3244K9325q499j4305J7273O867o5733q7571p641M5931
$$ plain form
3524.4 109687042 109730220 109794891 109823751 109816539 109789419 109774995 109784555 109776282 109734726 109725273 109814274 109938073
3548.8 109938073 109995735 110027385 110094225 110157406 110184467 110206223 110237861 110244811 110258639 110343266 110447824
3571.3 110447824 110520244 110576212 110619450 110625315 110605454 110575569 110548186 110571837 110631955 110657716 110651112 110639071
3595.7 110639071 110628366 110649848 110729611 110811174 110846782 110865116 110882223 110890365 110903752 110913444 110912120 110961688
3620.2 110961688 111069763 111139035 111111641 111055708 111098862 111180389 111219084 111225331 111213076 111184633 111140597
3642.6 111140597 111080778 110986018 110894573 110946894 111081016 111150014 111159205 111172020 111208022 111261177 111284292
3665.1 111284292 111227083 111128771 111093605 111099505 111098266 111156893 111254549 111324358 111354148 111326599 111228633 111173296
3689.6 111173296 111270118 111406970 111490214 111519539 111511040 111496735 111514008 111520875 111455142 111367571 111359930 111405861
3714A11405861K9862P630J335N805K0349N2464N0366j8286j05966j25801l3212M4525
3738.5A11334932L3676p987l0028j5819k0087r918M4691M3392J598o92M0448L8707
3763A11452913J216j0824K956M3655O4325K2650n1260o0856J8477L9685K1481L1495
3787.5A11575913J5319r322k4855l9554k0039j6546l0244L100J1217K6393N5409K0301
3811.9A11567092l3271n2643n4956n1880J8156P0453M1449K2065J2744j8466o6542
3834.4A11454201q4770j8322N7148N2786L4833M0305J5962m9162q1742L6P2217O0547
3858.8A11554039J8858k7012l4523k5380l7932n436N1689P1048L9912l2819m5883j1826
3883.3A11514735P236M5824K9683j0383J4115J6439l3391n8913l9244Q202O4778P0644
$$ plain form
3714 111405861 111435723 111443353 111444688 111450493 111470842 111523306 111573672 111555386 111449420 111323619 111290407 111334932
3738.5 111334932 111368608 111360621 111330593 111314774 111294687 111284769 111329460 111372852 111374450 111373758 111414206 111452913
3763 111452913 111454129 111443305 111446261 111489916 111554241 111576891 111525631 111464775 111483252 111522937 111544418 111575913
3787.5 111575913 111591232 111581910 111557055 111517501 111497462 111480916 111450672 111453772 111464989 111491382 111546791 111567092
3811.9 111567092 111533821 111481178 111426222 111374342 111392498 111462951 111504400 111526465 111539209 111520743 111454201
3834.4 111454201 111369431 111351109 111408257 111461043 111495876 111536181 111552143 111502981 111421239 111421275 111493492 111554039
3858.8 111554039 111572897 111545885 111511362 111485982 111448050 111442614 111494303 111565351 111605263 111572444 111526561 111514735
3883.3 111514735 111521971 111567795 111597478 111587095 111601210 111617649 111584258 111525345 111486101 111494303 111559081 111629725
3907.8A11629725M6956L0649k098l5537k4891K1863L3713Q321N674N400j5449j8525
3932.3A11685801J2886K9469N889k2209k6238M29J9324L016o485P355J6677N675j3209
3958.8A11718380j1229M661O819K336K361R18r06j371O973J1003k491O592L1781K5714
3987.3A11801541K658n674j3399k3020n316
3997.5A11756790
$$ plain form
3907.8 111629725 111676681 111707330 111705232 111669695 111644804 111666667 111700380 111708701 111714375 111719775 111704326 111685801
3932.3 111685801 111698687 111728156 111734045 111711836 111685598 111686027 111705351 111708367 111701882 111709237 111725914 111731589 111718380
3958.8 111718380 111707151 111711812 111718631 111720967 111723328 111724246 111723340 111721969 111728942 111739945 111737454 111744046 111775827 111801541
3987.3 111801541 111804199 111798525 111785126 111762106 111756790
3997.5 111756790
##END=$$ End of the data block
