##TITLE=$$ Begin of the data block
##JCAMP-DX=5.00 $$ ACD/SpecManager v 10.08
##SPECTROMETER/DATA SYSTEM=Alpha
##DATE=27 Jun 2014 15:13:00
##DATA TYPE=INFRARED SPECTRUM
##DATA CLASS=XYDATA
##ORIGIN=
##OWNER=
##NPOINTS=1667
##FIRSTX=599.63549805
##LASTX=3997.56909180
##MAXX=3997.56909180
##MINX=599.63549805
##MAXY=1.13718939
##MINY=0.43553931
##XFACTOR=1.0000000000
##YFACTOR=0.000000010000000
##FIRSTY=1.07691801
##DELTAX=2.03957605
##XUNITS=1/CM
##YUNITS=ARBITRARY UNITS
##XYDATA=(X++(Y..Y))
599.6A07691801j8597O8772J16980J40250J31225J01865J17337J65165J35266J8335
620A08668399m5693j5271K4903K6596J788q190P51p295o414j943l1328m2069j5104
646.5A08549130N150J7309Q094m2820p7927j06191j52839j63471m4346J70922J2970
669A08175981l36623k81489j92058j65630j51216j48881j52111j62745j61039j37532
689.4A06286657j40143j73556j89138j98531k44474l40903n06997p31922r10353r12774
709.8A01937866p36713n47040m65071m08453k44563O5380M52548P50172Q35836P44379
730.2A02384341O25956N82886N79297N53537N07819M53341L84963L22437K71606K39158
750.6A06905341K31731J99246J34063R7883J14918J51562J49215R9480O0367O8462
$$ y = [107691801, 107673204, 107741976, 107858956, 107999206, 108130431, 108232296, 108349633, 108514798, 108650064, 108668399, 108622706, 108607435, 108632338, 108658934, 108660722, 108652532, 108653283, 108645988, 108639574, 108637631, 108606303, 108564234, 108549130, 108554280, 108571589, 108579683, 108536863, 108458936, 108352745, 108199906, 108036435, 107992089, 108163011, 108175981, 107839358, 107557869, 107365811, 107200181, 107048965, 106900084, 106747973, 106585228, 106424189, 106286657, 106146514, 105972958, 105783820, 105585289, 105340815, 104999912, 104492915, 103760993, 102850640, 101937866, 101201153, 100654113, 100189042, 99780589, 99536026, 99601406, 100053954, 100804126, 101639962, 102384341, 103010297, 103593183, 104172480, 104726017, 105233836, 105687177, 106072140, 106394577, 106666183, 106905341, 107137072, 107336318, 107470381, 107568264, 107683182, 107834744, 107983959, 108083439, 108143806, 108212268]
771A08212268J02628J16384J10006J05917J00303R6679R7883R8407P7701M2605L3176
793.4A09193957K7227q845k9457k7597m7445o8891n8687l3378l8433o4826p3576p8547
817.9A08691502p6545k9027M7278P6545K4294o2692j20616j27387q9049l8076j0061
840.3A08286166q690k0027j8502J1683N2118O2371M1568K3150J5819K63l6729p3421
864.8A08335769r3329j18160j45662j31535o9106K003M5418N7686O3479P9119Q6343
887.2A08112025O3813K3389m6861j70207k37120j31666Q333M4870L5906J0562k9719
909.6A07683325m8900l6800j1778k527l7551j18518j74713j27816L421J32382J72031
932.1A07432556R8634q214m1103J2565N7065M9699K3329k4164p8010j11998j26707
$$ y = [108212268, 108314896, 108431280, 108541286, 108647203, 108747506, 108844185, 108942068, 109040475, 109118176, 109160781, 109193957, 109221184, 109212339, 109182882, 109155285, 109107840, 109038949, 108980262, 108946884, 108908451, 108843625, 108770049, 108691502, 108614957, 108585930, 108633208, 108709753, 108734047, 108671355, 108550739, 108423352, 108334303, 108296227, 108286166, 108277476, 108257449, 108238947, 108250630, 108302748, 108365119, 108406687, 108429837, 108445656, 108445919, 108409190, 108335769, 108242440, 108124280, 107978618, 107847083, 107777977, 107779980, 107825398, 107883084, 107946563, 108025682, 108112025, 108175838, 108199227, 108152366, 107982159, 107745039, 107613373, 107621706, 107666576, 107702482, 107713044, 107683325, 107634425, 107597625, 107585847, 107583320, 107545769, 107427251, 107252538, 107124722, 107128143, 107260525, 107432556, 107531190, 107522976, 107481873, 107494438, 107551503, 107601202, 107624531, 107600367, 107522357, 107410359, 107283652]
954.5A07283652j11067o4517j5211P713P403m101k7632n7185r4390j25062j02532k5952
979A06671119L1769L9160M7171Q3208J17922J02115M2868J514j4294m1866q9097j28984
1003.5A06862605j52851j75488j59966n9629L4046N388r2458j43516j21832q8108p5555
1025.9A05832636n1415n614J4972l4690j50024l21699n16498n59640l17502P987J67692
1048.3A04066205K02835K15482J83857J10531O4265N6208N0711L3164P975k8431q0180
1070.8A04882622j39618k16890l29732m71795n86951o17552n92076n77045n84948n93793
1091.2A00172222n78159n06032l77130k05899o091J65593K44618K06387P4023r5964
1111.6I9093568k33847k56508j22327J23376L59815M48334L05236k4063l54969o14572
$$ y = [107283652, 107172585, 107108068, 107092857, 107100570, 107107973, 107103872, 107076240, 107019055, 106924665, 106799603, 106697071, 106671119, 106702888, 106742048, 106789219, 106872427, 106990349, 107092464, 107135332, 107136846, 107122552, 107080686, 106991589, 106862605, 106709754, 106534266, 106374300, 106314671, 106348717, 106354105, 106261647, 106118131, 105996299, 105908191, 105832636, 105781221, 105775607, 105790579, 105755889, 105605865, 105284166, 104767668, 104208028, 103890526, 103898513, 104066205, 104269040, 104484522, 104668379, 104778910, 104843175, 104899383, 104950094, 104983258, 104991233, 104962802, 104882622, 104743004, 104526114, 104196382, 103724587, 103137636, 102520084, 101928008, 101350963, 100766015, 100172222, 99594063, 99088031, 98710901, 98505002, 98498911, 98664504, 98909122, 99115509, 99189532, 99093568, 98859721, 98603213, 98480886, 98604262, 98964077, 99412411, 99717647, 99693584, 99338615, 98724043]
1132I8724043r11837j232464j404935j351827j156205r43291q01784p53260p62933
1150.3H9405507p93409q08305p61539o26755m27770k31570p7146M8524J51300K51669
1170.7H6130506M11528O29032Q10152R24045J005048J030594R77462Q79544P70664
1189.1I3568575O69188N91218N44542N39959N51724N27811M57382L51102K35337J50203
1209.5I8187041J05244P9209O4498M9889L10q6212j68085k12383k11859j83368j63001
1231.9I7461283j63895j54602r9617M106J36358K62743L46053L77440L65663L18366
1252.3I8853898K52581K02566J88655J90025J74076J40261J21951J35971J54054J51670
1272.7A00565708J37007J11663Q5366J11222K10512L03638L18265K67291J89328J23668
$$ y = [98724043, 97812206, 96579742, 95174807, 93822980, 92666775, 91723484, 90921700, 90168440, 89405507, 88612098, 87803793, 87042254, 86415499, 85987729, 85756159, 85679013, 85727537, 85878837, 86130506, 86542034, 87171066, 87981218, 88905263, 89910311, 90940905, 91918367, 92797911, 93568575, 94237763, 94828981, 95373523, 95913482, 96465206, 96993017, 97450399, 97801501, 98036838, 98187041, 98292285, 98371494, 98435992, 98485881, 98486191, 98399979, 98231894, 98019511, 97807652, 97624284, 97461283, 97297388, 97142786, 97043169, 97047275, 97183633, 97446376, 97792429, 98169869, 98535532, 98853898, 99106479, 99309045, 99497700, 99687725, 99861801, 100002062, 100124013, 100259984, 100414038, 100565708, 100702715, 100814378, 100899744, 101010966, 101221478, 101525116, 101843381, 102110672, 102300000, 102423668]
1293.1A02423668Q8024O4075L9339M5705J01972J57785J67155J47486J31237J19639
1313.5A03486085R3496N3406N0234J02461J50251J54173J28758Q5855J5306p2574j55485
1335.9A04091966k18093k06697j11580o0809r2542j25062j22714j07253j07050j00458
1356.3A02839708o9475n4562n4121k4033k1839n8555j04940k90823n58079m90117o270
1378.7A01106894N32210P89428P49695O36220N35476L75939J59537L3987J06513K52450
1399.1A05278349L73137L90100L01540J23358j61803m79066o40404n70643l63887j812
1419.5A04248869L08896K63094J9241k82538n83065o75773o26314p48789p33793m45330
1439.9A00744498l93832m72337n49597o78974p85333r15181j062412j262855r51868
$$ y = [102423668, 102511692, 102575767, 102615106, 102660811, 102762783, 102920568, 103087723, 103235209, 103366446, 103486085, 103579581, 103632987, 103683221, 103785682, 103935933, 104090106, 104218864, 104304719, 104320025, 104247451, 104091966, 103873873, 103667176, 103555596, 103494787, 103402245, 103277183, 103154469, 103047216, 102940166, 102839708, 102770233, 102715671, 102661550, 102637517, 102615678, 102557123, 102452183, 102161360, 101603281, 101113164, 101106894, 101639104, 102428532, 103178227, 103814447, 104349923, 104725862, 104885399, 104919386, 105025899, 105278349, 105651486, 106041586, 106343126, 106466484, 106304681, 105825615, 105185211, 104614568, 104250681, 104248869, 104557765, 104820859, 104840100, 104557562, 103974497, 103298724, 102672410, 101923621, 101189828, 100744498, 100350666, 99878329, 99328732, 98649758, 97864425, 96949244, 95886832, 94623977, 93672109]
1458.3I3672109j97924j94507n39822P2104J717633L151351L808969K888155J567901
1476.6A05945969R57143O91688N39482L84795K13361J23036J87969K04575L8696j33336
1497A09153378o7866J34123J92189L2007o2477J85013K38692J11974r728l8111j6510
1519.5A09852684k3461N1522R3627Q2088P8058p295o1000J3471n7626k59936j36411
1541.9A09625721R5010J24645N8985o485n019p51n7733j69432K4140K43354J47032
1564.3A10079467M0639o879K9338R1636R263n4729O4647R9504L5023K957M673J0121
1588.8A10405660N781q654k1374k4796l3915n6660n4443k4235j490J1527K6786n078
1613.3A10219109j06406j13881J4210j4603j00863n7793k1946r42J2434r8682k29621
$$ y = [93672109, 93474185, 93279678, 92739856, 92811960, 94529593, 97680944, 101489913, 104378068, 105945969, 106903112, 107594800, 108134282, 108519077, 108732438, 108855474, 109043443, 109248018, 109286714, 109153378, 109085512, 109219635, 109411824, 109443831, 109381354, 109566367, 109805059, 109917033, 109907305, 109869194, 109852684, 109829223, 109880745, 109974372, 110056460, 110134518, 110127223, 110066223, 110079694, 110022068, 109762132, 109625721, 109720731, 109845376, 109904361, 109897876, 109892857, 109892106, 109834373, 109664941, 109689081, 109932435, 110079467, 110120106, 110113227, 110142565, 110234201, 110243464, 110188735, 110253382, 110352886, 110387909, 110390866, 110395539, 110405660, 110411441, 110402787, 110381413, 110356617, 110322702, 110266042, 110211599, 110187364, 110185874, 110197401, 110224187, 110219109, 110112703, 109998822, 110013032, 109998429, 109897566, 109839773, 109817827, 109816885, 109829319, 109730637, 109501016]
1635.7A09501016p2729M1651m8375j75726l03233j81091J7452j55711k52151R8288
1656.1A08469391J22166l4404j31238p4875j4675q3136k9815J44303J85192J68693
1676.5A08721602J33383J9491j56057k26700n2679l7622j32978j82104l50917m45282
1696.9A07290137m43757m96459l51238l72803m77064m04632l81112m72701p03418j104700
1717.3A02082253j158417j067579j404762j850647k208197k643948l193468m774350
1733.6H3780885n324745m164625m324853m004699k373999o19299J283867L479343N352664
1752G3084539N874276O004370N764067M719388L801507K759850J819050J271820Q93510
1770.3A05992377O91771N97370M77207L44455K61998K26176K01630J68920J30355N4717
$$ y = [109501016, 109428287, 109469938, 109421563, 109245837, 108942604, 108761513, 108778965, 108623254, 108371103, 108469391, 108591557, 108557153, 108425915, 108351040, 108336365, 108253229, 108223414, 108367717, 108552909, 108721602, 108854985, 108874476, 108718419, 108491719, 108439040, 108401418, 108268440, 108086336, 107735419, 107290137, 106846380, 106349921, 105998683, 105625880, 105148816, 104744184, 104363072, 103890371, 103186953, 102082253, 100923836, 99856257, 98451495, 96600848, 94392651, 91748703, 88555235, 83780885, 78456140, 74291515, 69966662, 65961963, 63587964, 62968665, 64252532, 67731875, 73084539, 78958815, 84963185, 90727252, 95446640, 99248147, 102007997, 103827047, 105098867, 105992377, 106684148, 107281518, 107758725, 108103180, 108365178, 108591354, 108792984, 108961904, 109092259, 109146976]
1790.7A09146976N7900J35529J35577P4399N5253J01972J16086Q5533M3070M2939O6221
1813.2A10061455O8426N3704N4931M5264J1146L517J0180J3769N8269Q7870N0115K9397
1837.6A10548043K5428j0109m3130O866O3610O0570M5503K4676J1563L124O949J1313
1862.1A10754406o67l2342m3535J4174O1143M5394J6141M530j311L958O366o938j8216
1888.6A10803103Q083K5046O699J5509K6107J1790k682o700j1170j0109N722J9956
1913.1A10891354Q58k9885j5283J431K396K0372K0230l409r692k38J0025J1599j2040
1939.6A10887718l5286r382L3868L4880J0682k4M756o55r537p093O08k98j1122m816
1968.2A10894299Q106Q428R167O461l505p677l469J55l910j1849k0182j3817J0658
$$ y = [109146976, 109204876, 109340405, 109475982, 109550381, 109605634, 109707606, 109823692, 109909225, 109952295, 109995234, 110061455, 110129881, 110183585, 110238516, 110283780, 110294926, 110298443, 110308623, 110322392, 110380661, 110468531, 110518646, 110548043, 110573471, 110563362, 110520232, 110527098, 110590708, 110651278, 110696781, 110721457, 110733020, 110736144, 110743093, 110754406, 110753739, 110721397, 110677862, 110692036, 110753179, 110798573, 110814714, 110819244, 110817933, 110821891, 110828257, 110821319, 110803103, 110811186, 110836232, 110842931, 110858440, 110884547, 110896337, 110893655, 110886955, 110875785, 110865676, 110871398, 110891354, 110892212, 110862327, 110847044, 110848475, 110850871, 110871243, 110891473, 110888064, 110878372, 110878134, 110888159, 110899758, 110887718, 110852432, 110843050, 110876918, 110911798, 110922480, 110922456, 110927212, 110926557, 110917020, 110909927, 110910535, 110910237, 110899115, 110894299, 110902405, 110910833, 110920000, 110926461, 110922956, 110915279, 110911810, 110911965, 110908055, 110896206, 110876024, 110862207, 110872865]
1994.7A10872865J7452N555m089p319o330n973m148m745j3852k4283k2590n102Q762
2021.2A10806203M089p272q345j597k134m315P03j311o628j455N699J0323R787K551
2049.8A10806298K969J1432J2910Q106N61m673l350l46O938N067j0336j0061O211J2171
2078.3A10843897P355L874L803P141R441Q714J812n650l708J002L755P129M899l636
2106.9A10889828j085P487M267n531l922Q822J1611j2j1206r429O79P296O592j2p915
2137.5A10897470j0932p594l695k158l159p808r108p081n245N13O79l707J91R667J3757
2168.1A10861790P558k885n007P28k194o401N48M446O32K015N305O032P450K325m494
2198.6A10877848j79P987P725O675P284J562m268k837j67k027j955j776p927o962K324
$$ y = [110872865, 110890317, 110895872, 110891783, 110884464, 110878134, 110872161, 110868013, 110863268, 110849416, 110825133, 110802543, 110797441, 110806203, 110810292, 110803020, 110794675, 110793078, 110790944, 110786629, 110787332, 110786021, 110779393, 110777938, 110783637, 110793960, 110803747, 110806298, 110809267, 110820699, 110833609, 110841715, 110842276, 110837603, 110834253, 110833907, 110840845, 110845912, 110835576, 110825515, 110831726, 110843897, 110851252, 110855126, 110858929, 110866070, 110875511, 110884225, 110886037, 110880387, 110876679, 110877681, 110881436, 110888565, 110893464, 110889828, 110888743, 110896230, 110900497, 110894966, 110891044, 110899866, 110911477, 110911465, 110900259, 110890830, 110891509, 110898805, 110905397, 110905385, 110897470, 110886538, 110878944, 110875249, 110873091, 110869932, 110862124, 110853016, 110845935, 110840690, 110841203, 110841882, 110838175, 110838366, 110848033, 110861790, 110869348, 110866463, 110861456, 110862184, 110859990, 110853589, 110854137, 110858583, 110859215, 110861230, 110866535, 110872567, 110880017, 110882342, 110877848, 110877669, 110885656, 110893381, 110900056, 110907340, 110908902, 110904634, 110901797, 110901630, 110899603, 110897648, 110895872, 110887945, 110880983, 110883307]
2229.2A10883307J336n210k956M780M482n340p427q70K992L111n60j812K50k026R18
2259.8A10874975P903O831L397r06m661J121R286K420j2350j4353n555O843K0039K5392
2288.4A10920382K5045K6930L1614L4368L3546L4666M2438O0034Q4901J00565R3710
2310.8A11488199P8583Q5080J15716J45495J57106J37007J07229J12879J25301R3913
2331.2A12646508M2641L2711M9389N0247K9170p7796k64668k57171m184K72787M26173
2353.6A12945807M06802K70629R5701n3215j62327k45369l03864l31569l33929l18706
2374A11969960k87140k41601j99497j62279j22381q2469l7217k217k897j6010r155
2396.5A10807097Q34o723j0407L827J6510R394q941j3518P75J1992M757n079O92Q738
$$ y = [110883307, 110884643, 110879433, 110876477, 110881257, 110885739, 110880399, 110872972, 110872102, 110875094, 110878205, 110877645, 110875833, 110876083, 110874057, 110874975, 110882878, 110889709, 110893106, 110892200, 110887539, 110888660, 110897946, 110900366, 110888016, 110873663, 110868108, 110874951, 110894990, 110920382, 110945427, 110972357, 111003971, 111038339, 111071885, 111106551, 111148989, 111209023, 111293924, 111394489, 111488199, 111566782, 111651862, 111767578, 111913073, 112070179, 112207186, 112314415, 112427294, 112552595, 112646508, 112689149, 112721860, 112771249, 112821496, 112850666, 112772870, 112508202, 112251031, 112246847, 112519634, 112945807, 113352609, 113623238, 113718939, 113665724, 113503397, 113258028, 112954164, 112622595, 112288666, 111969960, 111682820, 111441219, 111241722, 111079443, 110957062, 110874593, 110837376, 110835159, 110832262, 110816252, 110807097, 110807931, 110801208, 110790801, 110794628, 110811138, 110820532, 110811591, 110798073, 110798848, 110810840, 110815597, 110810518, 110811210, 110819948]
2425A10819948M017j67K182K289J537j073n555m542L136J0228P927k479j0348p534
2453.6A10819566K218K062m816j824M840K169p426o831L064M339P03m124j2231j1528
2482.1A10790181k694K182l040j4806j9944o330J2541N925q786o783o580j0705j0729
2508.7A10720432j2601j8692k2530j2458k873r870j4603q810l099k611k444M208P809
2535.2A10621858L790K039l171j0431k038Q666K194j6380k2816o593J884r310j7691
2561.7A10552001j3483l683K277O43j0263k5642k6012j0252m136j1564j7666j9348
2586.2A10412872j6582j1599j1266j3291j0705j1444j5700j1838j0431j4674r823m208
2610.6A10271311j0669k0755k5534k1553j2005r012j4758k2018k4855k4045j6582m840
$$ y = [110819948, 110823965, 110823798, 110825980, 110828269, 110829806, 110828733, 110823178, 110818636, 110821772, 110832000, 110839927, 110837448, 110827100, 110819566, 110821784, 110823846, 110819030, 110817206, 110822046, 110824215, 110816789, 110809958, 110813022, 110817361, 110818064, 110813940, 110801709, 110790181, 110787487, 110789669, 110786629, 110771823, 110751879, 110745549, 110758090, 110764015, 110755229, 110748446, 110741866, 110731161, 110720432, 110707831, 110689139, 110666609, 110654151, 110651278, 110641408, 110626805, 110617995, 110614896, 110612285, 110609841, 110614049, 110621858, 110625648, 110627687, 110624516, 110614085, 110612047, 110620713, 110622907, 110606527, 110583711, 110577118, 110579002, 110569692, 110552001, 110538518, 110534835, 110537112, 110537755, 110527492, 110501850, 110475838, 110465586, 110461450, 110449886, 110432220, 110412872, 110396290, 110384691, 110373425, 110360134, 110349429, 110337985, 110322285, 110310447, 110300016, 110285342, 110275519, 110271311, 110260642, 110239887, 110214353, 110192800, 110180795, 110171783, 110157025, 110135007, 110110152, 110086107, 110069525, 110064685]
2635.1A10064685m840j1539r060k456m601r883j3864k5284l3796l0803k4414k6823
2659.6A09867322m2498n0103l6478j7989j1218r191n090p915j1933j359K2268L3402
2684.1A09729218J9229J1408K0623K3437K2566K1267J5068J3316J6212J3340l517k0456
2708.5A09881711k2352j7023q416l70j0073l2067m0603l8612k6106o92J1826J0109
2733A09707332R572J6737K7812K8312J8656o950k9504j3566J2147J4329N13j2970j9109
2759.5A09753311k3747k5928k4080k6488l6800n7352p7546o8247m4739m8745p6353
2782A09243286r7692j06240j18851j20521j03414j07825j38950j47581j21844j15454
2802.4A08064914j51360j93072k12466k15721k31529k71475l16441l56734m04787m71950
$$ y = [110064685, 110059845, 110048306, 110039246, 110036790, 110032189, 110022306, 110008442, 109983158, 109949362, 109918559, 109894145, 109867322, 109824824, 109774721, 109738243, 109720254, 109709036, 109699845, 109694755, 109686840, 109674907, 109673548, 109695816, 109729218, 109748447, 109759855, 109780478, 109803915, 109826481, 109847748, 109862816, 109876132, 109892344, 109905684, 109902167, 109881711, 109859359, 109842336, 109833920, 109833550, 109823477, 109791410, 109750807, 109712195, 109686089, 109685397, 109697223, 109707332, 109716904, 109733641, 109761453, 109789765, 109808421, 109801471, 109771967, 109758401, 109770548, 109784877, 109785390, 109772420, 109753311, 109729564, 109703636, 109679556, 109653068, 109616268, 109558916, 109481370, 109413123, 109368384, 109319639, 109243286, 109145594, 109039354, 108920503, 108799982, 108696568, 108588743, 108449793, 108302212, 108180368, 108064914, 107913554, 107720482, 107508016, 107292295, 107060766, 106789291, 106472850, 106116116, 105711329, 105239379]
2822.7A05239379n57124o52445p60877r00089j088059j377535j850802k557743l523445
2841.1I1971260m655295n641580o093413n701255m285020j958334O92832K893043M152929
2859.5G1375167M425705L944373L008789J963669J230770J088023J341641J469142
2875.8H9847279J175797N92780k1530n31154r17370j202291j404482j542580j626366
2894.1H4370083j671636j731164j838010j990396k202791k494556k873438l334439
2910.4F6233653l824747m224437m364389m077706l301570k120304p66569N19278J607159
2928.8D5680368K451339L143964L726869M083217M141294L914607L430253K729512
2945.1G3301423J878988J038301M51494K72739M88203R62299J516956K027226K414554
$$ y = [105239379, 104682255, 104029810, 103268933, 102368844, 101280785, 99903250, 98052448, 95494705, 91971260, 87315965, 81674385, 75580972, 69879717, 65594697, 63636363, 64329195, 67222238, 71375167, 75800872, 79745245, 82754034, 84717703, 85948473, 87036496, 88378137, 89847279, 91023076, 91615856, 91594326, 91063172, 90145802, 88943511, 87539029, 85996449, 84370083, 82698447, 80967283, 79129273, 77138877, 74936086, 72441530, 69568092, 66233653, 62408906, 58184469, 53820080, 49742374, 46440804, 44320500, 43553931, 44073209, 45680368, 48131707, 51275671, 55002540, 59085757, 63227051, 67141658, 70571911, 73301423, 75180411, 76218712, 76670206, 76942945, 77431148, 78393447, 79910403, 81937629, 84352183]
2963.5H4352183K622205K629722K463310K181805J855009J553959J298297J068317
2979.8A00024807Q84164P57575O38556M99940L54302K03824L3605j88255m48155o94394
3000.2A02065969q73256q96371p06392l24792J77252O93846J101816J307177J301444
3018.5A03846693J143062R10044P00807N53048M11689K79522K05934J88458J75619
3036.9A08414876J10877M2105L7837O6709P8488O2918O2120Q2696P0786N1010O1130
3059.3A09141552N2548J1170q345K6393P6866Q9324N6815K456j9682J7131N9068O1476
3083.8A09566772M6504L1697K4390M0484M7386K2185n734n198J8978J5509k6929l8684
3108.3A09737360J3412L8123j5796m4608p951M1401Q2457Q0336L1960n722k313J8156
$$ y = [84352183, 86974388, 89604110, 92067420, 94249225, 96104234, 97658193, 98956490, 100024807, 100908971, 101666546, 102305102, 102805042, 103159344, 103363168, 103396773, 103208518, 102760363, 102065969, 101192713, 100296342, 99589950, 99265158, 99442410, 100136256, 101238072, 102545249, 103846693, 104989755, 105899799, 106600606, 107153654, 107565343, 107844865, 108050799, 108239257, 108414876, 108525753, 108567858, 108605695, 108672404, 108750892, 108813810, 108875930, 108958626, 109029412, 109080422, 109141552, 109194100, 109205270, 109196925, 109223318, 109300184, 109389508, 109446323, 109448779, 109429097, 109446228, 109505296, 109566772, 109613276, 109644973, 109669363, 109709847, 109757233, 109779418, 109773684, 109768486, 109787464, 109802973, 109776044, 109737360, 109750772, 109788895, 109773099, 109728491, 109720540, 109761941, 109844398, 109924734, 109956694, 109950972, 109948659, 109966815]
3132.8A09966815J2350k8503m0377J8204O1595L6073k027l0470m6694r668N2202N6863
3157.2A10046363K4259J0681J1909R704K301l243q261q893k146n60j276O390J1957
3183.7A10099185Q177Q82K182J7130K4259J0491n13j991n161k218N401J6880K3305
3210.3A10198009M005j4555j1480N72J8740J9050m042q034K754k3938n3656j1313N1749
3236.8A10167861N5766K0087j4639m2200l6323J4007L9911J0944j0694P856K3532J6797
3261.2A10252905J550j7071l9840n9807l3069J6439L2210L1448J7667R65N913R549
3285.7A10218859j3829n0842n9510k2184K9873N6029K9397l3939q1825p2503j908P3350
3310.2A10070968Q3816M0984P975j287l517k3294m8601j3125L8779K6392l612j9574
$$ y = [109966815, 109979165, 109950662, 109910285, 109928489, 109990084, 110026157, 110024130, 109993660, 109946966, 109937298, 109989500, 110046363, 110070622, 110081303, 110093212, 110102916, 110105217, 110101974, 110093713, 110084820, 110082674, 110082114, 110080838, 110087228, 110099185, 110107362, 110108244, 110110426, 110127556, 110151815, 110162306, 110161793, 110159802, 110154641, 110152423, 110157824, 110174704, 110198009, 110202014, 110187459, 110175979, 110176551, 110195291, 110214341, 110210299, 110202265, 110205019, 110181081, 110127425, 110116112, 110167861, 110223627, 110243714, 110229075, 110186875, 110150552, 110164559, 110204470, 110215414, 110204720, 110212576, 110236108, 110252905, 110254455, 110237384, 110197544, 110137737, 110104668, 110121107, 110153317, 110184765, 110202432, 110203397, 110209310, 110218859, 110205030, 110154188, 110094678, 110072494, 110102367, 110158396, 110187793, 110153854, 110072029, 109999526, 109997618, 110070968, 110154784, 110195768, 110203743, 110202456, 110198939, 110175645, 110127044, 110113919, 110152698, 110179090, 110175478, 110155904]
3334.7A10155904m3332m0949l719K6405M5276J8239n2250m6539L1173M9448K205k6297
3359.1A10115564j7953k1684n7197o6507j0466N3131N1582J9431K0302L4141L8362
3381.6A10158706K9707M995l6371q4126o3074K6858M9603k3758o6114n12P6365N4765
3406.1A10127044o140k7358j7428J4829M4775K3222j2934j2815j3149l0994m8209m5323
3430.5A09995520l9852n1212j7619N0831O1548K3317j2720l1650k5451j3447j1861
3453A09927404k0087l9291n2548l7455l6967r6571j11759J4603J49548J35291L6716
3475.4A09868884m1997l7241O7854J02019K8109J6749M8185K0063l0816n0020l3462
3497.8A09958327l5346n7864P725P6866K8074m2367p7117n4002J1004J5163n4693j04189
$$ y = [110155904, 110112572, 110071623, 110067904, 110094309, 110139585, 110157824, 110105574, 110059035, 110090208, 110139656, 110141861, 110115564, 110097611, 110075927, 110018730, 109952223, 109941757, 109994888, 110046470, 110065901, 110086203, 110120344, 110158706, 110188413, 110193408, 110157037, 110072911, 110009837, 110036695, 110086298, 110062540, 109996426, 109995914, 110072279, 110127044, 110120904, 110093546, 110076118, 110090947, 110135722, 110158944, 110146010, 110133195, 110120046, 110089052, 110040843, 109995520, 109955668, 109904456, 109886837, 109937668, 109999216, 110022533, 110009813, 109978163, 109952712, 109939265, 109927404, 109907317, 109868026, 109815478, 109778023, 109741056, 109644485, 109532726, 109547329, 109696877, 109832168, 109868884, 109826887, 109789646, 109857500, 109959519, 109987628, 110004377, 110052562, 110072625, 110041809, 109991789, 109958327, 109922981, 109865117, 109872842, 109949708, 109977782, 109935415, 109858298, 109804296, 109815300, 109830463, 109775770, 109671581]
3522.3A09671581n2786M1628O7627L5322n353l1662j7893J6117P010k6369n734O8974
3546.8A09768462R8777N3477L7921P1573P4315M2093K3103K1851o32O843Q2778J12522
3571.3A10393083P8082N2929M5824J9288j3792l9435m2021K0254O8652K2447k3317
3593.7A10581994j4102J144K0170O0725O6090M0305K9421J8811M685J1790J7952J1290
3618.2A10850275M8303R5427O7866j1611m3559L4845N9962K1029J0275J443k4438m4215
3642.6A11065602o1810j05023j04463N5671J46961O8950O056K8134N7697N8365J3840
3665.1A11229980o0833r6380m3750o855L279O8676Q9753O0761L5441j9145j07205o4779
3689.6A11088943J11342J42693P4554L2556N01j8072P546J0418m7910q7309k5832M7683
$$ y = [109671581, 109618795, 109660423, 109728050, 109763372, 109758019, 109726357, 109708464, 109724581, 109731591, 109705222, 109699488, 109768462, 109867239, 109920716, 109958637, 110030210, 110104525, 110146618, 110169721, 110191572, 110190940, 110197783, 110280561, 110393083, 110471165, 110524094, 110569918, 110589206, 110575414, 110535979, 110493958, 110514212, 110582864, 110605311, 110581994, 110567892, 110569036, 110589206, 110649931, 110716021, 110756326, 110785747, 110804558, 110809243, 110821033, 110838985, 110850275, 110898578, 110994005, 111061871, 111050260, 111006701, 111041546, 111101508, 111122537, 111132812, 111134255, 111109817, 111065602, 111003792, 110898769, 110794306, 110849977, 110996938, 111065888, 111071944, 111100078, 111157775, 111216140, 111229980, 111169147, 111072767, 111029017, 111022162, 111025441, 111094117, 111183870, 111244631, 111280072, 111260927, 111153722, 111088943, 111200285, 111342978, 111417532, 111450088, 111450589, 111432517, 111440063, 111450481, 111402571, 111315262, 111289430, 111337113]
3714A11337113L9411J3876Q488p725j2791L7670N6612j8632j12867j21844k3651N6421
3738.5A11252081M3488j442k3282k3830l1662j0264N2095N1820J442m709M7648M8578
3763A11401963l159k7776p593N8627Q3733J2338p0978n8484K0707K6143N793J7584
3787.5A11458898J1396M554p653l9578l4058k3365l1948L886L2544M5777M3010J55
3811.9A11463618m1485n2607m7087m1902K0313P2992M0722J5187J4102j2886o5220
3834.4A11365747q0561j7786M9698N6672L9280K8944L326n4074p7271J1909P9477O1273
3858.8A11466634Q810m1711k8718M697j7679k0540K9874O5637M2128k3520l4058j4317
3883.3A11437237p677M0055L9505M77J8812J7213m0888p6163n5230M637P8011Q8632
$$ y = [111337113, 111376524, 111390400, 111398888, 111391163, 111378372, 111416042, 111472654, 111454022, 111341155, 111219311, 111195660, 111252081, 111295569, 111294127, 111270845, 111247015, 111215353, 111205089, 111257184, 111309004, 111310446, 111305737, 111353385, 111401963, 111398804, 111371028, 111363435, 111422062, 111505795, 111518133, 111447155, 111388671, 111409378, 111435521, 111441314, 111458898, 111470294, 111474848, 111467195, 111427617, 111393559, 111370194, 111338246, 111342132, 111374676, 111420453, 111463463, 111463618, 111422133, 111369526, 111322439, 111280537, 111300850, 111373842, 111414564, 111429751, 111443853, 111430967, 111365747, 111285186, 111267400, 111317098, 111373770, 111413050, 111441994, 111445320, 111391246, 111313975, 111325884, 111405361, 111466634, 111475444, 111433733, 111405015, 111409712, 111392033, 111371493, 111401367, 111467004, 111509132, 111485612, 111451554, 111437237, 111429560, 111469615, 111509120, 111509597, 111528409, 111545622, 111504734, 111428571, 111373341, 111377978, 111455989, 111544621]
3907.8A11544621M9901J5640j4567k7382j5188P558J5855P033J3447J8406m494j8931
3932.3A11591899j514J1504O545o724j6486N36J6701L541O831K7930J8311j621p284
3958.8A11650169r382r608m816O175J0919L088j347L528J1731N412j3876n460K3150
3985.3A11669683K9934J0693m208n090j3841j9395
3997.5A11667776
$$ y = [111544621, 111594522, 111610162, 111595595, 111568213, 111553025, 111560583, 111576438, 111583471, 111596918, 111615324, 111610830, 111591899, 111590385, 111601889, 111608434, 111601710, 111585224, 111585760, 111602461, 111606002, 111612833, 111640763, 111659074, 111657453, 111650169, 111640787, 111631179, 111626363, 111632538, 111643457, 111646545, 111645198, 111648726, 111660457, 111665869, 111651993, 111646533, 111669683, 111699617, 111710310, 111706102, 111701012, 111687171, 111667776]
##END=$$ End of the data block
