##TITLE=$$ Begin of the data block
##JCAMP-DX=5.00 $$ ACD/SpecManager v 10.08
##SPECTROMETER/DATA SYSTEM=Alpha
##DATE=27 Jun 2014 15:13:00
##DATA TYPE=INFRARED SPECTRUM
##DATA CLASS=XYDATA
##ORIGIN=
##OWNER=
##NPOINTS=1667
##FIRSTX=599.63549805
##LASTX=3997.56909180
##MAXX=3997.56909180
##MINX=599.63549805
##MAXY=1.13598239
##MINY=0.44039851
##XFACTOR=1.0000000000
##YFACTOR=0.000000010000000
##FIRSTY=1.07510173
##DELTAX=2.03957605
##XUNITS=1/CM
##YUNITS=ARBITRARY UNITS
##XYDATA=(X++(Y..Y))
$$ plain form
599.6 107510173 107496548 107573390 107684767 107810128 107930982 108036792 108158946 108328903 108467710 108489525
620 108489525 108453941 108439434 108458972 108484268 108492160 108494866 108487868 108474565 108496249 108526218 108499992 108449197 108438611
646.5 108438611 108448339 108446538 108439267 108380163 108264875 108154988 108047986 107918596 107861626 107983017 107986736
669 107986736 107686293 107418084 107239699 107097447 106958878 106797838 106618047 106458795 106326711 106194067
689.4 106194067 106049562 105891633 105722845 105533183 105284417 104938948 104437292 103713179 102803683 101892829
709.8 101892829 101172054 100638974 100168657 99747634 99506599 99595708 100067925 100811005 101620018 102350295
730.2 102350295 102986634 103589845 104179597 104716873 105195129 105631697 106012881 106334853 106613004 106874681
750.6 106874681 107124901 107319617 107447743 107542944 107640898 107767165 107913029 108037663 108121705 108201241
$$ packed form
599.6A07510173j3625P6842J11377J25361J20854J05810J22154J69957J38807K1815
620A08489525l5584j4507J9538K5296P892K706o998j3303K1684K9969k6226n0795j0586
646.5A08438611R728j801p271n9104j15288j09887j07002j29390n6970J21391L719
669A07986736l00443k68209j78385j42252j38569j61040j79791j59252j32084j32644
689.4A06194067j44505j57929j68788j89662k48766l45469n01656p24113r09496r10854
709.8A01892829p20775n33080m70317m21023k41035Q9109M72217P43080Q09013P30277
730.2A02350295O36339O03211N89752N37276M78256M36568L81184L21972K78151K61677
750.6A06874681K50220J94716J28126R5201R7954J26267J45864J24634Q4042P9536
$$ plain form
771 108201241 108306277 108422554 108536792 108643246 108728635 108806264 108906054 109014058 109092462 109148562 109201217
793.4 109201217 109223878 109197998 109151328 109110522 109072316 109023297 108976412 108949888 108908331 108830476 108757341 108704913
817.9 108704913 108658040 108632052 108651531 108693457 108707976 108662915 108559823 108448780 108377576 108337259 108311594
840.3 108311594 108294332 108269477 108253515 108281589 108341753 108397162 108435309 108460093 108476651 108473778 108431566 108358634
864.8 108358634 108268070 108150375 108012331 107893026 107825112 107816398 107848155 107888544 107943439 108033371 108127820
887.2 108127820 108192408 108222389 108173537 107991827 107755888 107626235 107623863 107663357 107703197 107716775 107690966
909.6 107690966 107646775 107606542 107591164 107598400 107573402 107457340 107273316 107133198 107137191 107284045 107468379
932.1 107468379 107564497 107550752 107513762 107526290 107575047 107620275 107644641 107628310 107558501 107440817 107305110
$$ packed form
771A08201241J05036J16277J14238J06454Q5389P7629R9790J08004P8404N6100N2655
793.4A09201217K2661k5880m6670m0806l8206m9019m6885k6524m1557p7855p3135n2428
817.9A08704913m6873k5988J9479M1926J4519m5061j03092j11043p1204m0317k5665
840.3A08311594j7262k4855j5962K8074O0164N5409L8147K4784J6558k873m2212p2932
864.8A08358634r0564j17695j38044j19305o7914q714L1757M0389N4895Q9932R4449
887.2A08127820O4588K9981m8852j81710k35939j29653k372L9494L9840J3578k5809
909.6A07690966m4191m0233j5378P236k4998j16062j84024j40118L993J46854J84334
932.1A07468379R6118j3745l6990J2528M8757M5228K4366j6331o9809j17684j35707
$$ plain form
954.5 107305110 107189870 107114875 107092047 107109356 107127845 107118106 107086325 107044566 106963241 106827104 106709206
977 106709206 106684458 106723642 106768465 106819320 106894326 106987917 107069898 107106292 107107270 107098925 107067418 106990969 106871510
1003.5 106871510 106718409 106537139 106373346 106315899 106353307 106351769 106244397 106093955 105979276 105903387
1023.9 105903387 105828083 105760920 105740368 105755067 105734241 105602109 105284381 104753125 104180729 103867269
1044.3 103867269 103886592 104060566 104266107 104480851 104661632 104771948 104835391 104888821 104935944 104962933
1064.7 104962933 104962242 104929352 104853868 104722416 104508805 104178894 103714311 103140604 102529359 101936030
1085 101936030 101359332 100778770 100191629 99619824 99117678 98747736 98551029 98546207 98703933 98936069
1105.4 98936069 99136078 99209762 99107766 98872066 98623991 98507041 98626822 98976207 99415827 99722958
$$ packed form
954.5A07305110j15240p4995k2828J7309J8489r739l1781m1759q1325j36137j17898
977A06709206k4748L9184M4823N0855P5006R3591Q1981L6394R78q345l1507p6449j19459
1003.5A06871510j53101j81270j63793n7447L7408j538j07372j50442j14679p5889
1023.9A05903387p5304o7163k0552J4699k0826j32132l17728n31256n72396l13460
1044.3A03867269J9323J73974K05541K14744J80781J10316O3443N3430M7123K6989
1064.7A04962933o91l2890p5484j31452k13611l29911m64583n73707o11245n93329
1085A01936030n76698n80562n87141n71805n02146l69942j96707m822J57726K32136
1105.4I8936069K00009P3684j01996k35700k48075j16950J19781L49385M39620L07131
$$ plain form
1125.8 99722958 99707222 99357647 98746824 97840780 96618128 95226228 93886608 92744589 91811794
1144.2 91811794 91010100 90256172 89498049 88712364 87913555 87165320 86554486 86137474 85906076 85823303
1164.6 85823303 85865748 86013132 86268717 86688101 87315816 88109475 89010525 90005291 91039115 92011207
1185 92011207 92871153 93627942 94297415 94889414 95429415 95966142 96515465 97034836 97482449 97832447
1205.4 97832447 98071319 98220301 98318857 98394072 98458159 98504514 98503828 98425120 98265874 98058242 97846180
1227.8 97846180 97655636 97484356 97319341 97167045 97071528 97083467 97222728 97480118 97823280 98204017
1248.2 98204017 98570138 98883975 99135089 99338555 99525058 99713135 99885398 100017023 100129783 100266087
1268.6 100266087 100423145 100574648 100713348 100830626 100926065 101045620 101249456 101538122 101848066 102111983
$$ packed form
1125.8I9722958j5736l49575o10823r06044j222652j391900j339620j142019r32795
1144.2I1811794q01694p53928p58123p85685p98809p48235o10834m17012k31398q2773
1164.6H5823303M2445J47384K55585M19384O27715P93659R01050R94766J033824R72092
1185I2011207Q59946P56789O69473N91999N40001N36727N49323N19371M47613L49998
1205.4I7832447K38872J48982R8556P5215O4087M6355o86p8708j59246k07632k12062
1227.8I7846180j90544j71280j65015j52296r5517J1939J39261K57390L43162L80737
1248.2I8204017L66121L13837K51114K03466J86503J88077J72263J31625J12760J36304
1268.6A00266087J57058J51503J38700J17278R5439J19555K03836K88666L09944K63917
$$ plain form
1289 102111983 102298319 102420270 102512550 102586532 102633297 102679145 102774894 102927279 103093731 103243673 103378594
1311.4 103378594 103497648 103587973 103641534 103690243 103782737 103920484 104073620 104210973 104302514 104322350 104253209
1333.9 104253209 104092813 103868532 103664446 103559601 103502715 103410876 103284454 103161836 103060925 102964270
1354.3 102964270 102871621 102806020 102749908 102687418 102660584 102647471 102596152 102490246 102199578 101650429 101167858
1376.7 101167858 101160586 101690137 102474892 103216565 103846741 104378533 104751623 104910553 104951024 105067968
1397.1 105067968 105320966 105686390 106074607 106381178 106506777 106343865 105868196 105239260 104682374 104327726
1417.5 104327726 104328203 104633307 104889178 104901791 104618847 104041696 103373170 102753294 102013636 101292717
1437.9 101292717 100855780 100461686 99987042 99443138 98776180 98002976 97096437 96033484 94766271
$$ packed form
1289A02111983J86336J21951R2280P3982M6765M5848R5749J52385J66452J49942J34921
1311.4A03378594J19054R0325N3561M8709R2494J37747J53136J37353R1541J9836o9141
1333.9A04253209j60396k24281k04086j04845n6886r1839j26422j22618j00911r6655
1354.3A02964270r2649o5601n6112o2490k6834j3113n1319j05906k90668n49149m82571
1376.7A01167858p272N29551P84755P41673O30176N31792L73090J58930M0471J16944
1397.1A05067968K52998L65424L88217L06571J25599j62912m75669o28936n56886l54648
1417.5A04327726M77L05104K55871J2613k82944n77151o68526o19876p39658p20919
1437.9A01292717m36937l94094m74644n43904o66958p73204r06539j062953j267213
$$ plain form
1456.2 94766271 93819916 93629706 93441582 92910558 92981416 94680113 97803193 101583409 104452729
1474.6 104452729 106007528 106955135 107644916 108184195 108567679 108781040 108901000 109084713 109290457
1493 109290457 109331465 109199107 109133315 109269261 109460330 109492147 109436500 109625518 109863818 109973729 109959567
1515.4 109959567 109911966 109880805 109858632 109929645 110033631 110112965 110184693 110175490 110115874 110123539 110055089 109794724
1539.9 109794724 109673500 109781182 109910357 109971797 109972811 109978759 109980190 109903538 109715235 109756696 110012615
1562.3 110012615 110159457 110202587 110199833 110234761 110329342 110331798 110271502 110341454 110447800 110486436 110489166 110492492
1586.8 110492492 110503185 110511220 110503101 110483265 110465062 110439050 110389388 110334349 110299933 110290897 110298967 110318124
1611.3 110318124 110302281 110191381 110091269 110120678 110106039 109999704 109941471 109925520 109929931 109935832 109821641
$$ packed form
1456.2I4766271r46355j90210j88124n31024P0858J698697L123080L780216K869320
1474.6A04452729J554799R47607O89781N39279L83484K13361J19960J83713K05744
1493A09290457M1008j32358o5792J35946J91069L1817n5647J89018K38300J09911j4162
1515.4A09959567m7601l1161k2173P1013J03986P9334P1728r203n9616P665o8450k60365
1539.9A09794724j21224J07682J29175O1440J014N948J431p6652j88303M1461K55919
1562.3A10012615J46842M3130k754L4928R4581K456o0296O9952J06346L8636K730L326
1586.8A10492492J0693Q035q119j9836j8203k6012m9662n5039l4416r036Q070J9157
1611.3A10318124j5843j10900j00112K9409j4639j06335n8233j5951M411N901j14191
$$ plain form
1633.7 109821641 109587288 109525216 109575689 109530294 109349167 109042561 108866358 108879530 108716953 108475673
1654.1 108475673 108586574 108712006 108674037 108537829 108465064 108455443 108370757 108327842 108458686 108640707 108813465
1676.5 108813465 108948648 108965552 108805096 108576429 108531892 108509135 108386004 108202672 107846701 107399416
1696.9 107399416 106953764 106452143 106100333 105733919 105263662 104860449 104473126 103992701 103288674 102189457
1717.3 102189457 101038623 99982625 98595256 96759540 94560051 91930258 88759035 84015059
1733.6 84015059 78728676 74600559 70312715 66338581 63977230 63356429 64633089 68096066 73416680
1752 73416680 79252869 85214555 90936667 95628750 99410474 102150679 103953528 105211568 106088626
1770.3 106088626 106770706 107375252 107858598 108199930 108454502 108671296 108867300 109041309 109178138 109229362
$$ packed form
1633.7A09821641k34353o2072N0473m5395j81127l06606j76203J3172j62577k41280
1654.1A08475673J10901J25432l7969j36208p2765r621q4686m2915J30844J82021J72758
1676.5A08813465J35183J6904j60456k28667m4537k2757j23131j83332l55971m47285
1696.9A07399416m45652n01621l51810l66414m70257m03213l87323m80425p04027j099217
1717.3A02189457j150834j055998j387369j835716k199489k629793l171223m743976
1733.6H4015059n286383m128117m287844l974134k361351o20801J276660L462977N320614
1752G3416680N836189N961686N722112M692083L781724K740205J802849J258040Q77058
1770.3A06088626O82080O04546M83346L41332K54572K16794J96004J74009J36829N1224
$$ plain form
1790.7 109229362 109282196 109421325 109563267 109639192 109687841 109781158 109892285 109972215 110008979 110051501 110121369
1813.2 110121369 110192323 110245728 110297716 110335994 110334814 110331178 110345936 110367191 110430801 110519755 110568309 110600376
1837.6 110600376 110628653 110615385 110570288 110579121 110644817 110704589 110744154 110762751 110770798 110772216 110777652 110786951
1862.1 110786951 110785687 110752654 110709047 110727334 110790610 110830593 110841930 110847962 110849750 110857201 110868227 110864496
1886.6 110864496 110844350 110846901 110871363 110881495 110895109 110915935 110925603 110922730 110914409 110900533 110890758 110897493 110916126
1913.1 110916126 110918772 110891652 110876834 110881102 110883582 110898137 110915804 110916173 110908997 110903263 110902417 110908341 110904443 110883546
1941.7 110883546 110877144 110897517 110918856 110931242 110937417 110942030 110944998 110943222 110937846 110937321 110935283 110919142 110911953
1968.2 110911953 110922432 110929286 110931718 110939193 110945880 110941041 110926354 110913253 110906172 110900342 110889590 110882938 110891318
$$ packed form
1790.7A09229362N2834J39129J41942P5925M8649R3317J11127P9930L6764M2522O9868
1813.2A10121369P0954N3405N1988L8278j180l636J4758K1255O3610Q8954M8554L2067
1837.6A10600376K8277j3268m5097Q833O5696N9772L9565J8597Q047J418N436R299
1862.1A10786951j264l3033m3607J8287O3276L9983J1337O032J788P451J1026l731
1886.6A10864496k0146K551K4462J0132J3614K0826R668k873q321j3876r775O735J8633
1913.1A10916126K646k7120j4818M268K480J4555J7667L69p176n734q46N924l898k0897
1941.7A10883546o402K0373K1339J2386O175M613K968j776n376n25k038j6141p189
1968.2A10911953J0479O854K432P475O687m839j4687j3101p081n830j0752o652Q380
$$ plain form
1994.7 110891318 110901153 110905242 110904062 110895169 110883105 110873628 110870171 110868251 110857987 110836017 110812962 110803199 110805440
2021.2 110805440 110807931 110805440 110802102 110801637 110796869 110787737 110788095 110795379 110798371 110798800 110799229 110803533 110811949 110815084 110815525 110819221
2053.8 110819221 110822940 110828125 110828626 110822856 110824513 110833395 110843229 110846245 110835624 110827303 110835052 110845697 110846937 110844302
2082.4 110844302 110847807 110858774 110869646 110875988 110876286 110873973 110872662 110869896 110868859 110874844 110881209 110882497 110886419 110892165
2110.9 110892165 110892999 110889041 110888410 110896194 110905302 110908556 110901821 110891974 110889554 110894024 110901082 110902584 110895419 110887730 110882854
2141.5 110882854 110880792 110881174 110878623 110870647 110860741 110853148 110850787 110853398 110853219 110848260 110847938 110855365 110863709 110870814 110875213
2172.1 110875213 110874367 110870731 110863793 110856116 110853803 110858059 110860443 110858011 110860419 110868657 110876906 110882974 110888135 110893428
2200.7 110893428 110898006 110899997 110900033 110898900 110895705 110890913 110887814 110890639 110897446 110902727 110901117 110892391 110887218 110892045 110898936
$$ packed form
1994.7A10891318R835M089j180q893j2064r477l457j920j0264k1970k3055r763K241
2021.2A10805440K491k491l338m65m768r132L58P284K992M29TM304Q416L135M41L696
2053.8A10819221L719N185N01n770J657Q882R834L016j0621q321P749J0645J240k635
2082.4A10844302L505J0967J0872O342K98k313j311k766j037N985O365J288L922N746
2110.9A10892165Q34l958o31P784R108L254o735r847k420M470P058J502p165p689m876
2141.5A10882854k062L82k551p976r906p593k361K611j79m959l22P427Q344P105M399
2172.1A10875213q46l636o938p677k313M256K384k432K408Q238Q249O068N161N293
2200.7A10893428M578J991L6j133l195m792l099K825O807N281j610q726n173M827O891
$$ plain form
2231.3 110898936 110899341 110893202 110886145 110882866 110879517 110875762 110879076 110886121 110887253 110884631 110886264 110889566 110890400 110892916 110892832
2261.9 110892832 110888875 110888886 110887682 110885239 110889721 110894489 110891962 110883844 110874164 110869122 110876131 110896087 110920262 110945797
2290.4 110945797 110974717 111003911 111033046 111065125 111102581 111149251 111211288 111295426 111392450 111480856 111559689
2312.9 111559689 111643136 111748588 111892247 112052584 112178218 112269413 112372506 112485361 112563705 112600756
2333.3 112600756 112639093 112696695 112753451 112776554 112695360 112458205 112230563 112235844 112499785 112893736 113261962
2355.7 113261962 113511026 113598239 113543463 113393438 113173592 112889266 112574780 112262130 111953306 111665344
2376.1 111665344 111424553 111227167 111070418 110961306 110889089 110849071 110840189 110836494 110826290 110827160 110835910 110834932
2400.6 110834932 110826135 110821378 110827613 110835588 110830414 110818160 110817838 110826814 110828698 110826123 110830021 110835743 110834634 110832274
$$ packed form
2231.3A10898936M05o139p057l279l349l755L314P045J132k622J633L302Q34K516q4
2261.9A10892832l957J1j204k443M482M768k527q118r680n042P009J9956K4175K5535
2290.4A10945797K8920K9194K9135L2079L7456M6670O2037Q4138R7024Q8406P8833
2312.9A11559689Q3447J05452J43659J60337J25634R1195J03093J12855P8344L7051
2333.3A12600756L8337N7602N6756K3103q1194k37155k27642N281K63941L93951L68226
2355.7A13261962K49064Q7213n4776j50025k19846k84326l14486l12650l08824k87962
2376.1A11665344k40791j97386j56749j09112p2217m0018q882l695j0204Q70Q750r78
2400.6A10834932q797m757O235P975n174j2254l22Q976J884k575L898N722j109k360
$$ plain form
2429.1 110832274 110832167 110833037 110840094 110847712 110847068 110843539 110843563 110848629 110853326 110852277 110852849 110859501 110868168 110869563 110857868
2459.7 110857868 110844195 110841024 110844278 110845065 110847294 110850167 110845613 110838926 110836077 110831869 110824549 110817981 110811436 110802710
2488.3 110802710 110789490 110775423 110775137 110788143 110793054 110781848 110763621 110751176 110750186 110745525 110726547 110706437 110695744
2514.8 110695744 110693002 110689509 110676098 110662103 110661209 110666525 110665202 110657227 110654426 110660362 110665011 110667145 110667396 110659254
2543.3 110659254 110651565 110654581 110653412 110637045 110621667 110620272 110621750 110609472 110587311 110574865 110577726 110583317 110579169
2569.8 110579169 110563028 110542142 110524762 110513663 110506606 110496855 110478938 110457778 110440934 110426724 110416305 110413086
2594.3 110413086 110411310 110402882 110384715 110363615 110344613 110330141 110329044 110333765 110325885 110304499 110279953 110262632
2618.8 110262632 110252953 110242045 110224569 110203052 110182357 110160303 110143650 110143995 110145867 110133576 110120225 110114205
$$ packed form
2429.1A10832274j07Q70P057P618o44l529K4N066M697j049N72O652Q667J395j1695
2459.7A10857868j3673l171L254P87K229K873m554o687k849m208p320o568o545q726
2488.3A10802710j3220j4067k86J3006M911j1206j8227j2445r90m661j8978k0110j0693
2514.8A10695744k742l493j3411j3995q94N316j323p975k801N936M649K134K51q142
2543.3A10659254p689L016j169j6367j5378j395J478j2278k2161j2446K861N591m148
2569.8A10579169j6141k0886j7380j1099p057r751j7917k1160j6844j4210j0419l219
2594.3A10413086j776q428j8167k1100j9002j4472j097M721p880k1386k4546j7321
2618.8A10262632r679j0908j7476k1517k0695k2054j6653L45J872j2291j3351o020
$$ plain form
2643.3 110114205 110107434 110097253 110084689 110064590 110034549 109997797 109961891 109932292 109901488 109866166 109836209 109818423
2667.7 109818423 109805739 109793901 109785104 109770739 109752727 109748757 109768915 109798813 109814835 109829652 109863138 109895587
2692.2 109895587 109913540 109927142 109939635 109956145 109977448 109989774 109982467 109961891 109940612 109921694 109910381 109908533
2716.7 109908533 109897399 109864187 109822166 109783340 109759462 109762061 109777761 109795427 109810889 109821010 109838474 109866631
2741.2 109866631 109889412 109883296 109856677 109848261 109857965 109865010 109864628 109856844 109839118 109807277 109772539 109750688 109733021
2767.7 109733021 109696698 109632671 109554529 109490514 109445167 109390485 109310830 109218156 109117103 108999288 108882511
2790.1 108882511 108782351 108674634 108535719 108387494 108264947 108150840 108005619 107818794 107603335 107379317
2810.5 107379317 107147753 106885362 106573200 106211698 105802894 105329609 104773855 104131472 103382623 102487159
$$ packed form
2643.3A10114205o771j0181j2564k0099l0041l6752l5906k9599l0804l5322k9957j7786
2667.7A09818423j2684j1838q797j4365j8012l970K0158K9898J6022J4817L3486L2449
2692.2A09895587J7953J3602J2493J6510K1303J2326p307k0576k1279j8918j1313j848
2716.7A09908533j1134l3212m2021l8826k3878K599J5700J7666J5462J0121J7464K8157
2741.2A09866631K2781o116k6619q416R704P045l82p784j7726l1841l4738k1851j7667
2767.7A09733021l6323o4027p8142o4015m5347n4682p9655r2674j01053j17815j16777
2790.1A08882511j00160j07717j38915j48225j22547j14107j45221j86825k15459k24018
2810.5A07379317k31564k62391l12162l61502m08804m73285n55754o42383p48849q95464
$$ plain form
2830.9 102487159 101399863 100026774 98182297 95634365 92140436 87533218 81940246 75891578
2847.2 75891578 70232207 65978420 64033741 64722431 67597282 71727955 76131880 80051881 83037221
2865.6 83037221 84982234 86200559 87276238 88597488 90049636 91214752 91794503 91768074 91247356
2883.9 91247356 90342164 89141792 87735772 86201143 84592706 82942086 81228983 79402196 77421886
2902.3 77421886 75234115 72757846 69905627 66594380 62796372 58604240 54267806 50206685
2918.6 50206685 46916157 44801578 44039851 44567567 46175471 48618937 51746058 55444211 59501427
2937 59501427 63624197 67518181 70924801 73632634 75500017 76538181 76990753 77262336 77743977
2955.3 77743977 78695875 80205101 82221121 84623110 87232488 89838672 92272764 94431329 96270502
$$ packed form
2830.9A02487159j087296j373089j844477k547932l493929m607218n592972o048668
2847.2G5891578n659371m253787j944679O88690K874851M130673M403925L920001K985340
2865.6H3037221J945013J218325J075679J321250J452148J165116N79751k6429n20718
2883.9I1247356r05192j200372j406020j534629j608437j650620j713103j826787j980310
2902.3G7421886k187771k476269k852219l311247l798008m192132m336434m061121
2918.6E0206685l290528k114579p61727N27716J607904K443466L127121L698153M057216
2937E9501427M122770L893984L406620K707833J867383J038164M52572K71583M81641
2955.3G7743977R51898J509226K016020K401989K609378K606184K434092K158565J839173
$$ plain form
2973.7 96270502 97814053 99107903 100175929 101055872 101798594 102420592 102916110 103270423 103470182
2992 103470182 103503704 103319025 102874815 102186990 101317489 100419724 99715257 99394631 99569839 100257480
3012.4 100257480 101348436 102635098 103915560 105050552 105962145 106659102 107202065 107611597 107897472
3030.8 107897472 108100605 108273160 108435094 108543193 108591223 108637011 108715296 108807361 108871567 108926404 108999884
3053.2 108999884 109061933 109116626 109184754 109232318 109232891 109219682 109250736 109334970 109426916 109481835 109483278 109465790
3077.7 109465790 109480274 109532166 109593558 109645844 109680140 109701872 109739780 109789908 109817564 109815776 109811330 109825289
3102.2 109825289 109835732 109808695 109767866 109770286 109792852 109778345 109750187 109747088 109783113 109865868 109948373 109969449
3126.6 109969449 109951150 109954596 109985614 110005093 109982598 109940672 109939420 109982908 110019958 110026336 110001886 109959781
$$ packed form
2973.7I6270502J543551J293850J068026Q79943P42722O21998M95518L54313J99759
2992A03470182L3522j84679m44210o87825q69501q97765p04467l20626J75208O87641
3012.4A00257480J090956J286662J280462J134992R11593O96957N42963M09532K85875
3030.8A07897472K03133J72555J61934J08099M8030M5788P8285R2065O4206N4837P3480
3053.2A08999884O2049N4693O8128M7564N73j3209L1054Q4234R1946N4919J443j7488
3077.7A09465790J4484N1892O1392N2286L4296K1732L7908N0128K7656j788m446J3959
3102.2A09825289J0443k7037m0829K420K2566j4507k8158l099L6025Q2755Q2505K1076
3126.6A09969449j8299L446L1018J9479k2495m1926j252M3488L7050O378k4450m2105
$$ plain form
3151.1 109959781 109951448 109995461 110042787 110072124 110096204 110112250 110113132 110105801 110100293 110096657 110097182 110097241 110090888 110089302
3179.7 110089302 110100496 110122871 110138500 110126925 110110080 110118759 110147631 110172379 110181129 110177732 110168993 110166991
3204.1 110166991 110175753 110188568 110193515 110186863 110183334 110186172 110192716 110209429 110226774 110230827 110232711 110235810 110207820
3230.7 110207820 110159492 110161412 110211158 110245812 110253119 110237646 110193336 110157990 110177970 110219038 110224080 110212362
3255.1 110212362 110228801 110258508 110271811 110273206 110263038 110224175 110162103 110129404 110144949 110174286 110201883 110218275
3279.6 110218275 110219896 110217881 110214293 110198581 110154080 110094094 110064781 110089278 110147178 110185075 110155618 110071945
3304.1 110071945 110001063 110005772 110079443 110154736 110196686 110218322 110223734 110213912 110185874 110141933 110131228 110167491
3328.6 110167491 110194921 110193276 110167336 110108697 110058987 110061264 110091209 110125375 110135400 110095549 110066295 110098493
$$ packed form
3151.1A09959781q333M4013M7326K9337K4080J6046Q82p331n508l636N25N9o353j586
3179.7A10089302J1194K2375J5629j1575j6845Q679K8872K4748Q750l397q739k002
3204.1A10166991Q762J2815M947o652l529K838O544J6713J7345M053J884L099k7990
3230.7A10207820m8328J920M9746L4654P307j5473m4310l5346J9980M1068N042j1718
3255.1A10212362J6439K9707J3303J395j0168l8863o2072l2699J5545K9337K7597J6392
3279.6A10218275J621k015l588j5712m4501n9986k9313K4497N7900L7897k9457q3673
3304.1A10071945p0882M709P3671P5293M1950K1636N412r822k8038m3941j0705L6263
3328.6A10167491K7430j645k5940n8639m9710K277K9945L4166J0025l9851k9254L2198
$$ plain form
3353 110098493 110143352 110148036 110122430 110095453 110058594 109991777 109924102 109913743 109976864 110049522 110077226 110092247
3377.5 110092247 110120940 110150278 110168529 110167789 110133672 110055757 110001588 110034418 110079432 110049009 109983575 109990406
3402 109990406 110069358 110112798 110095704 110070813 110063016 110081291 110118592 110138285 110128045 110109985 110088253 110051560
3426.5 110051560 109992790 109936166 109903085 109869707 109858358 109911239 109981453 110005069 109980798 109944618 109927320
3448.9 109927320 109920585 109901810 109869254 109825325 109777498 109749794 109722996 109636617 109525132 109527957 109670246
3471.3 109670246 109805477 109845877 109807634 109771848 109840930 109936559 109950638 109964192 110021508 110039568 109996343
3493.8 109996343 109941435 109907687 109870780 109815872 109832811 109910631 109929347 109886110 109821141 109778750 109792376
3516.2 109792376 109809899 109767818 109679341 109632111 109661233 109702981 109722173 109716070 109683967 109665930 109687304 109700322
$$ packed form
3353A10098493M4859M684k5606k6977l6859o6817o7675j0359O3121P2658K7704J5021
3377.5A10092247K8693K9338J8251p40l4117p7915n4169L2830M5014l0423o5434O831
3402A09990406P8952M3440j7094k4891p797J8275L7301J9693j0240j8060k1732l6693
3426.5A10051560n8770n6624l3081l3378j1349N2881P0214K3616k4271l6180j7298
3448.9A09927320o735j8775l2556m3929m7827k7704k6798q6379j11485K825J42289
3471.3A09670246J35231M0400l8243l5786O9082R5629J4079J3554N7316J8060m3225
3493.8A09996343n4908l3748l6907n4908J6939P7820J8716m3237o4969m2391J3626
3516.2A09792376J7523m2081q8477m7230K9122M1748J9192o103l2103j8037K1374J3018
$$ plain form
3540.7 109700322 109676611 109670889 109739542 109842861 109902835 109946477 110025907 110090256 110100162 110102403 110125077 110133421
3565.1 110133421 110153437 110246038 110357130 110427189 110476434 110525072 110546613 110531890 110485375 110436654 110466135
3587.6 110466135 110544574 110566723 110549319 110535800 110521734 110534847 110604560 110676193 110709167 110733306 110757256
3610 110757256 110766172 110780525 110801923 110815024 110865128 110961926 111022139 110989761 110931361 110984719 111081815 111124265
3634.5 111124265 111118829 111095572 111081338 111061597 110998142 110882294 110784447 110838246 110975528 111050844 111058939
3656.9 111058939 111071575 111122012 111186779 111203253 111142135 111060369 111031461 111010921 110989344 111048722 111145806
3679.4 111145806 111217117 111247480 111215997 111110139 111050963 111166966 111316657 111390650 111420536 111424911 111405480
3701.8 111405480 111404335 111413932 111374152 111297679 111276937 111324573 111369061 111383224 111381900 111379623 111389053 111432290
$$ packed form
3540.7A09700322k3711n722O8653J03319N9974M3642P9430O4349R906K241K2674Q344
3565.1A10133421K0016R2601J11092P0059M9245M8638K1541j4723m6515m8721K9481
3587.6A10466135P8439K2149j7404j3519j4066J3113O9713P1633L2974K4139K3950
3610A10757256Q916J4353K1398J3101N0104R6798O0213l2378n8400N3358R7096M2450
3634.5A11124265n436k3257j4234j9741o3455j15848r7847N3799J37282P5316Q095
3656.9A11058939J2636N0437O4767J6474o1118q1766k8908k0540k1577N9378R7084
3679.4A11145806P1311L0363l1483j05858n9176J16003J49691P3993K9886M375j9431
3701.8A11405480j145R597l9780p6473k0742M7636M4488J4163j324k277R430M3237
$$ plain form
3726.3 111432290 111476827 111448836 111329460 111204326 111185718 111235642 111258459 111246324 111240983 111247194 111229432
3748.7 111229432 111218917 111271513 111325884 111330986 111328900 111368859 111405301 111397469 111375260 111372268 111418998 111486518
3773.2 111486518 111497831 111437309 111388636 111417484 111449218 111455166 111472714 111486268 111491764 111487877 111461389 111428678
3797.7 111428678 111383724 111341524 111350167 111379445 111424685 111474526 111481988 111450005 111395502 111326301 111270487 111288452
3822.1 111288452 111356413 111406624 111443520 111470759 111464214 111398435 111305642 111278129 111337674 111412597 111461639 111486161
3846.6 111486161 111477101 111422992 111365843 111391699 111467433 111514735 111511672 111478055 111463511 111462784 111430001 111405444
3871.1 111405444 111433518 111487639 111517978 111488938 111459064 111454594 111453235 111490297 111521435 111523092 111555529 111584532
3895.5 111584532 111543262 111460602 111412013 111433613 111508358 111576438 111616337 111636877 111631238 111599505 111576605 111602664
$$ packed form
3726.3A11432290M4537k7991j19376j25134j8608M9924K2817j2135n341O211j7762
3748.7A11229432j0515N2596N4371N102k086L9959L6442p832k2209k992M6730O7520
3773.2A11486518J1313o0522m8673K8848L1734N948J7548J3554N496l887k6488l2711
3797.7A11428678m4954m2200Q643K9278M5240M9841P462l1983n4503o9201n5814J7965
3822.1A11288452O7961N0211L6896K7239o545o5779r2793k7513N9545P4923M9042K4522
3846.6A11486161r060n4109n7149K5856P5734M7302l063l3617j4544p27l2783k4557
3871.1A11405444K8074N4121L0339k9040k9874m470j359L7062L1138J657L2437K9003
3895.5A11584532m1270q2660m8589K1600P4745O8080L9899K0540n639l1733k2900K6059
$$ plain form
3920 111602664 111640298 111642456 111634302 111628914 111615467 111614501 111631966 111648560 111656833 111649299 111630011 111626673 111639059
3946.5 111639059 111638284 111634696 111642706 111649179 111656845 111664975 111666667 111661506 111652613 111657965 111680233 111690378 111679852 111666250
3975.1 111666250 111658394 111662853 111670160 111667204 111672735 111701560 111722374 111708605 111686134 111682796 111690879
3997.5 111690879
$$ packed form
3920A11602664L7634K158q154n388j3447r66J7465J6594Q273p534j9288l338J2386
3946.5A11639059p75l588Q010O473P666Q130J692n161q893N352K2268J0145j0526j3602
3975.1A11666250p856M459P307k956N531K8825K0814j3769k2471l338Q083
3997.5A11690879
##END=$$ End of the data block
