##TITLE=$$ Begin of the data block
##JCAMP-DX=5.00 $$ ACD/SpecManager v 10.08
##SPECTROMETER/DATA SYSTEM=Alpha
##DATE=27 Jun 2014 15:13:00
##DATA TYPE=INFRARED SPECTRUM
##DATA CLASS=XYDATA
##ORIGIN=
##OWNER=
##NPOINTS=1667
##FIRSTX=599.63549805
##LASTX=3997.56909180
##MAXX=3997.56909180
##MINX=599.63549805
##MAXY=1.14026165
##MINY=0.34050760
##XFACTOR=1.0000000000
##YFACTOR=0.000000010000000
##FIRSTY=1.03515816
##DELTAX=2.03957605
##XUNITS=1/CM
##YUNITS=ARBITRARY UNITS
##XYDATA=(X++(Y..Y))
599.6A03515816n389J47474J49143R2685Q5056J39177J99592J97732J42777Q2422M5073
622.1A04791558L5250K6786K4605M7279M6789J300o0559q3697l0064L9267L6979k2197
646.5A04853296n4466m5336m3857o3705p5138j04463j91903k56658j53255Q654j50764
669A03722405l58057k83181k46835k68817k74706k79629k61331k12979j93572k14636
689.4A01128662k31791k28882k49970l10445m07075n62966q13800j147908j428086
707.7I5747739j450396j179486q73709p37178o45268l57151J87421P85601J161683
726.1I2639256J227301J114535J010192R65434R17059Q43364P54225O35350N32913
744.4A00639629N23425N42998N16951M53901L21818J57547Q6414J27626K27272K99418
$$ y = [103515816, 103510427, 103657901, 103807044, 103899729, 103984785, 104123962, 104323554, 104521286, 104664063, 104746485, 104791558, 104826808, 104853594, 104878199, 104925478, 104972267, 104973567, 104913008, 104829311, 104799247, 104838514, 104875493, 104853296, 104798830, 104753494, 104709637, 104645932, 104570794, 104466331, 104274428, 104017770, 103864515, 103873169, 103722405, 103364348, 103081167, 102834332, 102565515, 102290809, 102011180, 101749849, 101536870, 101343298, 101128662, 100896871, 100667989, 100418019, 100107574, 99700499, 99137533, 98323733, 97175825, 95747739, 94297343, 93117857, 92244148, 91506970, 90861702, 90504551, 90691972, 91477573, 92639256, 93866557, 94981092, 95991284, 96956718, 97873777, 98717141, 99471366, 100106716, 100639629, 101163054, 101706052, 102223003, 102676904, 102998722, 103156269, 103242683, 103370309, 103597581, 103896999]
764.8A03896999K59376J70720J34444J47652J71423J73748J51765J42551J51407J52016
785.2A05552101J29116Q7988O8593N6625K2625k312r847k7025p7712j36507j31845
807.7A05531800o8629o1655j08731j00028o7985o5673k5427N3024O1405j4365j01232
830.1A05032504j68753j96278j61123r8122p0691q5509p6007j2172N0521P6986Q4304
852.5A04375660P0548K2007k7621n1582p2348j04523j43874j86038k14195j99997j26171
875A03341866j7906N5325P6557R1099J15359J36411J18316L4332j07086l05414l97968
897.4A03140891k22040j5747M8745P4028L8183n6457j01924q4234m9865l6824q4674
919.8A02650082j98686k80023k17735k9207J81687K68805J55223k0719o0046L8064
$$ y = [103896999, 104156375, 104327095, 104461539, 104609191, 104780614, 104954362, 105106127, 105248678, 105400085, 105552101, 105681217, 105769205, 105837798, 105894423, 105917048, 105914736, 105904889, 105877864, 105800152, 105663645, 105531800, 105463171, 105401516, 105292785, 105192757, 105124772, 105059099, 105033672, 105086696, 105148101, 105133736, 105032504, 104863751, 104667473, 104506350, 104408228, 104337537, 104252028, 104176021, 104163849, 104214370, 104291356, 104375660, 104446208, 104468215, 104440594, 104389012, 104316664, 104212141, 104068267, 103882229, 103668034, 103468037, 103341866, 103323960, 103379285, 103455842, 103546941, 103662300, 103798711, 103917027, 103951359, 103844273, 103538859, 103140891, 102918851, 102903104, 102951849, 103025877, 103064060, 103007603, 102905679, 102821445, 102771580, 102734756, 102650082, 102451396, 102171373, 101953638, 101924431, 102106118, 102374923, 102530146, 102509427, 102449381, 102487445]
940.2A02487445J15418R9194K2722o4421j27351j79577k10571j81377j14263m4357
960.6A01802862J3387K1875j7762o4290j04535j58500k24316k02179n1987P0488Q5008
983.1A01170051R8896J49346J74295J43016O5660q189m2606p7247j40977j96278k30742
1005.5A01105225k74610k65015r6345P1311J610j94800k69783j98191j24711j13338
1025.9I9641353r2179k0146K5177l0315j96296m92191q47680r37312n22346L9590L02970
1048.3I6870625L46553L45910K94328J98686J11526O8659O7460P2628M3351k8920j20265
1070.8I8270541k21186l59261n47928p47782q92031r39405r17286q87233q79943q80206
1091.2I0998280q50439p50941n55676k85232q428K12806L37893L16298J29694j37079
$$ y = [102487445, 102602863, 102702057, 102724779, 102660358, 102533007, 102353430, 102142859, 101961482, 101847219, 101802862, 101816249, 101838124, 101820362, 101756072, 101651537, 101493037, 101268721, 101066542, 101014555, 101085043, 101170051, 101268947, 101418293, 101592588, 101735604, 101801264, 101793075, 101750469, 101673222, 101532245, 101335967, 101105225, 100830615, 100565600, 100469255, 100540566, 100542176, 100347376, 100077593, 99879402, 99754691, 99641353, 99549174, 99529028, 99554205, 99523890, 99327594, 98835403, 97987723, 97050411, 96528065, 96567655, 96870625, 97217178, 97563088, 97857416, 98056102, 98167628, 98236287, 98303747, 98376375, 98419726, 98390806, 98270541, 98049355, 97690094, 97142166, 96394384, 95502353, 94562948, 93645662, 92758429, 91878486, 90998280, 90147841, 89396900, 88841224, 88555992, 88547564, 88760370, 89098263, 89414561, 89544255, 89407176]
1111.6H9407176l40116l65401j71899J71107N01090O41692M61757j4085n27513r03570
1132H8860238j286579j716774j946938j851946j567412j277739j079160r87851r80753
1150.3G6165086j011658j019066r44835p72041n32276k88367r3609N1439J75327L06880
1170.7G2036880M96531P60776R99403J163035J296950J353079J282948J156306J041627
1189.1H1587535R29701Q19505P63494P77685Q01236P74157O80560N29652L57843K17545
1209.5H8238913J35654J00189Q8645O5231m363j13291k27976l03024l01391k50291
1229.9H7428296k25526k41298k33054j42616J9008K04152L83138N25958N94872N68539
1250.3H8881469M77397L78341L14772K98530K93129K62833K20490J95759K06310K41339
$$ y = [89407176, 89067060, 88701659, 88529760, 88700867, 89201957, 89843649, 90305406, 90291321, 89763808, 88860238, 87573659, 85856885, 83909947, 82058001, 80490589, 79212850, 78133690, 77145839, 76165086, 75153428, 74134362, 73189527, 72417486, 71885210, 71596843, 71503234, 71554673, 71730000, 72036880, 72533411, 73294187, 74293590, 75456625, 76753575, 78106654, 79389602, 80545908, 81587535, 82517236, 83336741, 84100235, 84877920, 85679156, 86453313, 87133873, 87663525, 88021368, 88238913, 88374567, 88474756, 88563401, 88628632, 88624269, 88510978, 88283002, 87979978, 87678587, 87428296, 87202770, 86961472, 86728418, 86585802, 86604810, 86808962, 87192100, 87718058, 88312930, 88881469, 89358866, 89737207, 90051979, 90350509, 90643638, 90906471, 91126961, 91322720, 91529030, 91770369]
1270.6I1770369K48319K14618J71560J39529J69259L01158M52996M96590M19104L00008
1291I4683510K11889J66416J23620P7706Q9229J73312K56497K73007K42674K26200
1311.4I6524060K11113J62101J10942J04064J47438K08789K41089K20263J47075L5017
1331.8I8111951q1962j78510k51967k91460k54035j79518j54942j75863j90610j80966
1352.2I6172118j74296j67972j07699j3364N651o2847j04189r7841j30922l53002p67392
1374.7I4198245q13931j24366P63315J204855J215988J112503Q59904N32741L47793
1393I9297047K47705K27958L41075M75014N57053N11813J91736k77841p47681j009637
1413.4I9814242q52096l65919J75911L91585K80327m1759m68052q81237j099461j019931
$$ y = [91770369, 92018688, 92233306, 92404866, 92544395, 92713654, 93014812, 93467808, 93964398, 94383502, 94683510, 94895399, 95061815, 95185435, 95263141, 95352370, 95525682, 95782179, 96055186, 96297860, 96524060, 96735173, 96897274, 97008216, 97112280, 97259718, 97468507, 97709596, 97929859, 98076934, 98111951, 98029989, 97851479, 97599512, 97308052, 97054017, 96874499, 96719557, 96543694, 96353084, 96172118, 95997822, 95829850, 95722151, 95708787, 95714438, 95651591, 95547402, 95449561, 95318639, 94965637, 94198245, 93384314, 93259948, 94023263, 95228118, 96444106, 97556609, 98416513, 98949254, 99297047, 99544752, 99772710, 100113785, 100588799, 101145852, 101657665, 101849401, 101571560, 100823879, 99814242, 98962146, 98596227, 98772138, 99163723, 99444050, 99402291, 98934239, 98053002, 96953541, 95933610]
1433.8I5933610j003027j039856q51143p34454p33644p49093q98296j164293j424599
1452.2H7335205j511866j412833j031988o03134n84954p17795P7611K193672M580438
1470.5H8324356O124955M729045K391678J392078J065720Q84759P09200O05762N06806
1488.9A06734359K93029J22940Q8477r954j45578J9205L36611O03819N64062R8753
1509.3A08705723m4584M1556J22249J27388J02734P2014k3031n6362m4405l0435J5986
1531.7A08988833j4305o7269K0468P9119j15132k46096k15924j25563l5477L6288J27422
1554.1A08432364K29645K85685R954j64830m9496O4707J33359R4783K1744N8925N4253
1576.6A09171093n6553p0560l2509L338M2820O4314M8637K0575p593n0438q2445r1743
$$ y = [95933610, 94930583, 93890727, 93039584, 92305130, 91571486, 90822393, 89924097, 88759804, 87335205, 85823339, 84410506, 83378518, 82775384, 82190430, 81472635, 81550246, 83743918, 88324356, 94449311, 99178356, 101570034, 102962112, 104027832, 104912591, 105621791, 106227553, 106734359, 107027388, 107150328, 107238805, 107228851, 107083273, 107102478, 107439089, 108042908, 108606970, 108705723, 108661139, 108702695, 108824944, 108952332, 109055066, 109127080, 109104049, 109047687, 109003282, 108972847, 108988833, 108974528, 108907259, 108927727, 109006846, 108891714, 108645618, 108429694, 108304131, 108268654, 108304942, 108432364, 108662009, 108947694, 108957648, 108792818, 108743322, 108808029, 108941388, 109036171, 109057915, 109116840, 109171093, 109114540, 109043980, 109011471, 109014809, 109057629, 109121943, 109170580, 109191155, 109183562, 109133124, 109050679, 108958936]
1601.1A08958936p9537m4214O771J7559r382O80K8908n2523j42646j04118j02615j50204
1625.5A08327615j51658j26970p2431J0931m1628k42173k89560k49743j81830j41728
1645.9A06840825j93107j60122o0916k41458l88682k82967j92321j72865j64199j6284
1666.3A04967904K09391L45695L45838M13418L70228J84286J05095O5446j93811m78088
1686.7A06335402n28920n75042m88317l85570l81697m97174p62975p86126p37262q24964
1707.1A00367355p68375o36423n87183p27999j324922j875967j962435k239072k689451
1725.5H7555528l066379l527063m010552n405313o041444m817849m513776l925431
1741.8E2247721k377418p33319J127380L446037N449778O176114O950015P338762O477136
$$ y = [108958936, 108879399, 108835185, 108841956, 108859515, 108850133, 108850813, 108879721, 108827198, 108684552, 108580434, 108477819, 108327615, 108175957, 108048987, 107976556, 107987487, 107945859, 107703686, 107414126, 107164383, 106982553, 106840825, 106647718, 106487596, 106426680, 106185222, 105796540, 105513573, 105321252, 105148387, 104984188, 104967904, 105177295, 105522990, 105868828, 106282246, 106652474, 106836760, 106941855, 107007301, 106813490, 106335402, 105806482, 105231440, 104743123, 104357553, 103975856, 103478682, 102715707, 101929581, 101192319, 100367355, 99598980, 98962557, 98375374, 97647375, 96322453, 94446486, 92484051, 90244979, 87555528, 84489149, 80962086, 76951534, 71546221, 65504777, 60686928, 56173152, 52247721, 49870303, 49136984, 50264364, 53710401, 59160179, 65336293, 72286308, 79625070, 86102206]
1760.1H6102206N617254M182369K823311K174115J680672J308251Q78620N57971M92764
1778.5A05817533M66978L73876L17204K70176K55799K77925K50888J40917J10114J47617
1798.9A08429027J41382R6607P6664J05571J14811J00696P2181P4637Q4460P8666Q2421
1821.3A09457123J01292J00053Q1301Q0108K5690M160L7420M7183M3547Q0741R9063
1843.8A10157681K9516j6940j2481M935J6225K2625K2042K1768K6321M4549O1428M0877
1868.2A10418546k1374m5121p426J1801R716J4090K4915K5153L3629M3845J4365j1647
1892.7A10510492m601L755P141J4734R847P605J8072J8239Q82j669J9253K5379N591
1919.2A10634720k026l743k1673j3196O568P880N555Q667J2254K5249L6287Q142j9407
$$ y = [86102206, 91719460, 95901829, 98725140, 100899255, 102579927, 103888178, 104766798, 105324769, 105817533, 106284511, 106658387, 106975591, 107245767, 107501566, 107779491, 108030379, 108171296, 108281410, 108429027, 108570409, 108667016, 108743680, 108849251, 108964062, 109064758, 109136939, 109211576, 109296036, 109374702, 109457123, 109558415, 109658468, 109739769, 109819877, 109845567, 109849727, 109887147, 109934330, 109977877, 110058618, 110157681, 110187197, 110170257, 110157776, 110162711, 110178936, 110201561, 110223603, 110245371, 110271692, 110316241, 110377669, 110418546, 110397172, 110352051, 110344625, 110356426, 110366142, 110380232, 110405147, 110430300, 110463929, 110507774, 110522139, 110510492, 110505891, 110509646, 110516787, 110531521, 110541368, 110548973, 110567045, 110585284, 110586166, 110584497, 110603750, 110629129, 110634720, 110632694, 110628951, 110607278, 110594082, 110600650, 110608530, 110614085, 110622752, 110635006, 110660255, 110696542, 110704684, 110685277]
1945.7A10685277j7524m995J2207K3902J6439M887M447Q571J8668J6844n412j4531
1970.2A10748780l040N066Q440P367K289J169Q356J7774J7977J1289l636j1909l361
1996.7A10806561J180l529o461j288K695l493o092m554n698o282j0324j1992n961k515
2025.3A10742247o950p379J2R096K0635K1899J1718J3089K0444J5450O890O998J3149
2051.8A10867298J8799J7345J3316J6558J9383J5319N650m89M912J3757J9955J8644
2076.3A11030447J3197J2886J3054J1504J5676K0098J7464J3936J1337P880J0168J1492
2100.7A11189139M232N340J3101J4210J4639J4818R572N377Q356J6773J9920J1682
2125.2A11327159O867J0657K873j3924j3637o32O449M697K241j919r191q035n24K289
$$ y = [110685277, 110667753, 110662758, 110674965, 110698867, 110715306, 110720193, 110724640, 110733211, 110751879, 110768723, 110763311, 110748780, 110745740, 110750806, 110759246, 110766613, 110768902, 110770071, 110778427, 110796201, 110814178, 110825467, 110821831, 110809922, 110806561, 110807741, 110804212, 110797751, 110796463, 110799158, 110795665, 110789573, 110785019, 110779321, 110773039, 110762715, 110750723, 110744762, 110742247, 110735297, 110727918, 110727930, 110737026, 110757661, 110779560, 110791278, 110804367, 110824811, 110840261, 110847151, 110854149, 110867298, 110886097, 110903442, 110916758, 110933316, 110952699, 110968018, 110973668, 110973179, 110978091, 110991848, 111011803, 111030447, 111043644, 111056530, 111069584, 111081088, 111096764, 111116862, 111134326, 111148262, 111159599, 111167479, 111177647, 111189139, 111193371, 111198711, 111211812, 111226022, 111240661, 111255479, 111265051, 111270428, 111278784, 111295557, 111315477, 111327159, 111334026, 111344683, 111347556, 111333632, 111319995, 111319363, 111325812, 111330509, 111332750, 111330831, 111321640, 111313605, 111313081, 111315370]
2153.8A11315370j55P27P498J5020J2970M089R6K229J0371J4794Q190K217O914J0157
2182.3A11410487N448J359K479N889O783O986J2648K1553J4663j777o795l659L910
2208.8A11479974J3351J3447L898k825j729K766K754m208p522L075J1230L922o533
2235.4A11511600j2255r477o485n591N341J1933M029k694o879j1479j3543q428R811
2261.9A11465883J5819j847r120k74Q738J2124J811j1789j6570j2386M05R620R263
2288.4A11471677R250J6273K5272L0839L3629L1340L3248N2988P5674Q6010R2733Q9490
2312.9A12048423P6533Q6629J22917J48606J34969J08969J10734J14202P7212L1054
2333.3A13060248K9015N4241O5291L0422o3193k17521k50149m3941K30957L92246L72255
$$ y = [111315370, 111315215, 111315942, 111323440, 111338460, 111351430, 111355519, 111355615, 111357844, 111368215, 111383009, 111391199, 111393416, 111400330, 111410487, 111415935, 111417294, 111419773, 111425662, 111432445, 111439431, 111452079, 111473632, 111488295, 111486518, 111479723, 111476064, 111479974, 111493325, 111506772, 111510670, 111507845, 111506116, 111508882, 111511636, 111507428, 111499906, 111502981, 111514211, 111518133, 111511600, 111499345, 111489868, 111483383, 111477792, 111483133, 111495066, 111499095, 111496401, 111489522, 111478043, 111464500, 111456072, 111465883, 111481702, 111479855, 111470735, 111470461, 111479199, 111491323, 111493134, 111481345, 111464775, 111452389, 111452794, 111462414, 111471677, 111480927, 111497200, 111522472, 111553311, 111586940, 111618280, 111651528, 111704516, 111780190, 111866200, 111958933, 112048423, 112124956, 112211585, 112334502, 112483108, 112618077, 112727046, 112837780, 112951982, 113029194, 113060248, 113089263, 113143504, 113208795, 113239217, 113176024, 112958503, 112708354, 112664413, 112895370, 113287616, 113659871]
2355.7A13659871K56359J09935k9683j36721k17498k76315l09109k97690k58100k42782
2376.1A12258267k39706k06565j51361r7453n8961l9315j7190L600j669q881m423m220
2400.6A11432123o20P534J1075M828l183p15K169P16O19j788l218L290J2600J4746
2429.1A11480176K730p093k3R298R751K539q416r727N865J5986M923q929j0848m053
2457.7A11482179M149J549q475p296K682N984J55l778n329r906j3936j5724j0967o0
2486.2A11421227K492o163j2136j2886j3197j2195o389j944r930k2077k3616j3756
2510.7A11289430q083j5235k1672k3544k4652j7095p033q643j7130j4889m435k992
2535.2A11124027l624j574l409k670K276k098j3542j2135l517l087j1957k0230j6057
$$ y = [113659871, 113916230, 114026165, 113996482, 113859761, 113642263, 113365948, 113056839, 112759149, 112501049, 112258267, 112018561, 111811996, 111660635, 111563182, 111504221, 111464906, 111447716, 111451316, 111449647, 111440766, 111436343, 111432123, 111431503, 111439037, 111450112, 111454940, 111451757, 111451042, 111453211, 111453927, 111454546, 111452758, 111449540, 111452830, 111465430, 111480176, 111482906, 111475813, 111475790, 111485088, 111494839, 111497378, 111488962, 111479235, 111485100, 111501086, 111506009, 111497080, 111486232, 111482179, 111486328, 111487877, 111479402, 111472106, 111474788, 111480772, 111480927, 111477149, 111471820, 111461914, 111447978, 111432254, 111421287, 111421227, 111423719, 111417556, 111405420, 111392534, 111379337, 111367142, 111360753, 111358809, 111348879, 111326802, 111303186, 111289430, 111281347, 111266112, 111244440, 111220896, 111196244, 111179149, 111172116, 111163473, 111146343, 111131454, 111127019, 111124027, 111120403, 111118829, 111115420, 111112750, 111115026, 111112928, 111099386, 111087251, 111083734, 111080647, 111068690, 111048460, 111032403]
2561.7A11032403j3066j9073k3258k5272k3365k1589k4784k8014k7907j8370j1075
2584.1A10796630k3889l8815l3664k3294k0134j6404j6474k2412k6762k9767k9766
2606.6A10515249k3234j7297k1923k7430k0170k1029l9208m8089m4286l7789l1615
2629A10183179l1232k9386k1171j7512j6105p963m530j5259k7347k8598l1900m4501
2653.5A09907675n0867m4226m4346o5637p4649n7435m0066k7037j3876q797j7727k4497
2677.9A09438515n281K7823L7515L2008L8016M3738M2045M0638L5274K6894K1780J7082
2702.4A09796047J2291M720q332j8967k5594l1256k9266l1746m9555o2013o0439l5560
2726.9A09460330N209K1971J5306J0252J8323L5643L5739J3852o175j1527j323J4162
$$ y = [111032403, 111019337, 111000264, 110977006, 110951734, 110928369, 110906780, 110881996, 110853982, 110826075, 110807705, 110796630, 110772741, 110733926, 110700262, 110676968, 110656834, 110640430, 110623956, 110601544, 110574782, 110545015, 110515249, 110492015, 110474718, 110452795, 110425365, 110405195, 110384166, 110344958, 110296869, 110252583, 110214794, 110183179, 110151947, 110122561, 110101390, 110083878, 110067773, 110059810, 110055280, 110040021, 110012674, 109984076, 109952176, 109907675, 109856808, 109812582, 109768236, 109702599, 109627950, 109570515, 109530449, 109503412, 109489536, 109480739, 109463012, 109438515, 109433234, 109461057, 109498572, 109530580, 109568596, 109612334, 109654379, 109695017, 109730291, 109757185, 109778965, 109796047, 109808338, 109813058, 109804726, 109785759, 109760165, 109728909, 109699643, 109667897, 109618342, 109556329, 109495890, 109460330, 109465539, 109487510, 109502816, 109513068, 109531391, 109567034, 109602773, 109616625, 109610450, 109598923, 109597600, 109611762]
2751.4A09611762Q392j7691k7358k3568k7585l4022l8112m9734p0583r0158j06097
2773.8A09135246j06096j06978j33837j56951j59788j72770j99508j98389j76978j91438
2794.2A07532513k37357k51425k30956k37477k75600l09360l43036l78239m10009m56357
2814.6A04402697n20909n98705o86872p90035r09674j046616j214403j413131j676691
2832.9I5545661k090716k728456l631514m796529o038207o923795p016373o132406
2849.3E6187665m334944j915514O05213K709097M072779M604715M373181L538043K428263
2867.6G2268498J563448J363223J690633J917213J600533Q50410J7786o81025j204878
2886G9385841j575232j813119j943493j994097k012432k052832k123028k217370k367008
$$ y = [109611762, 109620154, 109602463, 109575105, 109551537, 109523952, 109489930, 109451818, 109402084, 109331501, 109241343, 109135246, 109029150, 108922172, 108788335, 108631384, 108471596, 108298826, 108099318, 107900929, 107723951, 107532513, 107295156, 107043731, 106812775, 106575298, 106299698, 105990338, 105647302, 105269063, 104859054, 104402697, 103881788, 103283083, 102596211, 101806176, 100896502, 99849886, 98635483, 97222352, 95545661, 93454945, 90726489, 87094975, 82298446, 76260239, 69336444, 62320071, 56187665, 51852721, 49937207, 50542420, 53251517, 57324296, 61929011, 66302192, 69840235, 72268498, 73831946, 75195169, 76885802, 78803015, 80403548, 81253958, 81271744, 80590719, 79385841, 77810609, 75997490, 74053997, 72059900, 70047468, 67994636, 65871608, 63654238, 61287230]
2904.3F1287230k591431k879310l210002l526818l720379l646741l209987k452975
2920.6C6049587j497511n01316M07010J173884J792612K359152K916882L359401L592637
2939D9652338L597045L347111K803403K011728J160300N17273K84934N04315J045090
2957.4F4923537J704246K348023K896637L277367L426808L334302L064990K699769
2973.7H7675679K320552J975107J664352J399923J183432R91255Q11875O21974L86548
2992I9030697R2930k72024o77937j066381j371157j442152j163125n63497K27017J030010
3012.4I3824381J674974K036804K082312J886511J564073J232159R60934P25711N19824
3030.8A06507683L82340L08156K67207K11025J34146R8097J13619J30188J20926J17981
$$ y = [61287230, 58695799, 55816489, 52606487, 49079669, 45359290, 41712549, 38502562, 36049587, 34552076, 34050760, 34457770, 35631654, 37424266, 39783418, 42700300, 46059701, 49652338, 53249383, 56596494, 59399897, 61411625, 62571925, 63089198, 63374132, 63878447, 64923537, 66627783, 68975806, 71872443, 75149810, 78576618, 81910920, 84975910, 87675679, 89996231, 91971338, 93635690, 95035613, 96219045, 97210300, 98022175, 98644149, 99030697, 99123627, 98851603, 98173666, 97107285, 95736128, 94293976, 93130851, 92567354, 92794371, 93824381, 95499355, 97536159, 99618471, 101504982, 103069055, 104301214, 105262148, 105987859, 106507683, 106890023, 107198179, 107465386, 107676411, 107810557, 107908654, 108022273, 108152461, 108273387, 108391368]
3051.2A08391368J27972J14989R2482P5889N5945M6015M3607N8531R6703J13797R4903
3073.6A09312201N6648L5476N1165O4731O3038O6411O6853N8758N3096M4834K8706
3096A09901917M196n948O401n662m0365l7932R930L2318M482m482K5332O1357Q8370
3122.6A10039914Q7618N3096K1267K4653L3021P796l0935k6941K5058N0664K6559L481
3147A10315251j4317l3641j2099M1890N7852L1567J4996J8013J4436L529M482J3852
3171.5A10455811J5199M018n472J561J5057J4257k181j2458j395J6308K1065J1682
3196A10533452K432K742K002j609J0431K4342J4496L887R000J4388R513O330J2064
3222.5A10643470J0813J037j3841m1365m3953J8680P2742N0807M232k3282m6408l8695
$$ y = [108391368, 108519340, 108634329, 108726811, 108802700, 108858645, 108904660, 108948267, 109006798, 109103501, 109217298, 109312201, 109368849, 109404325, 109455490, 109520221, 109583259, 109649670, 109716523, 109775281, 109828377, 109873211, 109901917, 109906113, 109900165, 109906566, 109900904, 109860539, 109822607, 109832537, 109864855, 109869337, 109864855, 109890187, 109951544, 110039914, 110127532, 110180628, 110201895, 110226548, 110259569, 110267365, 110236430, 110209489, 110234547, 110285211, 110311770, 110315251, 110300934, 110267293, 110255194, 110297084, 110354936, 110386503, 110401499, 110419512, 110433948, 110437477, 110441959, 110455811, 110471010, 110475028, 110469556, 110471117, 110486174, 110500431, 110498250, 110485792, 110484397, 110500705, 110521770, 110533452, 110535884, 110538626, 110540628, 110539019, 110549450, 110573792, 110588288, 110592175, 110601175, 110615563, 110625076, 110631406, 110643470, 110654283, 110655320, 110641479, 110600114, 110556161, 110574841, 110647583, 110698390, 110702622, 110679340, 110632932, 110594237]
3247A10594237J3935L7349P510j7297K515K3949O306q976j1301m6301q7106m4942K8920
3273.5A10498798L9971K0170l219j8620j3459p236j4865m5419o7067l6538J1814L3808
3298A10398138K1970l7134j01232p8023J4353P7844P9798L9256n078j8824j8501l0303
3322.4A10342264l4284r990J1909M256o402k4474o7937o3968r918K0361L1459P618
3346.9A10200894n2142m5812K0682K8551j6630n0509n8519n0819o7032q8799m2248
3369.3A09777617N2357R0873O0916M5455O1881O8438N0343K1719j1408m5085k5773
3391.8A10147333M0722M3953l3260p6580r66R4617O6733j6880m4703k1887K4247M4775
3416.3A10268104L195l2151j2255j4853p1919r6416n0676l5859p8427m9603M8113P0774
$$ y = [110594237, 110608172, 110645521, 110653031, 110635734, 110638249, 110662198, 110668504, 110659528, 110648227, 110601926, 110514820, 110469878, 110498798, 110538769, 110558939, 110555720, 110537100, 110523641, 110516405, 110501540, 110456121, 110389054, 110352516, 110364330, 110398138, 110420108, 110382974, 110281742, 110203719, 110218072, 110295916, 110375714, 110414970, 110409892, 110391068, 110372567, 110342264, 110307980, 110297990, 110309899, 110314155, 110307753, 110283279, 110215342, 110151374, 110141456, 110161817, 110193276, 110200894, 110148752, 110102940, 110123622, 110152173, 110135543, 110085034, 110026515, 109975696, 109908664, 109819865, 109777617, 109829974, 109920847, 109981763, 110027218, 110089099, 110157537, 110207880, 110229599, 110218191, 110173106, 110147333, 110188055, 110232008, 110198748, 110122168, 110121202, 110215819, 110282552, 110265672, 110220969, 110199082, 110223329, 110268104, 110271299, 110239148, 110226893, 110212040, 110140121, 110043705, 109993029, 109957170, 109878743, 109829140, 109877253, 109948027]
3440.7A09948027P916l3057l4320l9936n1832n9652o1810p7188r5606o7425n6302j30642
3465.2A09248173j62804k6107J49906J60134N8591l1245l0887R7406J28472J7834J5366
3487.6A09624839P1788K4068m3964m1139j872m160m0508O759P1955L5846n4991j28746
3512.1A09519875j00243j0324J6273k2841o3479m2319K5964L7097M42j2660k4462k2817
3536.6A09300506J0753K3985K6297O4671J02055Q7989P5459Q8167P2897N1331N7674
3559A09961784P4065J21247J84346J38843r644m3834K9517P3981O4397L5667K0147
3581.5A10650516N0103J12927J05167k3508q9515n2345l7813l1495L9566R7990R9718
3603.9A10921311J22345J51360J19913P0345L9828M4870N7113j2970n5730K5988J45614
$$ y = [109948027, 109955943, 109922886, 109888566, 109848630, 109796798, 109737146, 109675336, 109598148, 109502542, 109435117, 109378815, 109248173, 109085369, 109059262, 109209168, 109369302, 109427893, 109396648, 109365761, 109463167, 109591639, 109609473, 109624839, 109696627, 109720695, 109676731, 109635592, 109633720, 109629560, 109589052, 109595811, 109667766, 109703612, 109648621, 109519875, 109419632, 109409308, 109425581, 109402740, 109339261, 109296942, 109322906, 109360003, 109360445, 109347785, 109323323, 109300506, 109311259, 109335244, 109361541, 109426212, 109528267, 109616256, 109691715, 109779882, 109852779, 109904110, 109961784, 110035849, 110157096, 110341442, 110480285, 110470641, 110426807, 110456324, 110530305, 110594702, 110630369, 110650516, 110700619, 110813546, 110918713, 110895205, 110805690, 110753345, 110715532, 110684037, 110723603, 110821593, 110921311, 111043656, 111195016, 111314929, 111385274, 111425102, 111469972, 111527085, 111514115, 111458385, 111484373, 111629987]
3626.3A11629987J62196l3486j31464o6626k2805r429K312J8728O6316J35386R8610
3648.8A11849725o1989r7489l6752m1235p9345l4523L0374N6207J02115J53792Q6355
3671.2A11927235K9683M5610o9046j40345q0634k4879J7655Q0479J06370J8108n9664
3693.6A11850572m6540J860M8530O4325J0479k1160M1795J06132K6238r8526p0286
3716.1A11913419J7810N8400M5336J5747M649Q667N3131J10591O0272r0396j46687
3738.5A12050939l6252J23680J15966l8135j370L6525j12796j48916n7578j5330m4608
3760.9A11872125l3474L1471N0795J8561l2723o6817l7324K2828M1581N280j4519k3186
3785.4A11834598m3047l5143Q619N9688P8845O7258P4077L5536n0724l5381l4356o8784
$$ y = [111629987, 111792183, 111758697, 111627233, 111560607, 111537802, 111528373, 111530685, 111549413, 111615729, 111751115, 111849725, 111787736, 111690247, 111653495, 111612260, 111532915, 111498392, 111528766, 111584973, 111687088, 111840880, 111927235, 111956918, 112002528, 111933482, 111793137, 111712503, 111687624, 111705279, 111785758, 111892128, 111910236, 111850572, 111804032, 111805892, 111854422, 111918747, 111929226, 111908066, 111949861, 112055993, 112082231, 111983705, 111913419, 111931229, 111989629, 112034965, 112050712, 112055361, 112064028, 112117159, 112227750, 112288022, 112197626, 112050939, 112014687, 112138367, 112254333, 112216198, 112214828, 112251353, 112138557, 111989641, 111932063, 111916733, 111872125, 111838651, 111870122, 111920917, 111939478, 111906755, 111839938, 111802614, 111825442, 111867023, 111872303, 111857784, 111834598, 111791551, 111756408, 111765027, 111824715, 111903560, 111970818, 112044895, 112080431, 112029707, 111994326, 111959970, 111891186]
3809.9A11891186j1253O6662O9165L8826N0104l5691j26302n9355P677L0291L8505
3832.3A11959815K5046N3525O6686k4677r1886j00136p2324K6750J74129K34151k956
3854.8A12248123j86599j10983O127O5946L6157n007l636l4153o0750m7981O79O8605
3879.2A11976528K8014m4572k5916j6654j1015j3148m1986p224O6531R6583N8627k2924
3903.7A12042844j01924j07073n0986J967L9494L3414j9312m6849q059L9232J6725
3926.1A11839473j1539J871r405m6480m1759L219L5798K8539k933j0645j168p987k1208
3952.7A11755776k6798k9754k3151k634L802l504k099j060n055j132J645j300K98o044
3981.2A11658990j8537j0073K134p749j8084j9812j3173M041
$$ y = [111891186, 111879933, 111946595, 112015760, 112054586, 112104690, 112068999, 111942697, 111883342, 111891019, 111921310, 111959815, 111984861, 112038386, 112105072, 112080395, 111988509, 111888373, 111816049, 111842799, 112016928, 112251079, 112248123, 112061524, 111950541, 111956668, 112022614, 112058771, 112053764, 112050128, 112015975, 111955225, 111907244, 111907923, 111976528, 112004542, 111959970, 111934054, 111917400, 111906385, 111893237, 111851251, 111844027, 111910558, 112007141, 112065768, 112042844, 111940920, 111833847, 111782861, 111784828, 111824322, 111857736, 111838424, 111791575, 111783516, 111822748, 111839473, 111827934, 111829805, 111820400, 111773920, 111732161, 111735380, 111771178, 111799717, 111796784, 111786139, 111784971, 111776984, 111755776, 111728978, 111699224, 111676073, 111673439, 111677241, 111673737, 111671638, 111670578, 111665523, 111664391, 111666036, 111664736, 111665034, 111658990, 111640453, 111630380, 111632514, 111624765, 111606681, 111586869, 111573696, 111577737]
3997.5A11577737
$$ y = [111577737]
##END=$$ End of the data block
