##TITLE=$$ Begin of the data block
##JCAMP-DX=5.00 $$ ACD/SpecManager v 10.08
##SPECTROMETER/DATA SYSTEM=Alpha
##DATE=27 Jun 2014 15:13:00
##DATA TYPE=INFRARED SPECTRUM
##DATA CLASS=XYDATA
##ORIGIN=
##OWNER=
##NPOINTS=1667
##FIRSTX=599.63549805
##LASTX=3997.56909180
##MAXX=3997.56909180
##MINX=599.63549805
##MAXY=1.14098310
##MINY=0.34155807
##XFACTOR=1.0000000000
##YFACTOR=0.000000010000000
##FIRSTY=1.03639197
##DELTAX=2.03957605
##XUNITS=1/CM
##YUNITS=ARBITRARY UNITS
##XYDATA=(X++(Y..Y))
599.6A03639197J9288J28198R7609P3790J01769J33634J95145K36011J49202L8266
620A04812109L8386O4349M5610L6561M5538K8825J096l7217p9155n0985K1183L2938
644.5A04959238j4413n3394n3477m7457p0441q9753j20914j95658k32959j25932K2471
666.9A03977311j35708l72851l30722k71666k50018k42567k48623k47526k29740k30587
687.3A01417303k37906k18069k12884k54000l11720m00275n71841q38840j161081j430308
707.7I5780379j439774j151699q61138p46215o55198l66062J81121P85851J163692
726.1I2690957J234531J129091J012313R44334Q91287Q34709P61098O43241N46753
744.4A00688314N38004N40924N07045M39679L16871J77621J03152J23048K17676K94173
$$ plain form
599.6 103639197 103658485 103786683 103884292 103958082 104059851 104193485 104388630 104624641 104773843 104812109
620 104812109 104850495 104914844 104960454 104997015 105042553 105071378 105072474 105035257 104956102 104905117 104926300 104959238
644.5 104959238 104944825 104891431 104837954 104790497 104720056 104630303 104509389 104313731 104080772 103954840 103977311
666.9 103977311 103841603 103468752 103138030 102866364 102616346 102373779 102125156 101877630 101647890 101417303
687.3 101417303 101179397 100961328 100748444 100494444 100182724 99782449 99210608 98371768 97210687 95780379
707.7 95780379 94340605 93188906 92327768 91581553 90926355 90560293 90741414 91527265 92690957
726.1 92690957 93925488 95054579 96066892 97011226 97902513 98737222 99498320 100141561 100688314
744.4 100688314 101226318 101767242 102274287 102713966 103030837 103208458 103311610 103434658 103652334 103946507
764.8A03946507K50971J61696J29235J44279J72019J76918J61827J51288J38092J21033
785.2A05553865J12319R8348Q6510Q1051M7624m792l2187m1914q0597j32346j28210
807.7A05559671o9857o0081j10781j15157q1074p9810n2071N0247R8776P368j27948
830.1A05019283j99568j87480j30618q1813o5112o8450n8270j8156L4810P7354R2948
852.5A04414928P2598K3234j6117l5405o6972j10519j50144j86693k17927k13754j37723
875A03375506j6653O5565Q3029R1338J21332J40380J14668L4130j12367l17788m01759
897.4A03177381k19346j8298M3583P3564L4344o6543j03294o7974k4163k0194q5843
919.8A02723217k04861k84529k27296l3677J89459K71321J46961k6667n8746M4322
$$ plain form
764.8 103946507 104197478 104359174 104488409 104632688 104804707 104981625 105143452 105294740 105432832 105553865
785.2 105553865 105666184 105764532 105851042 105932093 105979717 105974925 105942738 105900824 105820227 105687881 105559671
807.7 105559671 105489814 105429733 105318952 105203795 105122721 105042911 104990840 105041087 105139863 105147231 105019283
830.1 105019283 104819715 104632235 104501617 104419804 104354692 104286242 104227972 104209816 104244626 104321980 104414928
852.5 104414928 104487526 104510760 104494643 104459238 104392266 104281747 104131603 103944910 103726983 103513229 103375506
875 103375506 103358853 103424418 103507447 103598785 103720117 103860497 103975165 104009295 103896928 103579140 103177381
897.4 103177381 102958035 102939737 102983320 103056884 103091228 103024685 102921391 102853417 102829254 102809060 102723217
919.8 102723217 102518356 102233827 102006531 101972854 102162313 102433634 102580595 102553928 102495182 102539504
940.2A02539504J16443Q8477J9455n6290j29092j89078k17712j86705j12498l4666
960.6A01837838J9502J9682k3639p3827j11949j54412k15757k00665n9450O6400R5677
983.1A01199400J10400J52922J76906J42694O1858j5772n1784p4578j27709j87766
1003.5A01386571k34175k84171k72202j01591P1490J2148j82808k68459k04051j25074
1023.9I9797678j09893r7036l1341K3228k3818j92266m85784q38953r37981n31560
1044.3I6572274L4714L05342L51781L55285L00503J95998J10191P4560P3129P1835
1064.7I8445612M0341l3981j30332k28273l56955n39058p39902q90422r39608r17631
1085I3709791q96579q90088q71772q35037p49159n63431k92206r125K20871L47805
$$ plain form
940.2 102539504 102655947 102744424 102763879 102707589 102578497 102389419 102171707 101985002 101872504 101837838
960.6 101837838 101857340 101877022 101853383 101779556 101667607 101513195 101297438 101096773 101037323 101103723 101199400
983.1 101199400 101309800 101462722 101639628 101782322 101844180 101828408 101776624 101702046 101574337 101386571
1003.5 101386571 101152396 100868225 100596023 100494432 100565922 100578070 100395262 100126803 99922752 99797678
1023.9 99797678 99687785 99590749 99559408 99582636 99558818 99366552 98880768 98041815 97103834 96572274
1044.3 96572274 96606988 96912330 97264111 97619396 97919899 98115897 98226088 98300648 98373777 98445612
1064.7 98445612 98485953 98451972 98321640 98093367 97736412 97197354 96457452 95567030 94627422 93709791
1085 93709791 92813212 91923124 91051352 90216315 89467156 88903725 88611519 88602394 88823265 89171070
1105.4H9171070L14069J17224j40405l31217l61174j78260J69510N09667O45310M54879
1125.8I0370673j8978n22095q99243j288039j714337j942247j849705j562774j269412
1144.2G9303843j077473r93759r82344j007843j015431r42170p75367n45508k99245
1162.6G1664703r5987M9573J71703L06344N02211P63726R94319J156395J292330J354194
1182.9G8159511J288986J158148J036460R26446Q23105P67141P76869P99090P74962
1201.3H6510718O80673N27227L62855K26569J31530Q8197Q5562O4612r650j12832k20209
1223.7H8335252k97678l00979k48993k21747k40678k37089j50168J1224K06917L96270
1244.1H7252331N30284N85288N62251M79644L81214L13926K92140K88349K64514K17008
$$ plain form
1105.4 89171070 89485139 89602363 89461958 89130741 88769567 88591307 88760817 89270484 89915794 90370673
1125.8 90370673 90351695 89829600 88930357 87642318 85927981 83985734 82136029 80573255 79303843
1144.2 79303843 78226370 77232611 76250267 75242424 74226993 73284823 72509456 71963948 71664703
1162.6 71664703 71568716 71618289 71789992 72096336 72598547 73362273 74356592 75512987 76805317 78159511
1182.9 78159511 79448497 80606645 81643105 82569551 83392656 84159797 84936666 85735756 86510718
1201.3 86510718 87191391 87718618 88081473 88308042 88439572 88527769 88613331 88677943 88668293 88555461 88335252
1223.7 88335252 88037574 87736595 87487602 87265855 87025177 86788088 86637920 86649144 86856061 87252331
1244.1 87252331 87782615 88367903 88930154 89409798 89791012 90104938 90397078 90685427 90949941 91166949
1264.5I1166949J88911K10923K51919K53052K11864J65976J37156J68288K98416M52447
1284.9I3505901M97973M18752K98071K07723J63000J23972P9519R0074J76269K62195
1305.3I5823449K69854K34985K30366K22183J69575J16330J04177J38408K00117K40510
1325.7I7749954K26206J52791L4749q7589j83970k53838k91663k54608j81931j55306
1346.1I6754795j70844j84447j79261j75166j65761j07932j6719N871o1619j03402
1366.5I5595515r8509j31619l49396p64984q17251j30183P57599J202339J216465J110482
1386.9I7590458Q57968N36668L50028K43139K23661L39615M77052N63872N12683J81532
1407.3A01876676k89154p53856j007014q45367l65186J71697L89010K81060l6573m62437
$$ plain form
1264.5 91166949 91355860 91566783 91818702 92071754 92283618 92449594 92586750 92755038 93053454 93505901
1284.9 93505901 94003874 94422626 94720697 94928420 95091420 95215392 95294911 95384985 95561254 95823449
1305.3 95823449 96093303 96328288 96558654 96780837 96950412 97066742 97170919 97309327 97509444 97749954
1325.7 97749954 97976160 98128951 98163700 98076111 97892141 97638303 97346640 97092032 96910101 96754795
1346.1 96754795 96583951 96399504 96220243 96045077 95879316 95771384 95754665 95760536 95698917 95595515
1366.5 95595515 95497006 95365387 95015991 94251007 93433756 93303573 94061172 95263511 96479976 97590458
1386.9 97590458 98448426 98985094 99335122 99578261 99801922 100141537 100618589 101182461 101695144 101876676
1407.3 101876676 101587522 100833666 99826652 98981285 98616099 98787796 99176806 99457866 99421293 98958856
1427.7I8958856q78698j094097j010108r97579j041770q52316p37322p42262p55507
1446I0849197q97038j162350j425225j511031j410324j035314o09094n81420p03567
1464.4H1513834R4837K205366M580724O118107M726720K384531J381159J065433Q86583
1482.8A04957294P01976N97537N05948L00896J34170R4342j5211j53303J8704L39520
1503.2A07481873O04653N59128R8443l3176N9521J34909J29819R5713N0986l6597m8244
1525.6A09097028l5811l2460J1050j7643o7174L2627R6965j19543k58374k23076j31989
1548A08351600m1020L1412J27661K49028L16096k885j97005o3789O1738J28353Q7392
1570.5A09048581K6250P2920N4860p0810p7212l3664n73L9411O9654N7733J6963j9574
$$ plain form
1427.7 98958856 98080158 96986061 95975953 94978374 93936604 93084288 92346966 91604704 90849197
1446 90849197 89952159 88789809 87364584 85853553 84443229 83407915 82798821 82217401 81513834
1464.4 81513834 81608671 83814037 88394761 94512868 99239588 101624119 103005278 104070711 104957294
1482.8 104957294 105659270 106256807 106762755 107063651 107197821 107292163 107276952 107123649 107142353 107481873
1503.2 107481873 108086526 108645654 108744097 108710921 108770442 108905351 109035170 109130883 109181869 109145272 109097028
1525.6 109097028 109061217 109028757 109039807 109022164 108954990 108987617 109084582 108965039 108706665 108483589 108351600
1548 108351600 108310580 108341992 108469653 108718681 109034777 109031892 108834887 108771098 108832836 108961189 109048581
1570.5 109048581 109074831 109147751 109202611 109131801 109054589 109020925 109020352 109059763 109129417 109187150 109204113 109184539
1594.9A09184539n1319p2527q7369q5878m8649Q213J7965j1587l267K7276n1856j42479
1619.4A08683062j03081j06394j57022j53435j23942o9904J2505l5787k39324k91455
1639.8A07415223k46847j74474j42873k04050j54269l7336k41375m13788k98249j92571
1660.2A05309391j63555j60027j5878K17580L56150L47650M10426L60370J72436J03914
1680.6A06938457P4864j85537m81916n37848n78916m81642l74102l78895n01979p66646
1701A02725840p85613p33293q26001p77793o45482n83857p10190j318103j888788j967418
1721.4I2489302k235287k687216l065050l521448m004479n404239o037748m802704
1737.7F0731131m492909l912163k370831p25943J131085L438615N441046O175453O944978
$$ plain form
1594.9 109184539 109133220 109060693 108973324 108887446 108838797 108847010 108864975 108853388 108850121 108877397 108825541 108683062
1619.4 108683062 108579981 108473587 108316565 108163130 108039188 107969284 107981789 107946002 107706678 107415223
1639.8 107415223 107168376 106993902 106851029 106646979 106492710 106455374 106213999 105800211 105501962 105309391
1660.2 105309391 105145836 104985809 104969931 105187511 105543661 105891311 106301737 106662107 106834543 106938457
1680.6 106938457 107013321 106827784 106345868 105808020 105229104 104747462 104373360 103994465 103492486 102725840
1701 102725840 101940227 101206934 100380933 99603140 98957658 98373801 97663611 96345508 94456720 92489302
1721.4 92489302 90254015 87566799 84501749 80980301 76975822 71571583 65533835 60731131
1737.7 60731131 56238222 52326059 49955228 49229285 50360370 53798985 59240031 65415484 72360462
1756.1G2360462P327384O470138N609351M168963K813048K170342J677847J301181
1772.4A03898716Q75390N61380M93622M63843L70681L18170K77197K59352K73371K43282
1792.8A08035004J36078J11794J52493J43075R4020P3337J04857J18792J07169P2813
1813.2A09149432O9976P9668P4100P8201R7979J03211R2363Q8847K3150p236K7943
1835.6A09877634M8649N1618Q4639R9945K9218k5058k1195P891K5702K7203K1053J8596
1860.1A10245895K1744M0627O1357M6038j3733m2581j1993O187N007R382K4545K6345
1884.6A10418820L0923M4883K2518o294o795j025P391J9324J3995R990J4114J2243
1909A10580087M637M721J8477K3389P200k765n687j9121j4949o056n638J347R096Q678
$$ plain form
1756.1 72360462 79687846 86157984 91767335 95936298 98749346 100919688 102597535 103898716
1772.4 103898716 104774106 105335486 105829108 106292951 106663632 106981802 107258999 107518351 107791722 108035004
1792.8 108035004 108171082 108282876 108435369 108578444 108672464 108745801 108850658 108969450 109076619 109149432
1813.2 109149432 109219408 109299076 109373176 109451377 109549356 109652567 109744930 109833777 109856927 109849691 109877634
1835.6 109877634 109926283 109977901 110062540 110162485 110191703 110166645 110145450 110153341 110179043 110206246 110227299 110245895
1860.1 110245895 110267639 110308266 110369623 110415661 110401928 110359347 110347354 110353541 110358548 110367930 110392475 110418820
1884.6 110418820 110449743 110494626 110517144 110510850 110504055 110503030 110510421 110529745 110543740 110553730 110567844 110580087
1909 110580087 110584724 110589445 110607922 110631311 110638511 110635746 110630059 110610938 110595989 110589933 110584295 110585642 110594738 110603416
1937.6A10603416K0134L8422J5688j6332j2696N722J8859K7454K0873L422l207N138
1962.1A10726893K1112K2948L040j3066q738p03M685Q738M566k242N508J9944J8191
1988.6A10810876P093n889j1480o902n937m816j335J144L195q94m387k253p75k360
2017.1A10775280j0669j3340m720j514j407L719M959O628J7715K0385R989J3519K2828
2043.6A10843372J3447P75L874J7381K4331J7190Q773J2768K1386J9956J0001K265
2068.1A10995519J931O914J4222K3365K5094J3816M828P749J8978K6524K0981J3494
2092.6A11173415J1361Q297J0526J1921M685N877J2719J5319J7393J6129R620N233
2117.1A11302495O092J1646J4997R608M912M541M06o151l982K599P224Q297m77j2958
$$ plain form
1937.6 110603416 110623550 110661972 110677660 110661328 110648632 110654354 110673213 110700667 110721540 110724962 110721755 110726893
1962.1 110726893 110748005 110770953 110773993 110760927 110752189 110751486 110756171 110764909 110769475 110767233 110772741 110792685 110810876
1988.6 110810876 110817969 110812080 110800600 110793698 110787761 110782945 110781610 110782754 110785949 110785055 110780668 110778415 110777640 110775280
2017.1 110775280 110764611 110751271 110746551 110745037 110743630 110747349 110752308 110758936 110776651 110797036 110807025 110820544 110843372
2043.6 110843372 110856819 110857594 110861468 110878849 110903180 110920370 110929143 110941911 110963297 110983253 110993254 110995519
2068.1 110995519 110997450 111004364 111018586 111041951 111067045 111080861 111085689 111093438 111112416 111138940 111159921 111173415
2092.6 111173415 111184776 111193073 111203599 111215520 111220205 111226082 111238801 111254120 111271513 111287642 111297262 111302495
2117.1 111302495 111308587 111320233 111335230 111344838 111349750 111354291 111354697 111348546 111344564 111347163 111354387 111362684 111362207 111349249
2145.6A11349249j6451j1861l743L278q47n090l6M626O103R060J2112J2004J3054J4507
2174.2A11385965J3149R775L481j681L755J0956Q476K396M315R012P975R537P904K265
2202.7A11477280J740L982N030P964J2457O962j049J299L696j121m756j359L600L421
2231.3A11519146L290J156o830j2899j7440j1313O664J3161N924j514q452j0705q165
2257.8A11472023n961N496J5699P546k646j872O390J0872K742p558j5891j8894n651
2284.3A11462295J3232J7715Q881O413J8978L6204M3333L6323L3569N3978Q1110Q8251
2308.8A11900282Q0216P6473Q3136J00637J27768J42205J26064J09148J17671J23143
2329.2A12986743Q4949K4605K348K9540P3064N6290n6421k17677k44605m0651K37394
$$ plain form
2145.6 111349249 111332798 111320937 111317194 111320472 111319625 111314535 111314499 111319125 111325228 111334288 111346400 111358404 111371458 111385965
2174.2 111385965 111399114 111408889 111412370 111410689 111414444 111425400 111433876 111436272 111440587 111449599 111457574 111467111 111475015 111477280
2202.7 111477280 111479020 111483002 111488032 111495996 111508453 111515415 111514366 111515665 111519361 111518240 111513484 111512125 111515725 111519146
2231.3 111519146 111522436 111523592 111516762 111503863 111486423 111475110 111481774 111494935 111500859 111499345 111490893 111480188 111472023
2257.8 111472023 111466062 111471558 111487257 111494803 111492157 111490285 111496675 111507547 111510289 111502731 111486840 111467946 111462295
2284.3 111462295 111475527 111493242 111502123 111508536 111527514 111563718 111607051 111643374 111676943 111730921 111812031 111900282
2308.8 111900282 111980498 112056971 112140107 112240744 112368512 112510717 112636781 112745929 112863600 112986743
2329.2 112986743 113071692 113096297 113098645 113128185 113201249 113257539 113201118 112983441 112738836 112698185 112935579
2351.6A12935579M08852L94916K62011R6952l3509j35851k20335k74086l04067l01790
2372A12828672k72060k44832k30193k09284j66094j12867o6388l3414o342Q559m744
2394.4A11491013j6320o664K897P188P713K861j061Q58N651M876L218R048O211k289
2423A11515200R78P569J1135M470l779K909P069J979q4k551k515O401P236l624n400
2453.6A11546993m005q547j872M995n782r882M327J1516K586o318j2040j6725j1897
2480.1A11493349l660l445k742m422j5617j8000r430j1992k0111j0884n00p081j6070
2506.6A11369395k0361j7667r906r048j6618k3293k3174j8108j3733j3006j5128j2791
2531.1A11176562k551N591M017o449j5199j0598J288L69j5449k1243j0264m77l183
$$ plain form
2351.6 112935579 113344431 113739347 114001358 114098310 114064801 113928950 113708615 113434529 113130462 112828672
2372 112828672 112556612 112311780 112081587 111872303 111706209 111593342 111526954 111493540 111487198 111495757 111491013
2394.4 111491013 111474693 111468029 111470926 111478114 111485827 111488688 111487627 111488485 111494136 111499012 111502230 111511278 111517489 111515200
2423 111515200 111516178 111523747 111534882 111539352 111535573 111538482 111545551 111547530 111547446 111544895 111542380 111548781 111556017 111552393 111546993
2453.6 111546993 111542988 111534441 111532569 111537564 111531782 111521900 111526227 111537743 111540329 111534011 111521971 111505246 111493349
2480.1 111493349 111489689 111486244 111483502 111479080 111463463 111445463 111436033 111424041 111403930 111393046 111392546 111385465 111369395
2506.6 111369395 111349034 111331367 111321461 111312413 111295795 111272502 111249328 111231220 111217487 111204481 111189353 111176562
2531.1 111176562 111174011 111179602 111183619 111177170 111161971 111151373 111152661 111153030 111137581 111116338 111106074 111105597 111102414
2557.6A11102414j1384j6022k0814k3806k6024k7036k0552j6236j9288k6584k7788
2580A10866880j5401j2327k7895l3438k5606k8622l3605k5177j7369j6844k3330l3223
2604.5A10574043k8169j6940k4307l4833l0410k2841k1302k8146m1997m9996m3285
2626.9A10231817l3224l2389l5584l0780j8442q177k265q23o366k1874l7766m3058
2651.4A09961069m7696n2047m4250m2486o6007p8129o4660m7111k5833j0967q786j5855
2675.9A09457242k0384J347L5512M2486L0387K8658L4332L6204L2830K9910L0982L1257
2700.4A09770763K2650R238l659j4544j6486k0826l3617l3975k7669l6883n2547n8067
2724.8A09504378m0305r525J0085J9443J9587K0909L4153L4762R739j3828j4901K98
$$ plain form
2557.6 111102414 111091030 111075008 111054194 111030388 111004364 110977328 110956776 110940540 110921252 110894668 110866880
2580 110866880 110851479 110839152 110811257 110777819 110752213 110723591 110689986 110664809 110647440 110630596 110607266 110574043
2604.5 110574043 110545874 110528934 110504627 110469794 110439384 110416543 110395241 110367095 110325098 110275102 110231817
2626.9 110231817 110198593 110166204 110130620 110099840 110081398 110073221 110070956 110070133 110063767 110041893 110004127 109961069
2651.4 109961069 109913373 109861326 109817076 109774590 109708583 109630454 109565794 109518683 109492850 109481883 109473097 109457242
2675.9 109457242 109436858 109438205 109473717 109516203 109546590 109575248 109609580 109645784 109678614 109708524 109739506 109770763
2700.4 109770763 109793413 109802651 109798992 109784448 109767962 109747136 109713519 109679544 109651875 109614992 109562445 109504378
2724.8 109504378 109464073 109454548 109464633 109484076 109503663 109524572 109558725 109593487 109603226 109589398 109574497 109574795
2749.3A09574795J5032Q106j6582k9885l0292l0279l1936l5393m5097o4957q9133j09672
2773.8A09114707j09494j06895j29497j52052j63257j79982j96028j91498j82008j97780
2794.2A07506216k31553k43020k28154k37274k76304l16107l53539l80409m01294m48453
2814.6A04390109n26298o10518o91569p85327r02855j042855j210457j414746j682872
2832.9I5522612k088135k723384l634310m795772o024682o908858p005274o118512
2849.3E6223685m319305j899862O15960K710033M069882M598850M367966L537160K415311
2867.6G2319680J538909J352620J695609J922429J598412Q44895J7775o82313j207006
2886G9401010j568424j808513j948231j993477j997853k039277k121556k219856k364528
$$ plain form
2749.3 109574795 109589827 109597933 109581351 109551466 109521174 109490895 109458959 109423566 109378469 109313512 109224379 109114707
2773.8 109114707 109005213 108898318 108768821 108616769 108453512 108273530 108077502 107886004 107703996 107506216
2794.2 107506216 107274663 107031643 106803489 106566215 106289911 105973804 105620265 105239856 104838562 104390109
2814.6 104390109 103863811 103253293 102561724 101776397 100873542 99830687 98620230 97205484 95522612
2832.9 95522612 93434477 90711093 87076783 82281011 76256329 69347471 62342197 56223685
2849.3 56223685 51904380 50004518 50620478 53330511 57400393 61999243 66367209 69904369 72319680
2867.6 72319680 73858589 75211209 76906818 78829247 80427659 81272554 81290329 80608016 79401010
2886 79401010 77832586 76024073 74075842 72082365 70084512 68045235 65923679 63703823 61339295
2904.3F1339295k588540k886099l210652l508124l701788l642118l213644k451309
2920.6C6137021j486573m94641M00633J168796J799610K362904K908558L346953L585040
2939D9728301L599677L349477K793199J997906J155477N17595K82419N00470J042092
2957.4F4966613J699919K344518K897358L276831L419060L322863L054578K692997
2973.7H7674737K323687J987976J671648J391256J165545R80276Q16160O31726L91346
2992I9034357R0307k73472o70403j061279j371360j441002j164376n69028K21533J030165
3012.4I3825442J676762K035898K082580J885408J565981J240873R63068P20489N17762
3030.8A06514263L83628L13222K70891K03538J24049R8491J19686J31226J18577J18482
$$ plain form
2904.3 61339295 58750755 55864656 52654004 49145880 45444092 41801974 38588330 36137021
2920.6 36137021 34650448 34155807 34556440 35725236 37524846 39887750 42796308 46143261 49728301
2939 49728301 53327978 56677455 59470654 61468560 62624037 63141632 63424051 63924521 64966613
2957.4 64966613 66666532 69011050 71908408 75185239 78604299 81927162 84981740 87674737
2973.7 87674737 89998424 91986400 93658048 95049304 96214849 97195125 98011285 98643011 99034357
2992 99034357 99124664 98851192 98180789 97119510 95748150 94307148 93142772 92573744 92795277 93825442
3012.4 93825442 95502204 97538102 99620682 101506090 103072071 104312944 105276012 105996501 106514263
3030.8 106514263 106897891 107211113 107482004 107685542 107809591 107908082 108027768 108158994 108277571 108396053
3051.2A08396053J29581J14775Q9216P2026N6291M6944M1604N6076R9993J24550R8550
3073.6A09325659M6408K5654N3370P1776O2752O1238N9163N0521N7161N6112K8336
3096A09898150m208j1826N782J67l4678l5882J1217K9970k182r096K5750O7246R8240
3122.6A10038650R0539L9149L207K1219L7741J3853k0886k9218P069L8087K7800J3542
3147A10280752m184k7895r167M4489O1381L3700J7416K0230J3578N150Q297O855J633
3173.5A10452235K217m637m792J2254J4782M65l576M160J3340K2673K0266J1933J2469
3200.1A10553789M625m112J0383K1195K885r048O366K2459K1374J2827R406P760L100
3226.6A10663009j2112m1544m5920J2469P0322N3465N913j7464l3021k7811J4626L2330
$$ plain form
3051.2 108396053 108525634 108640409 108729625 108801651 108857942 108904886 108946490 109002566 109102559 109227109 109325659
3073.6 109325659 109372067 109397721 109451091 109522867 109585619 109646857 109706020 109756541 109813702 109869814 109898150
3096 109898150 109893942 109882116 109887898 109888065 109853387 109817505 109828722 109858692 109856510 109847414 109873164 109940410 110038650
3122.6 110038650 110129189 110168338 110171545 110192764 110230505 110244358 110223472 110194254 110201323 110239410 110267210 110280752
3147 110280752 110276568 110248673 110239506 110283995 110345376 110379076 110396492 110416722 110430300 110435450 110443747 110450602 110452235
3173.5 110452235 110454452 110449815 110445023 110457277 110472059 110472524 110468948 110473108 110486448 110509121 110529387 110541320 110553789
3200.1 110553789 110558414 110554302 110564685 110585880 110588765 110579717 110586083 110608542 110629916 110642743 110652149 110659909 110663009
3226.6 110663009 110650897 110609353 110563433 110575902 110646224 110699689 110705602 110688138 110655117 110627306 110641932 110674262
3251.1A10674262N221j3566o91J0645k598j2601j4615m1687o8903l5644J5593K9897
3275.5A10545313K7514N245j8310j5283j2267l1495n9008n8818k9457N567L7813L0983
3300A10427797l9399j03438p2682J8406O9738O3109L1710K658k253j931k1649l3819
3324.5A10338247j3507Q893K897j0931l0816o3467m8482K718J7643J1515o795m8935
3348.9A10158980m3297J7774K7633j9646m9686m3655l6680o1918q3267m3917M0877
3371.4A09863198Q7225P1585N8341N8437N2798M7540K7192j7262n5873l3402L9529
3393.8A10199308N2679k3603p0084J598Q9609N9689k2436m6527j7107K8503M6313J3876
3418.3A10311818j9264k0456l5334q2398r9420n5301l6240o5350l3188N2285P1883
$$ plain form
3251.1 110674262 110679483 110665917 110665226 110675871 110673273 110660672 110646057 110604370 110535467 110499823 110515416 110545313
3275.5 110545313 110572827 110578072 110559762 110544479 110532212 110500717 110441709 110382891 110353434 110359001 110396814 110427797
3300 110427797 110388398 110284960 110212278 110230684 110300422 110363531 110395241 110397899 110395646 110393715 110372066 110338247
3324.5 110338247 110324740 110333633 110336530 110325599 110294783 110231316 110182834 110185552 110203195 110214710 110207915 110158980
3348.9 110158980 110115683 110133457 110161090 110141444 110091758 110048103 110011423 109949505 109866238 109822321 109863198
3371.4 109863198 109950423 110022008 110080349 110138786 110191584 110239124 110266316 110249054 110193181 110159779 110199308
3393.8 110199308 110251987 110228384 110158300 110159898 110249507 110309196 110286760 110240233 110223126 110251629 110297942 110311818
3418.3 110311818 110292554 110272098 110236764 110154366 110054946 109999645 109963405 109898055 109864867 109917152 109989035
3440.7A09989035J0634m5455m9412l5668l4451m1592n2571q4544j17445q2493n7029
3463.2A09399009j36388j72722k6011J57344J67167O3014k7692k1625J04094J22881
3483.6A09629071J6904J8155O5303J7095m8781m5252J312K861m0126k432N7364L2591
3508A09704065m2510j23453j02246k586K7084k2435o9118m4227K5249L5846P2j7107
3532.5A09368634k9433k1076J7357L2222K7669M7815Q4448R7203R1171R0468P6020
3554.9A09882498N3823N5873P4887J16230J67989J26362J919j9240L3700N7114N5420
3577.4A10606575L7980K4235N6053J19018J08147k6715j00052o2275l3248j3852M3750
3599.8A10759616Q1074R2876J38998J68371J13869N1951L2390N3370P3242k754n8579
$$ plain form
3440.7 109989035 109999669 109954214 109904802 109869134 109834683 109793091 109740520 109655976 109538531 109456038 109399009
3463.2 109399009 109262621 109089899 109063888 109221232 109388399 109451413 109423721 109402096 109506190 109629071
3483.6 109629071 109645975 109664130 109729433 109746528 109697747 109652495 109653807 109656668 109616542 109614110 109671474 109704065
3508 109704065 109661555 109538102 109435856 109433270 109460354 109437919 109368801 109324574 109349823 109385669 109385741 109368634
3532.5 109368634 109339201 109318125 109335482 109367704 109395373 109443188 109527636 109624839 109716010 109806478 109882498
3554.9 109882498 109936321 109992194 110067081 110183311 110351300 110477662 110479581 110460341 110494041 110551155 110606575
3577.4 110606575 110644555 110668790 110724843 110843861 110952008 110925293 110825241 110762966 110729718 110715866 110759616
3599.8 110759616 110840690 110933566 111072564 111240935 111354804 111406755 111439145 111492515 111565757 111563003 111504424
3622.2A11504424J3256J24454J48034k4438j25301o9940k6106j2374J55J4174O6244
3644.7A11612582J50669J11949p5352j12832k9099k2614p8988m9161J8286M8983J00386
3667.1A11674809J49847P8105M1807P6068n1666j41442r4223m2223J2373P9203R0778
3689.6A11873436R036l8230j8824Q345M0102M9937o902k8551L9804R6023K5714q1194
3714A11968696o8366k75N4765O5887K8420j2172j6069M6432J12402N5325r6130j32382
3738.5A12006533r382J49930J46532l1328k6381J7297j03760j29318l9768j1480o3336
3760.9A11905539n0640K5785M8423J7464m5824q4055l7002L1948M1664K98p010j2004
3785.4A11834586n0915n1164r6N7173P6509O1941P8153M3226n7829m1866l2187p7652
$$ plain form
3622.2 111504424 111517680 111642134 111790168 111765730 111640429 111570489 111544383 111532009 111532164 111546338 111612582
3644.7 111612582 111763251 111875200 111799848 111687016 111657917 111635303 111556315 111507154 111525440 111574423 111674809
3667.1 111674809 111824656 111902761 111944568 112020636 111968970 111827528 111733305 111691082 111703455 111782658 111873436
3689.6 111873436 111882472 111844242 111825418 111833763 111873865 111923802 111916900 111888349 111928153 112024176 112049890 111968696
3714 111968696 111900330 111900055 111954820 112020707 112049127 112036955 112020886 112067318 112179720 112235045 112138915 112006533
3738.5 112006533 111997151 112147081 112293613 112262285 112235904 112253201 112149441 112020123 111980355 111968875 111905539
3760.9 111905539 111854899 111880684 111929107 111946571 111900747 111816692 111779690 111811638 111853302 111853600 111846590 111834586
3785.4 111834586 111783671 111732507 111732411 111789584 111866093 111928034 112006187 112049413 111991584 111949718 111917531 111839879
3809.9A11839879k6834P3993R0682L4809L7527k2196j01674m6444J2493K7788K7609
3832.3A11947632K3043N9986O7759j8454q6772j07503p2217L6823J62721J91856k0349
3854.8A12184525j76371j09422R906P8774M2975p284l695l1305o2167n3692n698O1106
3879.2A11927652K5201l0494j3244k6953k6369j4102l3856l22O7461Q4781N5230k384
3903.7A12012601q8501j12367n8365l588L6907M9210N567m3070l1650P677M792J252
3928.2A11780465K5057K230n0390m7910p201K8253L6478P665j1182j3756k0409r656
3952.7A11719644N651o259k5785j8489m173j0705j8298o652k480j8346k2232m995P963
3979.2A11594844O44n424M696k86j9347j1540J872n746q166
$$ plain form
3809.9 111839879 111813045 111887038 111977720 112012529 112050056 112027860 111926186 111879742 111892235 111920023 111947632
3832.3 111947632 111970675 112030661 112098420 112079966 111993194 111885691 111813474 111850297 112013018 112204874 112184525
3854.8 112184525 112008154 111898732 111908638 111987412 112030387 112023103 112019408 111988103 111925936 111872244 111866546 111927652
3879.2 111927652 111952853 111922359 111909115 111882162 111855793 111841691 111807835 111807513 111874974 111959755 112014985 112012601
3903.7 112012601 111924100 111811733 111753368 111749780 111786687 111835897 111841464 111798394 111766744 111774421 111779213 111780465
3928.2 111780465 111805522 111807752 111757362 111709452 111702251 111730504 111766982 111774647 111763465 111749709 111729300 111719644
3952.7 111719644 111725295 111719036 111693251 111674762 111670589 111659884 111641586 111634934 111632454 111614108 111591876 111586881 111594844
3979.2 111594844 111595488 111590064 111594760 111594474 111575127 111563587 111565459 111559713 111551547
3997.5A11551547
$$ plain form
3997.5 111551547
##END=$$ End of the data block
