##TITLE=$$ Begin of the data block
##JCAMP-DX=5.00 $$ ACD/SpecManager v 10.08
##SPECTROMETER/DATA SYSTEM=Alpha
##DATE=27 Jun 2014 15:13:00
##DATA TYPE=INFRARED SPECTRUM
##DATA CLASS=XYDATA
##ORIGIN=
##OWNER=
##NPOINTS=1667
##FIRSTX=599.63549805
##LASTX=3997.56909180
##MAXX=3997.56909180
##MINX=599.63549805
##MAXY=1.13997531
##MINY=0.34284464
##XFACTOR=1.0000000000
##YFACTOR=0.000000010000000
##FIRSTY=1.03608584
##DELTAX=2.03957605
##XUNITS=1/CM
##YUNITS=ARBITRARY UNITS
##XYDATA=(X++(Y..Y))
599.6A03608584j5640J03009J06573J04141J20998J50239J87504J95957J36506N2214
620A04750085M2522P1382N5027K7407L3056K8336M41l7324p4589m7314K4473K7490
644.5A04900992l2377n8151m2104m8304q0311q7464j07312j72973k21372j38199L0685
666.9A03943110j07086l76988l40008k79689k69234k69568k65468k40516j99735j97721
687.3A01397097k38538k50733k35545k63739l18551l83055n37998q19367j163512j443655
707.7I5742404j453286j153380q54164p53796o67441l57014J95080P77418J132899
726.1I2608720J203460J126337J037776R76616R20910Q46678P42704O14917N26464
744.4A00604582N28800N43285N10156M46403L24559J73843R8181J22165K17951L01111
$$ y = [103608584, 103592944, 103695953, 103802526, 103906667, 104027665, 104177904, 104365408, 104561365, 104697871, 104750085, 104792607, 104863989, 104919016, 104946423, 104979479, 105007815, 105008256, 104970932, 104896343, 104849029, 104873502, 104900992, 104868615, 104810464, 104768360, 104720056, 104639745, 104552281, 104444969, 104271996, 104050624, 103912425, 103943110, 103836024, 103459036, 103119028, 102839339, 102570105, 102300537, 102035069, 101794553, 101594818, 101397097, 101158559, 100907826, 100672281, 100408542, 100089991, 99706936, 99168938, 98349571, 97186059, 95742404, 94289118, 93135738, 92281574, 91527778, 90860337, 90503323, 90698403, 91475821, 92608720, 93812180, 94938517, 95976293, 96952909, 97873819, 98720497, 99463201, 100078118, 100604582, 101133382, 101676667, 102186823, 102633226, 102957785, 103131628, 103229809, 103351974, 103569925, 103871036]
764.8A03871036K64453J69373J29938J40906J56652J64080J59717J43158J37031J40107
785.2A05476451J24311R1315P7617P0810L0387j5664k9088l4046q1515j38521j16194
807.7A05455863m9972n9795j19603j16408p4720o6305l4713N6636Q2254j7988j31655
830.1A04923594j81973j84476j55425j07837o6400n1415m7397j5426M1425P8178Q3637
852.5A04316485P3290L4880j7857m7624o7818j08791j55508j89245k11620k01464j30141
875A03294587j8763N9282Q3673J00816J23024J32525J09696L3808j06430l09372l99387
897.4A03103459k22099j9038M4585P1084L6752o1679j08003p4709l0446k8491q8775
919.8A02622640k02465k78425k13802k4080J86550K72501J53661l0959o9284M1651
$$ y = [103871036, 104135489, 104304862, 104434800, 104575706, 104732358, 104896438, 105056155, 105199313, 105336344, 105476451, 105600762, 105692077, 105769694, 105840504, 105870891, 105855227, 105826139, 105792093, 105710578, 105572057, 105455863, 105405891, 105346096, 105226493, 105110085, 105035365, 104969060, 104934347, 104990983, 105073237, 105055249, 104923594, 104741621, 104557145, 104401720, 104293883, 104227483, 104176068, 104128671, 104113245, 104154670, 104232848, 104316485, 104389775, 104424655, 104406798, 104359174, 104291356, 104182565, 104027057, 103837812, 103626192, 103424728, 103294587, 103275824, 103335106, 103418779, 103519595, 103642619, 103775144, 103884840, 103918648, 103812218, 103502846, 103103459, 102881360, 102862322, 102906907, 102977991, 103014743, 102953064, 102845061, 102770352, 102739906, 102711415, 102622640, 102420175, 102141750, 101927948, 101903868, 102090418, 102362919, 102516580, 102485621, 102416337, 102457988]
940.2A02457988J23978R7608J9122o5029j37055j90794k11323j76513j09100m3071
960.6A01765811J1540K1577j6296o3145j03236j51729k17641k04908n3931Q0657R6774
983.1A01165473R8157J41538J67059J33420O1929m8l7217p5424j34766j90818k32733
1005.5A01096570k80916k64979r4676O6162R29j82318k57910j97798j33454j24705
1025.9I9626905j00029k1601L3975j8310j89531m87781q45331r43392n35453L5197
1046.3I6554649L11649L56751L50750K90018J87773J10608Q4102P8839O6811L4630
1066.7I8426580k8741j16676k24042l65519n46974p43950q91495r34422r06831q83424
1087.1I2784506q79329q74782q44496p45106n51409k80708k104K16228L40003L16244
$$ y = [102457988, 102581966, 102679574, 102698696, 102633667, 102496612, 102305818, 102094495, 101917982, 101808882, 101765811, 101777351, 101798928, 101782632, 101719487, 101616251, 101464522, 101246881, 101041973, 100988042, 101068699, 101165473, 101263630, 101405168, 101572227, 101705647, 101767576, 101767528, 101730311, 101654887, 101520121, 101329303, 101096570, 100815654, 100550675, 100455999, 100522161, 100523090, 100340772, 100082862, 99885064, 99751610, 99626905, 99526876, 99505275, 99539250, 99520940, 99331409, 98843628, 97998297, 97054905, 96519452, 96554649, 96866298, 97223049, 97573799, 97863817, 98051590, 98162198, 98246300, 98325139, 98391950, 98426580, 98397839, 98281163, 98057121, 97691602, 97144628, 96400678, 95509183, 94574761, 93667930, 92784506, 91905177, 91030395, 90185899, 89440793, 88889384, 88608676, 88606572, 88822800, 89162803, 89479047]
1107.5H9479047J19567j50937l43239l62784j73288J70767N05715O45668M63790r865
1127.9I0344441n20265q97128j280206j708120j943153j854354j567769j272756j075006
1146.2G8225684r90152r82064j001471j005888r45092p81733n40399k94179j02049
1164.6G1582657M3333J78033L17442N03844P57390R85569J150543J294315J357430
1182.9G8170556J288301J155495J033414R23842Q21221P63297P72536P99518P71356
1201.3H6499536O75267N32079L62450K16668J32490R5659Q6457O7633n84j07390k21103
1223.7H8339162k99782l03906k53105k22254k37083k34807j49083J4836K04652L84641
1244.1H7243271N24211N92571N75257M86731L78031L08615K93314K89202K56127K09999
$$ y = [89479047, 89598614, 89447677, 89104438, 88741654, 88568366, 88739133, 89244848, 89890516, 90354306, 90344441, 89824176, 88927048, 87646842, 85938722, 83995569, 82141215, 80573446, 79300690, 78225684, 77235532, 76253468, 75251997, 74246109, 73301017, 72519284, 71978885, 71684706, 71582657, 71625990, 71804023, 72121465, 72625309, 73382699, 74368268, 75518811, 76813126, 78170556, 79458857, 80614352, 81647766, 82571608, 83392829, 84156126, 84928662, 85728180, 86499536, 87174803, 87706882, 88069332, 88286000, 88418490, 88514149, 88600606, 88668239, 88667655, 88560265, 88339162, 88039380, 87735474, 87482369, 87260115, 87023032, 86788225, 86639142, 86653978, 86858630, 87243271, 87767482, 88360053, 88935310, 89422041, 89800072, 90108687, 90402001, 90691203, 90947330, 91157329]
1264.5I1157329J90246K12026K49576K49219K08110J64175J41150J78653L08096M53478
1284.9I3512058M89992M11332K97034K11465J68973J29885Q1956Q6367J67245K52646
1305.3I5808953K70331K43312K34670K20471J66011J12486J03021J44022J99712K28208
1325.7I7731197K14618J46979L6437q1325j81091k51776k86811k50584j81157j62112
1346.1I6734375j80638j83821j71172j72913j70148j08361j0687P397o8373j08725
1366.5I5566934r7733j27864l47060p63142q12799j25963P57170J200634J219958J117981
1386.9I7588116Q60393N28556L42238K47961K31737L37112M66299N53179N10705J90329
1407.3A01856625k79641p50732j011140q50600l65793J72948L91317K80946m3213m68445
$$ y = [91157329, 91347575, 91559601, 91809177, 92058396, 92266506, 92430681, 92571831, 92750484, 93058580, 93512058, 94002050, 94413382, 94710416, 94921881, 95090854, 95220739, 95302695, 95389062, 95556307, 95808953, 96079284, 96322596, 96557266, 96777737, 96943748, 97056234, 97159255, 97303277, 97502989, 97731197, 97945815, 98092794, 98129231, 98047906, 97866815, 97615039, 97328228, 97077644, 96896487, 96734375, 96553737, 96369916, 96198744, 96025831, 95855683, 95747322, 95736635, 95744032, 95675659, 95566934, 95469201, 95341337, 94994277, 94231135, 93418336, 93292373, 94049543, 95250177, 96470135, 97588116, 98448509, 98977065, 99319303, 99567264, 99799001, 100136113, 100602412, 101155591, 101666296, 101856625, 101576984, 100826252, 99815112, 98964512, 98598719, 98771667, 99162984, 99443930, 99400717, 98932272]
1427.7I8932272q77052j092315j013643r96679j034069q47113p33101p37804p57349
1446I0843147r01782j158262j417070j506740j410377j036763o06907n77623p05575
1464.4H1522048Q1074K191061M577893O125962M734278K392066J388764J062500Q80576
1482.8A04956222P07018O05619N06020K93838J24288Q8072j1647j45626K2519L40748
1503.2A07487071O05642N60153R6416m3022M1508J18411J21784R7478O5291k2710n0711
1525.6A09077311m9425l9434K0015r65o1262K5535Q5127j28734k62475k21765j30129
1548A08313799m4954K2280J17123K37775L10397R430j85526o2954N5158J21069Q8835
1570.5A08982432L0947P0881N0152p6902q3888l3056M386M1557O7925N4181J8620j0156
$$ y = [98932272, 98055220, 96962905, 95949262, 94952583, 93918514, 93071401, 92338300, 91600496, 90843147, 89941365, 88783103, 87366033, 85859293, 84448916, 83412153, 82805246, 82227623, 81522048, 81603122, 83794183, 88372076, 94498038, 99232316, 101624382, 103013146, 104075646, 104956222, 105663240, 106268859, 106774879, 107068717, 107193005, 107281077, 107269430, 107123804, 107146323, 107487071, 108092713, 108652866, 108749282, 108706260, 108747768, 108866179, 108987963, 109085441, 109150732, 109128022, 109077311, 109027886, 108988452, 109008467, 109007502, 108946240, 108971775, 109056902, 108928168, 108665693, 108443928, 108313799, 108268845, 108291125, 108408248, 108646023, 108956420, 108965850, 108780324, 108717370, 108772528, 108893597, 108982432, 109013379, 109084260, 109134412, 109057510, 108973622, 108940566, 108944952, 108986509, 109054434, 109108615, 109127235, 109117079]
1594.9A09117079m6551q1420r9576q7380m1855J2231J7929j1658l696K0444o0665j41668
1619.4A08593214j01543j09601j60229j50585j17183o6471J1647l7897k40064k94733
1639.8A07326555k55060j86086j48081j91522j44434m0603k38573m08185k98393j89757
1660.2A05225861j60241j61576k2567K05291L48270L46946M09389L64649J81413J09732
1680.6A06847167P5221j87063m80867n36239n76484m81462l79217l83461n02002p64072
1701A02631521p80630p28428q24118p76267o46174n95277p26986j319963j876718j961935
1721.4I2395025k236390k682602l051877l507876l988141n377519o013740m787230
1737.7F0749650m476720l896719k358765p15026J141122L440493N425865O150359O920707
$$ y = [109117079, 109070528, 108989108, 108889532, 108802152, 108760297, 108772528, 108790457, 108778799, 108775103, 108795547, 108734882, 108593214, 108491671, 108382070, 108221841, 108071256, 107954073, 107887602, 107899249, 107861352, 107621288, 107326555, 107071495, 106885409, 106737328, 106545806, 106401372, 106360769, 106122196, 105714011, 105415618, 105225861, 105065620, 104904044, 104881477, 105086768, 105435038, 105781984, 106191373, 106556022, 106737435, 106847167, 106922388, 106735325, 106254458, 105718219, 105141735, 104660273, 104281056, 103897595, 103395593, 102631521, 101850891, 101122463, 100298345, 99522078, 98875904, 98280627, 97553641, 96233678, 94356960, 92395025, 90158635, 87476033, 84424156, 80916280, 76928139, 71550620, 65536880, 60749650, 56272930, 52376211, 50017446, 49302420, 50443542, 53884035, 59309900, 65460259, 72380966]
1756.1G2380966P306689O449860N589366M157770K808565K163255J669681J301658
1772.4A03827810Q81458N62763M89724M57549L69954L21388K71618K50817K73811K49792
1792.8A07956684J39629J10388J50264J41012R0277P0227J02818J17468J07396P3922
1813.2A09060085P1549P9465P0202P5305R8729J01888Q6820Q4711K4199k003L1376
1835.6A09782326M2355M2236Q2827J03664L4833k2292k3520M435K4807L1662K7573
1858A10130906K0993J9514L7599O0594M5180j7261m4108q976J0729J2612J7441K4497
1882.5A10309720K2793K6691L7610J8788q59O772J0240K193L946R608J7464K2388J7333
1909A10504687j645r120J3483K8455J2374L445J168j8060j3614k419m662J049R823
$$ y = [72380966, 79687655, 86137515, 91726881, 95884651, 98693216, 100856471, 102526152, 103827810, 104709268, 105272031, 105761755, 106219304, 106589258, 106910646, 107182264, 107433081, 107706892, 107956684, 108096313, 108206701, 108356965, 108497977, 108588254, 108658481, 108761299, 108878767, 108986163, 109060085, 109131634, 109211099, 109281301, 109356606, 109455335, 109557223, 109644043, 109728754, 109752953, 109750950, 109782326, 109824681, 109866917, 109949744, 110053408, 110088241, 110065949, 110042429, 110046864, 110071671, 110103333, 110130906, 110151899, 110171413, 110209012, 110269606, 110314786, 110297525, 110253417, 110244441, 110255170, 110267782, 110285223, 110309720, 110332513, 110359204, 110396814, 110415602, 110414743, 110421515, 110431755, 110433948, 110437894, 110447502, 110464966, 110487354, 110504687, 110503042, 110493922, 110507405, 110535860, 110548234, 110551679, 110552847, 110534787, 110521173, 110518754, 110514092, 110515141, 110524964]
1935.5A10524964J2529K4355L8814J6415j3423j1944N304J9491K6047J6320r18m136
1960A10653818P033K1827K1208K133o795L565M744j859j55L612M220J0538J8239J6117
1988.6A10758245J2398m06j4281q237J693J514j753l171l469m196k789j109l46j693
2017.1A10732400r274j1194p856q154p343j824O366J3506J9098J8072J4496J8513J8155
2043.6A10794961P046K885J0824J5664J6355J4174O950J0062K3067K2351O616j633
2068.1A10929322K647P915J2267J9979K3961J7214J1194J2588J6749J8669J7881J9312
2092.6A11109698J6355M244K146P105M077N722J1301J3578J5497J3125N507L136P796
2119.1A11219287J2875J2898N734N519J1051M447o390m268j383m422l46M113m566j2422
$$ y = [110524964, 110537493, 110561848, 110600662, 110617077, 110603654, 110591710, 110597014, 110616505, 110642552, 110658872, 110657954, 110653818, 110660851, 110682678, 110703886, 110706019, 110699224, 110702789, 110707533, 110705674, 110705519, 110709131, 110713351, 110723889, 110742128, 110758245, 110770643, 110770237, 110755956, 110747719, 110749412, 110750926, 110749173, 110746002, 110742533, 110738337, 110735548, 110734439, 110734093, 110732400, 110723126, 110711932, 110704076, 110695922, 110688579, 110686755, 110693121, 110706627, 110725725, 110743797, 110758293, 110776806, 110794961, 110802007, 110804892, 110815716, 110831380, 110847735, 110861909, 110868859, 110878921, 110901988, 110924339, 110930955, 110929322, 110931969, 110939884, 110952151, 110972130, 110996091, 111013305, 111024499, 111037087, 111053836, 111072505, 111090386, 111109698, 111126053, 111130297, 111132443, 111139548, 111143625, 111149347, 111160648, 111174226, 111189723, 111202848, 111208355, 111211491, 111219287, 111232162, 111245060, 111250794, 111256313, 111267364, 111271811, 111265421, 111261153, 111259770, 111255348, 111255002, 111259115, 111254549, 111242127]
2147.7A11242127q237n650o128k420O128J2397R680L910J812K766P796J2207Q595N734
2176.2A11290717R585J2874P951N25M435J3494R048K611P832J1110J1253R406K909
2202.7A11393750n079p176O115J8418J3101L016n12j55M89l70k575n96N710M924Q94
2233.3A11429954k742j0133j3924j2731o080Q857J8382R680n042q262m506m601k194
2259.8A11396658M995N806j79m327j765Q119J6117P736q833j5795j0443J657R453J1719
2288.4A11420918J3875J8514K4724K9444L3975L4905L8778N9271Q1432Q7392Q5485
2310.8A11928713P8929P6318J00827J35708J43003J19698J02151J12772J15799P6998
2331.2A12990916L4809L3164M6205N5004L5250n4455k14565k50566m1652K40350M03571
$$ y = [111242127, 111233890, 111228240, 111222112, 111219692, 111225820, 111238217, 111247897, 111251807, 111253619, 111256385, 111264181, 111276388, 111284983, 111290717, 111300302, 111313176, 111321127, 111321652, 111326087, 111339581, 111348629, 111351240, 111359072, 111370182, 111381435, 111390841, 111393750, 111388671, 111381495, 111387610, 111406028, 111419129, 111422145, 111421633, 111421478, 111421967, 111421597, 111419022, 111418426, 111424136, 111429060, 111429954, 111427212, 111417079, 111403155, 111390424, 111384344, 111393201, 111411583, 111421263, 111416221, 111407959, 111403453, 111398852, 111396658, 111401653, 111407459, 111407280, 111402953, 111401188, 111409307, 111425424, 111433160, 111424327, 111408532, 111398089, 111399746, 111409199, 111420918, 111434793, 111453307, 111478031, 111507475, 111541450, 111576355, 111615133, 111674404, 111755836, 111843228, 111928713, 112007642, 112083960, 112184787, 112320495, 112463498, 112583196, 112685347, 112798119, 112913918, 112990916, 113025725, 113058889, 113105094, 113160098, 113195348, 113140893, 112926328, 112675762, 112634110, 112874460, 113278031]
2353.6A13278031L76904K48456R4140l6812j26648k05970k70235k96676k88606k57158
2374A12515426k36011k25186j98627j60444j10399n8294l0636j2529L099l636j0526
2396.5A11472237k646L004M303L827K658l93l46M757j55o164L946Q953J240K253J1325
2427.1A11508799J3053K301m232L564J0491O842R30k158n233J538R227J859m232o485
2455.6A11536264q392o67J037p868l910P879P213k718j1313j5402j1385m041l302m351
2484.2A11479044l719p952j1456j0323j3578j6844j1802l207l481j4007k4831k9409
2508.7A11328435k0647j0145j2398j7666k0421k2733k1219j5581j0514j2100j1599
2531.1A11153412l755r18m339r299j0669l517M530j025j1682q989m899r406j5843j8191
$$ y = [113278031, 113654935, 113903391, 113997531, 113960719, 113834071, 113628101, 113357866, 113061190, 112772584, 112515426, 112279415, 112054229, 111855602, 111695158, 111584759, 111526465, 111495829, 111483300, 111486399, 111482763, 111472237, 111469591, 111472595, 111476898, 111480725, 111483383, 111482990, 111482644, 111487401, 111487246, 111481082, 111485028, 111493981, 111495221, 111497474, 111508799, 111521852, 111524153, 111519921, 111523485, 111533976, 111540818, 111541748, 111539590, 111534357, 111535895, 111545122, 111546981, 111542749, 111536264, 111527872, 111527205, 111528242, 111520374, 111516464, 111524343, 111531556, 111528838, 111517525, 111502123, 111490738, 111486697, 111483395, 111479044, 111475325, 111467373, 111455917, 111445594, 111432016, 111415172, 111403370, 111400163, 111396682, 111382675, 111357844, 111328435, 111307788, 111297643, 111285245, 111267579, 111247158, 111224425, 111203206, 111187625, 111177111, 111165011, 111153412, 111149657, 111148739, 111144400, 111135101, 111124432, 111120915, 111125445, 111124420, 111112738, 111103749, 111098850, 111089444, 111073601, 111055410]
2559.6A11055410j5664j8466k5594k8646k8503k7287k7156k4974k0397k0230j8859
2582.1A10799634j6486k4975l2126k9755k7216k2637k0564k9588l5155k8717k3389
2604.5A10509026j7488j1313j9538l1269k6846j7977k6536m3213n1773n0020m0507
2626.9A10172546l3414k9362k8944l1602k3234q476n781j3161k0456k6966k7775l1233
2651.4A09892142m8876n9426m7397l8982n8889p4876o0856m1854l1138j7738n376j0825
2675.9A09395909k1505r847J7929L5107L7206L7300L5894L3224L6847L6598K6035J7440
2700.4A09678137J5819J5331J454j5557j7452k1172l1507k9695k7334m3512n8126n5695
2724.8A09410691l3617j549J4054J7441J5604J4985K7978L3593J8144n531j5283k38
$$ y = [111055410, 111039746, 111021280, 110995686, 110967040, 110938537, 110911250, 110884094, 110859120, 110838723, 110818493, 110799634, 110783148, 110758173, 110726047, 110696292, 110669076, 110646439, 110625875, 110596287, 110561132, 110532415, 110509026, 110491538, 110480225, 110460687, 110429418, 110402572, 110384595, 110358059, 110314846, 110263073, 110213053, 110172546, 110139132, 110109770, 110080826, 110049224, 110025990, 110017514, 110011733, 109998572, 109978116, 109951150, 109923375, 109892142, 109843266, 109783840, 109736443, 109697461, 109638572, 109563696, 109502840, 109460986, 109429848, 109412110, 109406734, 109395909, 109374404, 109364557, 109382486, 109417593, 109454799, 109492099, 109527993, 109561217, 109598064, 109634662, 109660697, 109678137, 109693956, 109709287, 109710741, 109695184, 109677732, 109656560, 109625053, 109595358, 109568024, 109524512, 109466386, 109410691, 109377074, 109375525, 109389579, 109407020, 109422624, 109437609, 109465587, 109499180, 109517324, 109511793, 109496510, 109496272]
2749.3A09496272J4042O152j3805k9564l6275l1221k5880l3856m7695o6042r4223j13380
2773.8A09024525r8956q9681j21951j54996j65212j81115j99342j87897j72949j92416
2794.2A07460010k26521k39182k34544k48873k81632l12972l47293l74722l96026m44030
2814.6A04354215n19288o02090o88565p87890r07719j044130j207930j414407j679945
2832.9I5502251k078414k714192l631509m801434o030107o899517o981761o088841
2849.3E6276476m294175j890367O15311K705544M055435M578518M349268L523678K416759
2867.6G2336447J545185J343626J682347J919544J596635Q36307J1212o76340j200026
2886G9394937j573092j809013j936090j983976j997054k033174k103108k202368k358347
$$ y = [109496272, 109510314, 109516466, 109502661, 109473097, 109436822, 109405601, 109379721, 109345865, 109298170, 109232128, 109137905, 109024525, 108925569, 108835888, 108713937, 108558941, 108393729, 108212614, 108013272, 107825375, 107652426, 107460010, 107233489, 106994307, 106759763, 106510890, 106229258, 105916286, 105568993, 105194271, 104798245, 104354215, 103834927, 103232837, 102544272, 101756382, 100848663, 99804533, 98596603, 97182196, 95502251, 93423837, 90709645, 87078136, 82276702, 76246595, 69347078, 62365317, 56276476, 51982301, 50091934, 50707245, 53412789, 57468224, 62046742, 66396010, 69919688, 72336447, 73881632, 75225258, 76907605, 78827149, 80423784, 81260091, 81271303, 80594963, 79394937, 77821845, 76012832, 74076742, 72092766, 70095712, 68062538, 65959430, 63757062, 61398715]
2904.3F1398715k586216k876681l203172l507491l691233l625294l208259k451006
2920.6C6249363j480794m84105M11897J171327J792148K355808K904323L338241L572488
2939D9830696L580907L324062K782803K002001J154489N10960K77144N00190J040894
2957.4F5004146J695210K338004K885729L266239L418756L326148L050535K686030
2973.7H7670797K318126J980013J663923J390558J174856R95117Q22026O19661L79903
2992I9014980R3412k73913o82843j070839j372749j440370j162642n62245K29210J031911
3012.4I3803912J677639K036678K079607J885128J567733J237523R58920P18784N13137
3030.8A06479061L79514L14749K75111K06554J20222R0158J16027J30748J14882J13714
$$ y = [61398715, 58812499, 55935818, 52732646, 49225155, 45533922, 41908628, 38700369, 36249363, 34768569, 34284464, 34696361, 35867688, 37659836, 40015644, 42919967, 46258208, 49830696, 53411603, 56735665, 59518468, 61520469, 62674958, 63185918, 63463062, 63963252, 65004146, 66699356, 69037360, 71923089, 75189328, 78608084, 81934232, 84984767, 87670797, 89988923, 91968936, 93632859, 95023417, 96198273, 97193390, 98015416, 98635077, 99014980, 99108392, 98834479, 98151636, 97080797, 95708048, 94267678, 93105036, 92542791, 92772001, 93803912, 95481551, 97518229, 99597836, 101482964, 103050697, 104288220, 105247140, 105965924, 106479061, 106858575, 107173324, 107448435, 107654989, 107775211, 107865369, 107981396, 108112144, 108227026, 108340740]
3051.2A08340740J29211J18911R3937P4518N3489L9065L6609O0702J06299J19722R3913
3073.6A09267116N2666K4164M2415P1942P1705O4242O1381N8364N5826M3130K0516
3096A09833467m446q607J0776J443l7349l6931J2732L1125k002j1850K2471O6710R6166
3122.6A09973705Q8727M2010O652K5033M4954J4556k8932k7883J4186L6740K4545J1480
3147A10225773q595k9779K349N9128O0224K7585J3387J0622M53o449Q321K4187J5783
3173.5A10402989k586q810L219J5366O211j1242j1539O151K2280K7502J9478P379L338
3200.1A10479736N49M482J8537K0611M793l303P940K0206J2481j586K552J4972J4246
3226.6A10596216o521m2498n5134q47N9903O1107L0028j1253m9603m0507J8596M6516
$$ y = [108340740, 108469951, 108588862, 108682799, 108757317, 108810806, 108849871, 108886480, 108947182, 109053481, 109173203, 109267116, 109319782, 109343946, 109386361, 109458303, 109530008, 109594250, 109655631, 109713995, 109769821, 109812951, 109833467, 109829021, 109820414, 109831190, 109832633, 109795284, 109758353, 109771085, 109802210, 109800208, 109788358, 109810829, 109877539, 109973705, 110062432, 110104442, 110111094, 110136127, 110181081, 110195637, 110166705, 110138822, 110153008, 110189748, 110214293, 110225773, 110217178, 110187399, 110189748, 110248876, 110309100, 110336685, 110350072, 110360694, 110361147, 110354698, 110363019, 110387206, 110402989, 110400403, 110391593, 110394812, 110410178, 110416389, 110405147, 110393608, 110399759, 110422039, 110449541, 110469019, 110476398, 110479736, 110480285, 110484767, 110503304, 110523915, 110528708, 110525405, 110533345, 110553551, 110566032, 110564446, 110566998, 110581970, 110596216, 110589695, 110547197, 110492063, 110491216, 110551119, 110612226, 110642254, 110631001, 110581398, 110540891, 110559487, 110606003]
3251.1A10606003J3387j5450k408R406m625p570m816m1330q2362m6563K0981M1389
3275.5A10486042K9123N162j1623j7106j9813k1517m0102n4467l1590K884K7848K4032
3300A10378873l9243j09136q6320J2946Q3781Q2850L6252k87J979j168l7003n1283
3324.5A10272241r299K6107J3626p451l4189p2002n8985m149K0445K0301m303n4384
3348.9A10107958l8802L3796M2092o795m8613o1453n0079o6114r1815m5037N2297R5630
3373.4A09923065P0178N4443O1226N8115M4751K3794n770l8409k4891M0197M4549l8839
3397.9A10212409p6496P999R7287O2394j9729m0889j9562J4269L5107J7893n603j3577
3422.4A10271502l6729q1944r7931n5372l6777o6638l7515M3094O3801J5354k8419
$$ y = [110606003, 110619390, 110603940, 110601532, 110610938, 110606313, 110598743, 110593927, 110552597, 110470235, 110423672, 110444653, 110486042, 110515165, 110520327, 110508704, 110491598, 110471785, 110450268, 110410166, 110355699, 110324109, 110326993, 110354841, 110378873, 110339630, 110230494, 110144174, 110157120, 110240901, 110323751, 110360003, 110359716, 110361695, 110360527, 110323524, 110272241, 110262942, 110289049, 110302675, 110295224, 110261035, 110189033, 110130048, 110125899, 110146344, 110166645, 110162342, 110107958, 110069156, 110102952, 110145044, 110138249, 110089636, 110028183, 109978104, 109911990, 109820175, 109775138, 109827435, 109923065, 109993243, 110047686, 110108912, 110167027, 110211778, 110235572, 110229802, 110191393, 110166502, 110206699, 110251248, 110212409, 110135913, 110143912, 110241199, 110303593, 110283864, 110242975, 110223413, 110237682, 110272789, 110290682, 110285079, 110271502, 110234773, 110152829, 110054898, 109999526, 109962749, 109896111, 109858596, 109901690, 109965491, 109980845, 109952426]
3444.8A09952426m4882n8496o4457n7459n3036o2907q3112p4971o6757j33682j70528
3467.2A09082139l1710J52242J64306N9724k9993k3293J04188J26899J6653J7453P7009
3489.7A09715617L6657l7611n3072j1444L946l3987J490O0010K3711n1165j17051r8872
3514.2A09438229q822K4414k3162p5734n0068K3115K8789q428j5748j7130q893J4842
3538.6A09321404J6677J9216O1608J08564R7477P2289Q9454Q8048N3954M5884P0870
3561.1A10045445J21760J77110J38866M948k7311L0434N8317N7399M4084L0303N5945
3583.5A10737300J11532R4950l7527r9897n5409l2901k3878L4916Q3006R7585J34801
3605.9A11044478J60122J17314O6233L9708M4215O1572P63m5085K8705J36578J46318
$$ y = [109952426, 109907544, 109849048, 109784591, 109727132, 109674096, 109611189, 109528077, 109453106, 109386349, 109252667, 109082139, 109050429, 109202671, 109366977, 109426701, 109396708, 109373415, 109477603, 109604502, 109621155, 109638608, 109715617, 109752274, 109714663, 109661591, 109650147, 109654093, 109620106, 109621596, 109681606, 109705317, 109654152, 109537101, 109438229, 109429407, 109453821, 109430659, 109354925, 109304857, 109327972, 109356761, 109348333, 109332585, 109315455, 109306562, 109321404, 109338081, 109357297, 109418905, 109527469, 109624946, 109697235, 109786689, 109874737, 109928691, 109974575, 110045445, 110167205, 110344315, 110483181, 110488129, 110460818, 110491252, 110549569, 110606968, 110651052, 110681355, 110737300, 110848832, 110943782, 110906255, 110806358, 110750949, 110718048, 110694170, 110729086, 110812092, 110909677, 111044478, 111204600, 111321914, 111388147, 111427855, 111472070, 111533642, 111534405, 111489320, 111518025, 111654603, 111800921]
3628.4A11800921k9075j16527o2275k4128j1647q070L218N7280J33074R9647o0201
3650.8A11782217r4783l0983m0531q9419m1115L2604N6600R9445J48201Q1241L7324
3673.2A11940801O1202n9461j39130q2731k5368J2851O0356R2494L7301l7360m4954
3695.7A11816001o926L9601M8912J979o843M3571P1645P999p3564n3609M912M4048
3720.1A11937726N3823L3497K742j0764L9649J15621P7092q7964j49369l3379J31011
3742.6A12109685J44613k5344m0865l719r7824j20127m7850j2672m0484l3390J9610
3765A11851633M4071L0244m0496r4926m7600K9873N4336J2398j5080k3627m8459l6538
3789.5A11715829J2446N3203P0643P2074Q4305M0197n3024n1272n8043p8404m828Q6701
$$ y = [111800921, 111771846, 111655319, 111593044, 111568916, 111557269, 111549199, 111552417, 111609697, 111742771, 111842418, 111782217, 111687434, 111656451, 111615920, 111526501, 111485386, 111517990, 111574590, 111674035, 111822236, 111903477, 111940801, 112002003, 111942542, 111803412, 111720681, 111695313, 111708164, 111768520, 111861014, 111898315, 111860955, 111816001, 111809075, 111848676, 111897588, 111899567, 111892724, 111936295, 112007940, 112015939, 111942375, 111888766, 111893678, 111937726, 111991549, 112025046, 112027788, 112017024, 112056673, 112172294, 112249386, 112161422, 112012053, 111978674, 112109685, 112254298, 112228954, 112188089, 112184370, 112086546, 111966419, 111918569, 111905897, 111865413, 111832023, 111851633, 111895704, 111925948, 111885452, 111790526, 111742926, 111772799, 111827135, 111839533, 111824453, 111800826, 111752367, 111715829, 111728275, 111781478, 111852121, 111924195, 112008500, 112048697, 111995673, 111944401, 111886358, 111807954, 111803126, 111889827]
3814A11889827Q8287K9730K5559l3689r1493l7420o532N233L1722L4046O1905P3409
3838.4A12070584k0778r6106j01757n6243M8542J75535K18499r036j93417j27363l195
3860.9A11905265P1323M0090k1410k8539l2496m3893m9842r536O9689L8457k9516j1992
3885.4A11897600j5819j6117r633m3070j6796P4791J21618P4029k9970j18899j12295
3907.8A11805439n2714j4723K2590M2999M697l2568k0087P749N579J025J6344J323
3932.3A11787653m6706n6136j1325L7182L9863j132j3447l886k3103k9063o92M971
3956.7A11684179j9061j7882k312k206o997m995k921j2529j9025p892R572N591j4698
3983.3A11588824k0707j9288j7047m077K027k480L82
$$ y = [111889827, 111978114, 112007844, 112033403, 111999714, 111908221, 111870801, 111864269, 111869502, 111901224, 111935270, 111997175, 112070584, 112049806, 111953700, 111851943, 111795700, 111844242, 112019777, 112238276, 112229240, 112035823, 111908460, 111905265, 111976588, 112016678, 111995268, 111966729, 111934233, 111890340, 111840498, 111830962, 111900651, 111939108, 111909592, 111897600, 111881781, 111865664, 111856031, 111812961, 111796165, 111870956, 111992574, 112066603, 112036633, 111917734, 111805439, 111752725, 111738002, 111760592, 111803591, 111808288, 111775720, 111755633, 111763382, 111768961, 111769986, 111786330, 111787653, 111740947, 111684811, 111673486, 111710668, 111750531, 111749399, 111735952, 111732066, 111708963, 111679900, 111679208, 111684179, 111665118, 111647236, 111644924, 111642718, 111635721, 111630726, 111627805, 111615276, 111596251, 111588359, 111597931, 111603522, 111588824, 111568117, 111548829, 111531782, 111527705, 111529732, 111527252, 111527634]
3997.5A11527634
$$ y = [111527634]
##END=$$ End of the data block
