##TITLE=A2 Amorfo $$ Begin of the data block
##JCAMP-DX=5.00 $$ ACD/SpecManager v 10.08
##SPECTROMETER/DATA SYSTEM=Alpha
##DATE=22 Jul 2015 08:20:50
##DATA TYPE=INFRARED SPECTRUM
##DATA CLASS=XYDATA
##ORIGIN=
##OWNER=
##NPOINTS=1765
##FIRSTX=399.76428223
##LASTX=3997.64306641
##MAXX=3997.64306641
##MINX=399.76428223
##MAXY=0.87760907
##MINY=0.26272967
##XFACTOR=1.0000000000
##YFACTOR=1.000000000000000e-9
##FIRSTY=0.81057417
##DELTAX=2.03961372
##XUNITS=1/CM
##YUNITS=ARBITRARY UNITS
##XYDATA=(X++(Y..Y))
399.8H10574174J543105N44786K349377K779305Q56399J137197K947450K046764M99427
418.1H25277984J838207K381206P08163J099586K816320J617610l39150Q87930K161503
436.5H38449359O91414K74956J990318J555622m95076K48790J850843O41465n54025
454.8H44653666R32515J596749j48654j84179J336694N30302j056849O3240J259983
473.2H48983467l37899j052559O76096O40094j383006j061917N47529m30525j747548
491.5H44833732k77579O11126j337409k025187m15802o51061k242983j442671k90215
509.9H36761951j746654k648175j140177r79424k816021k615392j073838j831352l294170
528.3H18616748k309084j290858k693951l518701k328515k408206l939688l697574
$$ y = [810574174, 812117279, 812662065, 815011442, 817790747, 818647146, 819784343, 822731793, 824778557, 825277984, 827116191, 829497397, 830205560, 831305146, 834121466, 835739076, 835399926, 836287856, 838449359, 839140773, 839415729, 841406047, 842961669, 842466593, 842715383, 844566226, 845207691, 844653666, 845586181, 847182930, 847034276, 846850097, 848186791, 848717093, 847660244, 847723484, 848983467, 848645568, 847593009, 848269105, 848909199, 847526193, 846464276, 847011805, 846581280, 844833732, 844556153, 845167279, 843829870, 841804683, 841388881, 840737820, 838494837, 837052166, 836761951, 835015297, 832367122, 831226945, 830247521, 827431500, 824816108, 823742270, 821910918, 818616748, 816307664, 815016806, 812322855, 808804154, 806475639, 804067433, 800127745, 796430171]
544.6G96430171k616287l501355m568816l666162l195942m593968n151808m218996
560.9G64916837m367947n597353n646766n114674n956829p058561o792664o588698
577.2G17793345p717728q528471q217156q785188j0407448j1117518j1408746j2824893
593.5F38786197j4509380j5455485j6975939j9823253k2796690k5303841k7822405
607.8D96099204k8875679k5911152j7860145n339116R372622K1587670K7437449K6892453
624.1E03403306K1697700J4025509M221142o400466j2731791r337902K515555J5396714
640.4E32789767K3233056K4993181K3264349K1265685K0219147J8331945J5037477
654.7F79134607J2415231J1668980J0836780Q900463P350505Q518636J0063708P192612
$$ y = [796430171, 793813884, 790312529, 785743713, 782077551, 778881609, 774287641, 769135833, 764916837, 760548890, 754951537, 749304771, 744190097, 738233268, 731174707, 724382043, 717793345, 710075617, 701547146, 693329990, 684544802, 674137354, 663019836, 651611090, 638786197, 624276817, 608821332, 591845393, 572022140, 549225450, 523921609, 496099204, 467223525, 441312373, 423452228, 418113112, 427485734, 449073404, 476510853, 503403306, 525101006, 539126515, 543347657, 536947191, 524215400, 514877498, 517393053, 532789767, 556022823, 581016004, 604280353, 625546038, 645765185, 664097130, 679134607, 691549838, 703218818, 714055598, 722956061, 730306566, 738825202, 748888910, 756081522]
671G56081522O478548P421374O634295N696237O157517O181181M941642M574657N228281
689.4H09395254M750609L627777L888071M468381L700912K878845L403485L702938
705.7H39816272K747000K353131L035665K807498J636267J669585K478183K168536
722H58712137J551389K154291K574980J644135J018703J542270J576543O47187N31078
740.4H71952713J189529Q91209J18435N28216J161396N27800q5712N08666P95841o9976
760.8H77518117l69250K97308J62899p27773n44548K18571r6739o41465p1347L89934
781.2H76135707l44932p33495l9995O5208p61092p33554J2636k75374j000165n49376
801.6H71775568Q4102n01275j021922m41372k32101j067996j291215o44684p56443
$$ y = [756081522, 762560070, 769981444, 776615739, 782311976, 788469493, 794650674, 799592316, 804166973, 809395254, 814145863, 817773640, 821661711, 826130092, 829831004, 832709849, 836113334, 839816272, 842563272, 844916403, 847952068, 850759566, 852395833, 854065418, 856543601, 858712137, 860263526, 862417817, 864992797, 866636932, 867655635, 869197905, 870774448, 871421635, 871952713, 873142242, 874033451, 874151886, 874680102, 875841498, 876369298, 876283586, 876792252, 877588093, 877518117, 877148867, 877446175, 877609074, 876881301, 876336753, 876555324, 876458585, 875817120, 875745773, 876135707, 875790775, 875057280, 875017285, 875082493, 874321401, 873587847, 873600483, 873325109, 872324944, 871775568, 871859670, 871358395, 870336473, 869895101, 869663000, 868595004, 867303789, 866659105, 865902662]
819.9H65902662j426339j153231n69164j040399j609981j197219r43423j613915j890659
838.3H54458332j323163j286805j916051j896441j441181j758992k266169j917422
854.6H40652108j529872j981497k340853j928807j762926k282918k392768j900018
870.9H24532449j939654k460778k391338j997411k215207k536237k214969j993715
887.2H06783140k448201k737701k366364k196491k556265k533257k091407k176524
903.5G87676930k615094k512991k229691k562463k963066k721608k482891k832591
919.9G66756535l042698k695382k627730l071368l063440k621890k776920l276825
936.2G43580282l153086k811849l069222l356516l083945k982139l413856l559292
$$ y = [865902662, 864476323, 863323092, 862753928, 861713529, 860103548, 858906329, 857962906, 856348991, 854458332, 853135169, 851848364, 849932313, 848035872, 846594691, 844835699, 842569530, 840652108, 839122236, 837140739, 834799886, 832871079, 831108153, 828825235, 826432467, 824532449, 822592795, 820132017, 817740679, 815743268, 813528061, 810991824, 808776855, 806783140, 804334939, 801597238, 799230874, 797034383, 794478118, 791944861, 789853454, 787676930, 785061836, 782548845, 780319154, 777756691, 774793625, 772072017, 769589126, 766756535, 763713837, 761018455, 758390725, 755319357, 752255917, 749634027, 746857107, 743580282, 740427196, 737615347, 734546125, 731189609, 728105664, 725123525, 721709669, 718150377]
952.5G18150377l242492l303409l705204l629505l303826l495395l831744l688395
968.8F89950407l594757l951013l912091l253043l172934l819346m044294l751874
985.1F60451055l740251l928245l691554l405630l680766m034638l947616l832340
1001.4F30190015m034341m161536m047573m127860m422963m446387m259765m334867
1017.8E96354723m547954m483282m381716m611016m853308m799068m758537m942298
1034.1E58977544n010009m877686m926085n174876n274951n247891n402982n653143
1050.4E17409921n692900n659580n848408o058424o056309o080985o302476o471276
1066.7D69239563o491095o642938o995380p247507p327020p507027p748186p841587
$$ y = [718150377, 714907885, 711604476, 707899272, 704269767, 700965941, 697470546, 693638802, 689950407, 686355650, 682404637, 678492546, 675239503, 672066569, 668247223, 664202929, 660451055, 656710804, 652782559, 649091005, 645685375, 642004609, 637969971, 634022355, 630190015, 626155674, 621994138, 617946565, 613818705, 609395742, 604949355, 600689590, 596354723, 591806769, 587323487, 582941771, 578330755, 573477447, 568678379, 563919842, 558977544, 553967535, 549089849, 544163764, 538988888, 533713937, 528466046, 523063064, 517409921, 511717021, 506057441, 500209033, 494150609, 488094300, 482013315, 475710839, 469239563, 462748468, 456105530, 449110150, 441862643, 434535623, 427028596, 419280410, 411438823]
1083D11438823p992059q431763q898139q972257q515686p838726p559329p716805p500470
1101.4C38013589o673723o282955p024110q250236q885295q498847p473409o325752
1117.7B78599262n177915m022956l063172k307564j297980M68850K904355N511731
1134B71614611P888705R659350J0503798J0427803R777784Q781761P498384O184250
1150.3C42336446N147308M411251L927052L788679M075140M727394N642622O864101
1166.7C80919993Q380145R946614J1375249J2578070J3239890J3030142J2086630J0786026
1183D72342759R264082P580280O059885M953444M223109L910839M091382M507959M708827
1201.3E21642566M580557M376173M115462L667236L280401L169537L059625K781332
$$ y = [411438823, 403446764, 395015001, 386116862, 377144605, 368628919, 360790193, 353230864, 345514059, 338013589, 331339866, 325056911, 318032801, 309782565, 300897270, 292398423, 284925014, 278599262, 273421347, 269398391, 266335219, 264027655, 262729675, 263198525, 266102880, 271614611, 279503316, 289162666, 299666464, 310094267, 319872051, 328653812, 336152196, 342336446, 347483754, 351895005, 355822057, 359610736, 363685876, 368413270, 374055892, 380919993, 389300138, 399246752, 410622001, 423200071, 436439961, 449470103, 461556733, 472342759, 481606841, 489187121, 495247006, 500200450, 504423559, 508334398, 512425780, 516933739, 521642566, 526223123, 530599296, 534714758, 538381994, 541662395, 544831932, 547891557, 550672889]
1217.7E50672889K611577K617777K486467K239883K192497K238155K064585J817525
1234E68941355J815438J899540J790882J689136J788079J848698J752436J742423J861453
1252.3E85129440J811325J613856J576304J627565J533329J425743J487076J533628
1268.6E97738266J449704J437485J553834J582622J494408J496136J578927J540304
1285F09871686J423001J429796J464129J367509J259208J264870J272857J183808J119852
1303.3F21656716J143277J152157J100064J070916J085341J085699J080334J131296
1319.6F30505800J194537J175046J105249J069844J079738J057744R93371R28581R14156
1338F40024066R65297J022220J045525J017868R28522Q53836R04799R67562Q84235
$$ y = [550672889, 553284466, 555902243, 558388710, 560628593, 562821090, 565059245, 567123830, 568941355, 570756793, 572656333, 574447215, 576136351, 577924430, 579773128, 581525564, 583267987, 585129440, 586940765, 588554621, 590130925, 591758490, 593291819, 594717562, 596204638, 597738266, 599187970, 600625455, 602179289, 603761911, 605256319, 606752455, 608331382, 609871686, 611294687, 612724483, 614188612, 615556121, 616815329, 618080199, 619353056, 620536864, 621656716, 622799993, 623952150, 625052214, 626123130, 627208471, 628294170, 629374504, 630505800, 631700337, 632875383, 633980632, 635050476, 636130214, 637187958, 638181329, 639109910, 640024066, 640989363, 642011583, 643057108, 644074976, 645003498, 645857334, 646762133, 647729695, 648613930]
1356.4F48613930P74204P82371Q14021P85350P63536P72357P00772N39481N44072O57081
1376.7F55747175M89652Q3566O5982P76887J549185J669109J354515R87530O83427
1395.1F63407028O75082Q19921P70748N96106O67334Q55803P57277O32107P45595P37250
1415.5F70664251L90708K17855M92335O34372N90086O33716O67274M60744K44141M71592
1435.9F75467074R37164Q98778O96600P22944O46234M11868M68373O70612N10752J18912
1456.3F81549311L55899Q84354P41840M84585P02560R19998O74188M79877O91295P45237
1476.7F88229144O02603O83009Q67367P39038M29273M09424O66916O52910M38749M64261
1497.1F94182694O11544N85854N45919M29511K43246M27544P31528Q12769N60582L37481
$$ y = [648613930, 649388134, 650170505, 650984526, 651769876, 652533412, 653305769, 654006541, 654546022, 655090094, 655747175, 656236827, 656320393, 656386375, 657163262, 658712447, 660381556, 661736071, 662723601, 663407028, 664082110, 664902031, 665672779, 666268885, 666936219, 667792022, 668549299, 669181406, 669927001, 670664251, 671054959, 671272814, 671765149, 672399521, 672989607, 673623323, 674290597, 674751341, 674995482, 675467074, 676404238, 677303016, 677999616, 678722560, 679368794, 679780662, 680249035, 680919647, 681430399, 681549311, 681905210, 682789564, 683531404, 684015989, 684718549, 685638547, 686312735, 686792612, 687483907, 688229144, 688831747, 689514756, 690382123, 691121161, 691550434, 691959858, 692626774, 693279684, 693718433, 694182694, 694794238, 695380092, 695926011, 696355522, 696598768, 697026312, 697757840, 698570609, 699131191, 699468672]
1517.5F99468672M26948M85301L88325L98695O16372O75797L62277K35439N27262M14074
1537.9G03999162q5473P7784M79698L83317J89722J98185K12551M828j62662k92301
1558.3G05004811j16169K75254K96652K39015l9935l00348l5405n8711n64158n12123
1578.7G04188883k15590l76343p49708r08017q55803j004696j301468j378893j353264
1597F96045101j605869j978397k058327k001465k124011k205134k019524j924873k346634
1615.4F77780867k428413j305342p39634q84592o40512l12149k49148k0206L59834
1633.7F71560705P19428J052618J429915J915694K230167K515256K956689K837538
1650.1F87218010K723515L149450K955079K606213K410830K311825K355516K107740
$$ y = [699468672, 699895620, 700380921, 700769246, 701167941, 701784313, 702460110, 702822387, 703057826, 703585088, 703999162, 703913689, 703991473, 704471171, 704854488, 705044210, 705242395, 705454946, 705459774, 705297112, 705004811, 704888642, 705163896, 705460548, 705699563, 705659628, 705359280, 705323875, 705265164, 704701006, 704188883, 703973293, 703596950, 702847242, 701939225, 701083422, 700078726, 698777258, 697398365, 696045101, 694439232, 692460835, 690402508, 688401043, 686277032, 684071898, 682052374, 680127501, 677780867, 675352454, 674047112, 673307478, 672422886, 671782374, 671470225, 671221077, 671200871, 671560705, 672280133, 673332751, 674762666, 676678360, 678908527, 681423783, 684380472, 687218010, 689941525, 693090975, 696046054, 698652267, 701063097, 703374922, 705730438, 707838178]
1666.4G07838178J706838J625300J664579J445830J202583J189530J208484R41574
1682.7G18822896P55728J046955J076401Q49664O84440N73754N25415M68135O18696
1701.1G25422084Q91567P04765M79877N69403O41286M59075K00868K18332M83632N03719
1721.5G30574608L73304L93808L72827K64525K00451J47700L21209M41075L46779L40462
1741.9G33776748L37422K71857K40981J68920K21252L98279M19557L51071K37823K09093
1762.2G36633003L72052L38852J65761J38759J82748L07024L81589L34978K89619K34067
1782.6G39378452J81318K83479L43025J34647M2677K72095L31521J45614J01447K71142
1803G41485417K96831J68562J44720J83940J50740J37389K20418K64764J62243P5758
$$ y = [707838178, 709545016, 711170316, 712834895, 714280725, 715483308, 716672838, 717881322, 718822896, 719578624, 720625579, 721701980, 722551644, 723236084, 723809838, 724335253, 724803388, 725422084, 726313651, 727018416, 727498293, 728067696, 728708982, 729168057, 729368925, 729587257, 730070889, 730574608, 730947912, 731341720, 731714547, 731979072, 732179523, 732327223, 732648432, 733089507, 733436286, 733776748, 734114170, 734386027, 734627008, 734795928, 735017180, 735415459, 735835016, 736186087, 736423910, 736633003, 737005055, 737343907, 737509668, 737648427, 737831175, 738138199, 738519788, 738854766, 739144385, 739378452, 739559770, 739843249, 740186274, 740320921, 740363598, 740635693, 740967214, 741112828, 741214275, 741485417, 741782248, 741950810, 742095530, 742279470, 742430210, 742567599, 742788017, 743052781, 743215024, 743290782]
1823.4G43290782J61469J96278P9095J88590L71575K42054R4593J88708J97292o378
1843.8G45004058N6803L18945L12149J50919J23382J97827J41144O3777J65403K40326
1864.2G46774733Q2552n3286J20103K65122J46627R5606J93119J61529M9650R3401
1884.6G47929156J59979N0366K3543J83404J93715O0916M8280J34349J07944J9848
1905G48911500P0095J71423J39892O8128P1943O1750K5094L9399J20580J57654P9334
1927.5G49916792N8293J12534P9691K4140O7949R8885L3974L5107J20223J10984L2961
1949.9G50691533J8418O9678Q7797O0499P0691R1911M9591M708O2824J28329Q5055
1972.3G51421034L1531N9366Q7798N6326N6386Q9348O4909K8134M2259Q2195J03712
$$ y = [743290782, 743452251, 743648529, 743727624, 743916214, 744287789, 744529843, 744624436, 744813144, 745010436, 745004058, 745060861, 745379806, 745691955, 745842874, 745966256, 746164083, 746305227, 746369004, 746534407, 746774733, 746857285, 746803999, 746924102, 747189224, 747335851, 747431457, 747624576, 747786105, 747835755, 747929156, 748089135, 748139501, 748163044, 748346448, 748540163, 748601079, 748649359, 748783708, 748891652, 748911500, 748981595, 749153018, 749292910, 749361038, 749432981, 749494731, 749519825, 749559224, 749679804, 749837458, 749916792, 749975085, 750087619, 750167310, 750191450, 750259399, 750358284, 750392258, 750427365, 750547588, 750658572, 750691533, 750709951, 750779629, 750867426, 750927925, 750998616, 751090527, 751140118, 751144826, 751207650, 751335979, 751421034, 751452565, 751511931, 751599729, 751656055, 751712441, 751801789, 751866698, 751894832, 751937091, 752019286, 752122998]
1994.8G52122998P5281O7294J08063R9778O2227P4387R1433O6102O4671Q1897J5556
2017.2G52929687j22904k52307m25756l64721K93434P97629N94378K64704J56164J79291
2037.6G54049599J84834J33753J36197J81973J60098J10745J50144K10941J91271J56641
2058G55666196J78576J87039J52588J53005K03192K19584J96040J65641Q2314q7798
2078.4G57116377l73661q46744j549005k441764l436387m244446m189373k870380j066208
2096.8G36098409l7194j5676k88784m39584o21558q21471o15299J80841J109898J658738
2117.1G36208320J804232J730085J543581J325071J122415R49085P73966N67317L51012
2135.5G46375084J49131K1040K2769J11759K13742K81692L00765L15845L61740M03524
$$ y = [752122998, 752198279, 752265573, 752373636, 752473414, 752535641, 752610028, 752701461, 752767563, 752832234, 752914131, 752929687, 752806783, 752554476, 752128720, 751763999, 752057433, 752855062, 753449440, 753714144, 753870308, 754049599, 754234433, 754368186, 754504383, 754686356, 754846454, 754957199, 755107343, 755318284, 755509555, 755666196, 755844772, 756031811, 756184399, 756337404, 756540596, 756760180, 756956220, 757121861, 757204175, 757116377, 756742716, 755895972, 754346967, 751905203, 748468816, 744224370, 740034997, 737164617, 736098409, 736061215, 736045539, 735756755, 735317171, 734695613, 733874142, 733258843, 733439684, 734549582, 736208320, 738012552, 739742637, 741286218, 742611289, 743733704, 744682789, 745456755, 746024072, 746375084, 746524215, 746545255, 746568024, 746679783, 746893525, 747175217, 747475982, 747791827, 748153567, 748557091]
2155.9G48557091M48227N19454N34952L97086J42097j11103k54809l32714m47511n22077
2176.3G48930693n14031m73976l84390k23935Q762L36230P75873J233161J507699J477123
2196.7G52673209J207053Q48234N05030K18511k3484k63274m66466n41031m85719l88562
2217.1G53283501l53039l68833l44932k62261j61051r5189q8096j19984j07884j8359
2237.5G51363873J6273m8638r8646j25288j64748j42574j6093J24991J85251J96814
2257.9G51291215K11060J97113J59681J73986K24709K32280K15947K28524K35618J86383
2278.3G53356516J19627Q1777J0789j24931k11776k03788k04742k27094j46806M8935
2298.7G52498507J98782K74479L80159M52876M20272L50714L09229L05235K91050K76863
$$ y = [748557091, 749005318, 749524772, 750059724, 750456810, 750598907, 750487804, 750232995, 749900281, 749452770, 748930693, 748416662, 747942686, 747558296, 747334361, 747343123, 747679353, 748455226, 749688387, 751196086, 752673209, 753880262, 754728496, 755233526, 755452037, 755428553, 755165279, 754698813, 754157782, 753672063, 753283501, 752930462, 752561629, 752216697, 751954436, 751793385, 751698196, 751610100, 751490116, 751382232, 751363873, 751380146, 751331508, 751232862, 751107574, 750942826, 750800252, 750784159, 750909150, 751094401, 751291215, 751502275, 751699388, 751859069, 752033055, 752257764, 752490044, 752705991, 752934515, 753170133, 753356516, 753476143, 753557920, 753568709, 753443778, 753232002, 753028214, 752823472, 752596378, 752449572, 752498507, 752697289, 752971768, 753351927, 753804803, 754225075, 754575789, 754885018, 755190253, 755481303, 755758166]
2319.1G55758166L05176L38852L78609M30942M48108L87251K57432J45793O3420n3764
2339.5G58459985j25050r1911Q285K34664M69983N63383N04970L99709L15428J60873
2359.9G60900319k9445j26422j13844p4804p8559q8573n2690k7418k3783L1770R4235
2382.3G60410786R3579P1049O9976O4551M6194N2392O8546N7995N1201M8697M0829
2404.7G61075795N0246L9041J0074J3172L8147N0962L0935J7226K9266K9444K7299
2427.2G61411607L5763L2306K1338K3961L9757M4524K0266M887K8134M7207K4378k325
2451.6G61731803K6584O0737L1769L756J6927J7345n96J5736M9114L6657J7643L7193
2476.1G62044668M0710P808q106R000J8120J610r54K5749J9431q702J6093L0220j4901
$$ y = [755758166, 756063342, 756402194, 756780803, 757211745, 757659853, 758047104, 758304536, 758450329, 758513749, 758459985, 758334935, 758243024, 758251309, 758485973, 758955956, 759519339, 760024309, 760424018, 760739446, 760900319, 760870874, 760744452, 760630608, 760555804, 760477245, 760388672, 760335982, 760308564, 760284781, 760316551, 760410786, 760504365, 760575414, 760645390, 760709941, 760756135, 760808527, 760877073, 760935068, 760986269, 761034966, 761075795, 761126041, 761165082, 761175156, 761188328, 761226475, 761277437, 761308372, 761325598, 761354864, 761384308, 761411607, 761447370, 761479676, 761501014, 761524975, 761564732, 761609256, 761629522, 761634409, 761662543, 761709750, 761734128, 761731803, 761758387, 761819124, 761850893, 761854649, 761871576, 761888921, 761888325, 761904061, 761953175, 761989832, 762007475, 762044668, 762085378, 762093186, 762085080, 762094080, 762112200, 762113810, 762112856, 762138605, 762158036, 762149334, 762165427, 762195647, 762180746]
2502.6G62180746j0252M3034J9074l6836m232M6432P868k7657K2650N4956O437k1935
2527.1G62280285K4021M7565k087j9729K5511J4544l3379o974L3021k384k7597L4571
2551.6G62367368O1929j2517n1379N9K2352k6286l3438K1816K4736k087K4259K6346
2576G62423158k9505l2723K1041K2411k7120j4067M4346J5378o5684m2915L1411P75
2600.5G62346506n8830j7464L2962j014j4424M2856L3438l8862k5511L8862J1206p4208
2625G62275517o8009p093k0146m1247R895L5524l2842o6936N901L1948m1127n3346
2649.5G62028039K0384J7762m6551j5676M4048r060o5029m947L8505j1027k0623K4378
2673.9G62000203J1563l5524l3438j4186m4406q0168l1948L5405m172n4240n186J2040
$$ y = [762180746, 762170494, 762213528, 762232602, 762195766, 762191534, 762237966, 762245834, 762218177, 762240827, 762295783, 762302220, 762280285, 762304306, 762351871, 762349784, 762330055, 762355566, 762370110, 762336731, 762329757, 762362778, 762360394, 762332797, 762367368, 762429297, 762416780, 762365401, 762365460, 762387812, 762361526, 762328088, 762349904, 762374640, 762372553, 762396812, 762423158, 762393653, 762360930, 762381971, 762404382, 762377262, 762363195, 762407541, 762422919, 762357235, 762314320, 762345731, 762346506, 762287676, 762270212, 762303174, 762302160, 762287736, 762330592, 762364030, 762325168, 762299657, 762338519, 762349725, 762275517, 762207508, 762200415, 762180269, 762139022, 762148917, 762184441, 762151599, 762084663, 762090564, 762122512, 762081385, 762028039, 762048423, 762066185, 762019634, 762003958, 762048006, 762038946, 761973917, 761968970, 762007475, 761996448, 761975825, 762000203, 762011766, 761976242, 761942804, 761928618, 761884212, 761804044, 761772096, 761807501, 761803329, 761749089, 761743903, 761755943]
2698.4G61755943m3750l2901K3901m947p1645m4048J8239m947n4300l4332r060m6849
2722.9G61451304n8949R54J430o8843n4598K5392J6331n9247m4167K4140J3590m1604
2747.4G61205733n0605k9504m7982n2571l219R418n1558q3804k5272K2113k980k1577
2771.8G60868192o318n6088j34349r2447J848N722k9683j2696r716o7651p9036n364
2796.3G60382414m232j10567j31786n0962l4868p6890q1897p8022j07825j28031q6963
2818.8G59490371n1677q5056r2328m4167m2558q8453r6679o5326p8857j93715l11315
2841.2G58340240l21627l26395l74913l55006k79426k21789j23441L5464R9957K8074
2861.6G56501138p093J4067m1187p7665L1650O6877q4102j61946p5162k0444r3937
$$ y = [761755943, 761712193, 761679292, 761703193, 761698246, 761626601, 761582553, 761600792, 761595845, 761541545, 761507213, 761498153, 761451304, 761392355, 761393309, 761394739, 761325896, 761271298, 761296690, 761313021, 761253774, 761209607, 761233747, 761247337, 761205733, 761155128, 761125624, 761077642, 761025071, 761021852, 761031270, 760979712, 760895908, 760870636, 760892749, 760889769, 760868192, 760861874, 760805786, 760671437, 760578990, 760580838, 760586560, 760556877, 760544181, 760534465, 760466814, 760387778, 760382414, 760378182, 760267615, 760135829, 760084867, 760049999, 759973109, 759891212, 759813190, 759705365, 759577334, 759490371, 759438694, 759353638, 759261310, 759217143, 759174585, 759086132, 758989453, 758924127, 758845270, 758651555, 758340240, 758018613, 757692218, 757317305, 756962299, 756682873, 756461084, 756337643, 756373107, 756473064, 756501138, 756494045, 756508112, 756466925, 756389260, 756420910, 756487787, 756403685, 756241739, 756166577, 756146133, 756052196]
2884G56052196j31786m8041k9326j10089j12534q4519j64569k09927j05322m1425j36316
2906.5G54878342j90079q8453p7606k63035l74436l06547k31087j71960j1921J94431
2926.8G53357649K41697J20997J06633K19106J96040J29461K31326K96950J64867M5836
2947.2G55110562P9274R0480m0650r5726K623K9802P570P1049R8765L2782M5956J92523
2971.7G55625010K36213Q2016K4140J13904M4465j17421q7857M1246N9128m113j5616
2994.2G56001115Q464o9857j46151p5936n2571j10150J729J87337J28270j08600k26677
3016.6G55536973k02000k09510k08020j10805p3850j13190p9095N245n6922k17736
3037G54271090j46091L3677l4094k21551k42412j40905j55985k26677j39952q7916
$$ y = [756052196, 755920410, 755872369, 755843043, 755732954, 755620420, 755535901, 755371332, 755161405, 755056083, 755014658, 754878342, 754688263, 754599810, 754522204, 754259169, 753884733, 753578186, 753347099, 753175139, 753163218, 753357649, 753599346, 753720343, 753826976, 754046082, 754242122, 754371583, 754602909, 754899859, 755064726, 755110562, 755189836, 755280316, 755239666, 755143940, 755146563, 755176365, 755183935, 755254984, 755353749, 755386531, 755432487, 755625010, 755861223, 755943239, 755967379, 756081283, 756125748, 756008327, 755920470, 755961716, 756020844, 756016731, 756001115, 756009579, 755939722, 755793571, 755717635, 755665064, 755554914, 755556643, 755743980, 755872250, 755763650, 755536973, 755334973, 755125463, 754917443, 754806638, 754732788, 754619598, 754540503, 754545748, 754488826, 754271090, 754124999, 754158676, 754124582, 753903031, 753660619, 753519714, 753363729, 753137052, 752997100, 752909184]
3057.4G52909184k10166k37048j10924n2631j56641k72990k51531j76549q3447N246
3077.8G51362503p9155k48373k62678k06947k21372k76625l04579k66314k32458k20061
3098.2G49043941j91330k08676k53439k02477j01567j56223k67446j75178o3777j86503
3118.6G47237325m12464n15223m63128l77536k90036k43962l24547l78609k60234j90854
3139G43780732l52740n16236m93467m02152l00050k25723l25978n07235n79834n68450
3159.4G39508867n22554m89592n15282n29230n04792n28872o04391o33716o05107o00636
3179.8G33974695o34551o43492o47842o80864p01964p13706p60317q18729q21651p82549
3200.1G26769030p59661p70271p89165p59304p23243p70628q26776q07524p76768p94887
$$ y = [752909184, 752699018, 752461970, 752351046, 752298415, 752141774, 751868784, 751617253, 751440704, 751357257, 751362503, 751283348, 751034975, 750772297, 750565350, 750343978, 750067353, 749762774, 749496460, 749264002, 749043941, 748852611, 748643935, 748390496, 748188019, 748086452, 747930229, 747662783, 747487605, 747423828, 747237325, 746824861, 746309638, 745846510, 745468974, 745178938, 744934976, 744610429, 744231820, 743971586, 743780732, 743427992, 742911756, 742418289, 742016137, 741716087, 741490364, 741164386, 740657151, 740077317, 739508867, 738986313, 738496721, 737981439, 737452209, 736947417, 736418545, 735814154, 735180438, 734575331, 733974695, 733340144, 732696652, 732048810, 731367946, 730665982, 729952276, 729191959, 728373230, 727551579, 726769030, 726009369, 725239098, 724449933, 723690629, 722967386, 722196758, 721369982, 720562458, 719785690, 718990803]
3220.5G18990803q26240q49247q70228q59320p63476p00950q43108r71973r18746q48234
3240.9G10539281p90357p12276p11798q06272q26359p08878o12080o34194o76632o62505
3261.3G03397930o25193n65887m72605l97146n00441p19189p89821p35641o99758p07567
3281.7F97184682p33912p66695p79211p30455p42436q81850j000583j078904j133680
3300.1F89336956j062036r07183r62615j294732j544535j552701j483679j489281j565397
3318.4F77474797j616895j612902j624644j773238j952887j975774j934171j910448
3334.8F63073838j882375j994311k200127k278507k321303k341568k251804k356470
3351.1F45447373k668202k743959k595663k518594k572060k614498k519846k443433
$$ y = [718990803, 718164563, 717315316, 716445088, 715585768, 714822292, 714121342, 713278234, 712306261, 711387515, 710539281, 709748924, 709036648, 708324850, 707518578, 706692219, 705983341, 705371261, 704737067, 704060435, 703397930, 702772737, 702206850, 701734245, 701337099, 700836658, 700117469, 699327648, 698592007, 697892249, 697184682, 696450770, 695684075, 694904864, 694174409, 693431973, 692550123, 691549540, 690470636, 689336956, 688274920, 687367737, 686405122, 685110390, 683565855, 682013154, 680529475, 679040194, 677474797, 675857902, 674245000, 672620356, 670847118, 668894231, 666918457, 664984286, 663073838, 661191463, 659197152, 656997025, 654718518, 652397215, 650055647, 647803843, 645447373, 642779171, 640035212, 637439549, 634920955, 632348895, 629734397, 627214551, 624771118]
3367.4F24771118k583325k798259k788603k550900k320051k223671k204180k094805
3383.7F05207324j899540j699806j489222j511812j774847j766086j407266j209557
3400E92449188j455962j718104j566708j290322j207173j241147j245678j157760j028359
3418.4E80537975r30190q10504o51956n19275l70026k55644j79768o4373o6221j65343
3438.8E76524675r0540J29581L11315M40300N07652N59867O92904Q27729Q96216R34303
3459.2E81734002R09030R45151J165032J313806J118481Q04246P89463J029849J267016
3477.5E91076076J263142J061141J067221J244843J237810J142085J179993J271009
3493.8F00543320J310885J309872J331389J346051J245022J132608J187205J346111
$$ y = [624771118, 622187793, 619389534, 616600931, 614050031, 611729980, 609506309, 607302129, 605207324, 603307784, 601607978, 600118756, 598606944, 596832097, 595066011, 593658745, 592449188, 590993226, 589275122, 587708414, 586418092, 585210919, 583969772, 582724094, 581566334, 580537975, 579607785, 578797281, 578145325, 577626050, 577256024, 577000380, 576820612, 576756239, 576690018, 576524675, 576434135, 576563716, 576875031, 577315331, 577822983, 578382850, 579075754, 579903483, 580799699, 581734002, 582643032, 583588183, 584753215, 586067021, 587185502, 587989748, 588779211, 589809060, 591076076, 592339218, 593400359, 594467580, 595712423, 596950233, 598092318, 599272311, 600543320, 601854205, 603164077, 604495466, 605841517, 607086539, 608219147, 609406352, 610752463]
3510.2F10752463J495660J524627J415253J360893J456678J595258J553596J399219
3526.5F22553647J391649J518071J643002J687169J627922J567304J644254J753151
3542.8F35386169J727760J599312J558065J603305J638234J699507J762927J805901
3559.1F48781180J829744J758039J651764J850962K181769K126395J969099K039075
3575.4F64188027K169252K269983K364814K358735K218127K165139K333283K397895
3591.7F82465255K371311K432824K466082K401054K353609K288460K134622K112627
3608.1G01025844K191126K183497K184153K079844J950443K072394K089142J785398
3624.4G17561841J400054J374959J777232J753092J463532J319945J232624J148403
$$ y = [610752463, 612248123, 613772750, 615188003, 616548896, 618005574, 619600832, 621154428, 622553647, 623945296, 625463367, 627106369, 628793538, 630421460, 631988764, 633633018, 635386169, 637113929, 638713241, 640271306, 641874611, 643512845, 645212352, 646975279, 648781180, 650610924, 652368963, 654020727, 655871689, 658053458, 660179853, 662148952, 664188027, 666357279, 668627262, 670992076, 673350811, 675568938, 677734077, 680067360, 682465255, 684836566, 687269390, 689735472, 692136526, 694490135, 696778595, 698913217, 701025844, 703216970, 705400467, 707584620, 709664464, 711614907, 713687301, 715776443, 717561841, 718961895, 720336854, 722114086, 723867178, 725330710, 726650655, 727883279, 729031682]
3640.7G29031682J065731R27150P14362O99043R96888J026928P41244O64949P47264
3659G36615241N98788M17292L87788K75671P2301J40905J35541o3717K10464N07950
3679.4G39298224M76957M65810M77433L83318K72512L68893M98712M51804L37124K30073
3699.8G43260860J69456K54214K99812J54018n4657j0074K85566L42787K02894R1254
3720.2G44996130M6552M4346R0658J66476P6294j19746j55449N2274K80678J60694
3740.6G45638907k64406l14713J39117K8849k68876O1869L42071J53244m2916M2797
3761G45515943J04606J9133l2067p8023k0027J43349J96099J09375m0174j19209j16646
3783.5G45682359q5354k2173K9147L7133j3530o2883l5584j43230k17497k742l8207
$$ y = [729031682, 730097413, 731024563, 731738925, 732437968, 733434856, 734461784, 735203028, 735867977, 736615241, 737214029, 737631321, 738019109, 738294780, 738367081, 738507986, 738643527, 738579810, 738790274, 739298224, 739775181, 740240991, 740718424, 741101742, 741374254, 741743147, 742241859, 742693663, 743030787, 743260860, 743430316, 743684530, 743984342, 744138360, 744083703, 744073629, 744359195, 744701982, 744904876, 744996130, 745042682, 745087028, 745177686, 745344162, 745420456, 745300710, 745145261, 745197535, 745478213, 745638907, 745374501, 745059788, 745198905, 745227754, 744958878, 745020747, 745362818, 745516062, 745473146, 745515943, 745620549, 745639682, 745607615, 745529592, 745509565, 745652914, 745849013, 745958388, 745918214, 745799005, 745682359, 745597005, 745574832, 745603979, 745641112, 745627582, 745564699, 745529115, 745385885, 745168388, 745165646, 745127439]
3805.9G45127439j00672J12534J17779j52886k46227l6180q3745p7605J47641P9393
3826.3G44887471k4855j9967k0624j8060j60038l03269j62601J4841J31488K11954
3846.7G44536340J43647j96039o50466l01063L58403K97368Q344j52588p5042J6630
3867.1G43985534j14322j25229M172P3075N5909p4446j7762L2604j41382j05381m4227
3889.5G43528545j11640k086P8798k3306j39773k39789k03014R0301K46585J20699
3909.9G43345320K0623m8875j58191j16050N5253P8380l0458m6789m650n2392j00136
3932.3G42942035j2934P4446M9889l8266j01149o5863m3810m7445J8239N2095j1266
3954.8G42815971p3373n8889k4855j7941R179L4749J9491j1027l2485k9027k0623m2558
$$ y = [745127439, 745026767, 745139301, 745257080, 745104194, 744857967, 744821787, 744738042, 744660437, 744808078, 744887471, 744862616, 744842649, 744822025, 744803965, 744643927, 744340658, 744178057, 744192898, 744324386, 744536340, 744679987, 744483948, 743833482, 743532419, 743890822, 744188190, 744196534, 744043946, 743968904, 743985534, 743871212, 743745983, 743750155, 743823230, 743879139, 743804693, 743786931, 743819535, 743678153, 743572772, 743528545, 743416905, 743414819, 743493617, 743470311, 743330538, 743090749, 742887735, 742978036, 743224621, 743345320, 743365943, 743317068, 743158877, 743042827, 743098080, 743176460, 743146002, 743099213, 743094563, 743042171, 742942035, 742929101, 743003547, 743053436, 743015170, 742914021, 742848158, 742804348, 742756903, 742775142, 742827237, 742815971, 742742598, 742683709, 742658854, 742640913, 742650092, 742684841, 742704332, 742693305, 742660820, 742631793, 742611170, 742568612]
3979.3G42568612o4075k3305K6285O199l9339p8142p9095q225K2292
3997.6G42331207
$$ y = [742568612, 742504537, 742481232, 742507517, 742513716, 742474377, 742396235, 742317140, 742308915, 742331207]
##END=$$ End of the data block
