##TITLE=$$ Begin of the data block
##JCAMP-DX=5.00 $$ ACD/SpecManager v 10.08
##SPECTROMETER/DATA SYSTEM=Alpha
##DATE=27 Jun 2014 15:13:00
##DATA TYPE=INFRARED SPECTRUM
##DATA CLASS=XYDATA
##ORIGIN=
##OWNER=
##NPOINTS=1667
##FIRSTX=599.63549805
##LASTX=3997.56909180
##MAXX=3997.56909180
##MINX=599.63549805
##MAXY=1.09928393
##MINY=0.07254113
##XFACTOR=1.0000000000
##YFACTOR=0.000000010000000
##FIRSTY=0.99967182
##DELTAX=2.03957605
##XUNITS=1/CM
##YUNITS=ARBITRARY UNITS
##XYDATA=(X++(Y..Y))
599.6I9967182p6485J28043J72138J73104J61540J94156K89989L57270K91443J38497
$$ 99967182 99890697 100018740 100190878 100363982 100525522 100719678 101009667 101366937 101658380 101796877
620A01796877N0569N9319R8192R5511N1844R084l3832q1229j06669j13237r7012o7449
$$ 101796877 101847446 101906765 102004957 102100468 102152312 102161396 102127564 102046335 101939666 101826429 101729417 101661968
644.5A01661968p9822r4629q0323r0480j35874k05625k92778l63993l98374l47256
$$ 101661968 101582146 101487517 101407194 101316714 101180840 100975215 100682437 100318444 99920070 99572814
664.9I9572814k54536l17562m58258m89962n02903n20366n26381m96315m58068m26537
$$ 99572814 99318278 99000716 98542458 98052496 97549593 97029227 96502846 96006531 95548463 95121926
685.3I5121926m09752m09615m02683m02248m65333n96428p57760r93890j423090k033866
$$ 95121926 94712174 94302559 93899876 93497628 93032295 92435867 91678107 90684217 89261127 87227261
705.7H7227261k545386k543134j998633j446545j253784j154017o72728K83175J313121
$$ 87227261 84681875 82138741 80140108 78693563 77439779 76285762 75613034 75896209 77209330
724G7209330J962655K114809J946539J742673J644712J580841J457458J258260J031655
$$ 77209330 79171985 81286794 83233333 84976006 86620718 88201559 89659017 90917277 91948932
742.4I1948932R20749R85354J024229R56457Q44360O10739K96205J18685J72836M02647
$$ 91948932 92869681 93855035 94879264 95835721 96680081 97290820 97587025 97705710 97878546 98281193
762.8I8281193N78767M84854K94119K35420K72358K97534K82395K61712K48826K46465
$$ 98281193 98859960 99344814 99638933 99874353 100146711 100444245 100726640 100988352 101237178 101483643
783.2A01483643K26474J53875J04130J43027J49500L6442o1190n1176m3309j22857
$$ 101483643 101710117 101863992 101968122 102111149 102260649 102297091 102235901 102184725 102141416 102018559
803.6A02018559k19774k26736j62649j71876k22767j85883j40655j48833r2804N0664
$$ 102018559 101798785 101572049 101409400 101237524 101014757 100828874 100688219 100539386 100446582 100497246
824A00497246R6869m7624k48635l65221l59851k70850j73080j08748r4110j04773p1019
$$ 100497246 100594115 100546491 100297856 99932635 99572784 99301934 99128854 99020106 98925996 98821223 98750204
846.4I8750204L2508J47724J78075J11342K5522l9649j02639j64866k11948k62231
$$ 98750204 98782712 98930436 99108511 99219853 99245375 99205726 99103087 98938221 98726273 98464042
866.8I8464042l37893m09418l96562k45422k1946J33681J67227J58059J86712K22021
$$ 98464042 98126149 97716731 97320169 97074747 97052801 97186482 97353709 97511768 97698480 97920501
887.2I7920501J94675P7528j58567n46181p69496m61352m0525Q3024J03998M5991j22941
$$ 97920501 98115176 98192704 98034137 97487956 96718460 96257108 96216583 96299607 96403605 96449596 96326655
909.6I6326655k20644j78886q4311m6187j46181l77291n45710m39209r1857K96617
$$ 96326655 96106011 95927125 95842814 95796627 95650446 95273155 94727445 94288236 94196379 94492996
930I4492996M72134K76852n8276j34390N4031J99950J76972N5486j05935k70969l90321
$$ 94492996 94965130 95241982 95183706 95049316 95103347 95303297 95480269 95535755 95429820 95158851 94768530
952.5I4768530m24838l70628k37095q4853L636Q684n1075j42735k39820l50081m46064
$$ 94768530 94343692 93973064 93735969 93651116 93654752 93663436 93612361 93469626 93229806 92879725 92433661
974.9I2433661l83961j12563J14721J35612J42235K40779L02612K44350J02746l4177
$$ 92433661 92049700 91937137 92051858 92187470 92329705 92570484 92873096 93117446 93220192 93186015
995.3I3186015j10626j71048k76404l95394m87840n69868n31262k17873R1648l725
$$ 93186015 93075389 92904341 92627937 92232543 91744703 91174835 90643573 90425700 90517348 90513623
1015.7I0513623l51292n27108m23205k80297k50726k16324r0152J8025m9573l51465
$$ 90513623 90162331 89635223 89212018 88931721 88680995 88464671 88374519 88392544 88342971 87991506
1036.1H7991506q79097j497156j672381r63431L9130N16063N89740O07431N22882L26020
$$ 87991506 87112409 85615253 83942872 82979441 83018571 83534634 84124374 84731805 85254687 85580707
1056.5H5580707J62077J07359J14072J01703M1294o5565k13915m06551o62995r81265
$$ 85580707 85742784 85850143 85964215 86065918 86107212 86041647 85827732 85421181 84758186 83776921
1076.9H3776921j310337j547479j623923j585054j523966j490760j465439j391876
$$ 83776921 82466584 80919105 79295182 77710128 76186162 74695402 73229963 71838087
1093.2G1838087j220238r17364m92680l3849L45021N53471N09060K01583k21569n40799
$$ 71838087 70617849 69700485 69207805 69173956 69518977 70072448 70581508 70783091 70561522 70020723
1113.6G0020723n88119k90006K68912Q21555J048803P32547n7178q78543j472467k070493
$$ 70020723 69432604 69142598 69411510 70233065 71281868 72014415 71957237 71078694 69606227 67535734
1134F7535734k719170l040534k838165k343463j866484j542848j381559j347714j376033
$$ 67535734 64816564 61776030 58937865 56594402 54727918 53185070 51803511 50455797 49079764
1152.4D9079764j372239j259905j026967p10929l86989j27438P1165K37286L99292
$$ 49079764 47707525 46447620 45420653 44709724 44322735 44195297 44266462 44503748 44903040
1170.7D4903040O47092J004764J332069J573866J784268J886529J815039J663411J517206
$$ 44903040 45550132 46554896 47886965 49460831 51245099 53131628 54946667 56610078 58127284
1189.1E8127284J376766J245946J173150J197416J256370J229281J072746Q30066N67144
$$ 58127284 59504050 60749996 61923146 63120562 64376932 65606213 66678959 67509025 68076169
1207.4F8076169L43848J98912J29623J12128Q4996k3460j99074l74871m85117m76729
$$ 68076169 68420017 68618929 68748552 68860680 68945676 68922216 68723142 68348271 67863154 67386425
1227.8F7386425l95740l64100l92402l76546k35224K3222L33882O32596Q56310R64129
$$ 67386425 66990685 66626585 66234183 65857637 65622413 65645635 65979517 66612113 67468423 68432552
1248.2F8432552R35495P95000O26076N13589M85587M79984M23628L42387L06124L40605
$$ 68432552 69368047 70163047 70789123 71302712 71788299 72268283 72691911 73034298 73340422 73681027
1268.6G3681027M02033M05377L47072K72018K13474K64770M90790P55400Q46547P22664
$$ 73681027 74083060 74488437 74835509 75107527 75321001 75585771 76076561 76831961 77678508 78401172
1289G8401172N05477L44366K84493K37888J51813J39165K73437M31752M66305M02820
$$ 78401172 78906649 79251015 79535508 79773396 79925209 80064374 80337811 80769563 81235868 81638688
1309.4H1638688L79020L77947K95824J97440J90389K62249L64005M27866L90679K54565
$$ 81638688 82017708 82395655 82691479 82888919 83079308 83341557 83705562 84133428 84524107 84778672
1329.8H4778672N1195j73068l67785m92000n15348m31073l33523l13580l42942l56620
$$ 84778672 84829867 84656799 84289014 83797014 83281666 82850593 82517070 82203490 81860548 81503928
1350.2H1503928l46178l37631l30412k68227j12247J6051m8643j74493j86991k51252
$$ 81503928 81157750 80820119 80489707 80221480 80109233 80125284 80076641 79902148 79715157 79463905
1370.6G9463905o23029j272530j373613k61330J274055K073669K112008K007246J624363
$$ 79463905 78840876 77568346 76194733 75933403 77207458 79281127 81393135 83400381 85024744
1388.9H5024744R49800N33164M04268M37403O70850R14711J042098R85253M00924n14793
$$ 85024744 85974544 86507708 86911976 87349379 88020229 88934940 89977038 90962291 91363215 90848422
1409.3I0848422j407731j928305j729298q28969L64560Q09753N29354o4641q75521
$$ 90848422 89440691 87512386 85783088 84954119 85318679 86128432 86657786 86593145 85717624
1427.7H5717624j619064k016968j950580j787817j646984j429969j311851j306533
$$ 85717624 84098560 82081592 80131012 78343195 76696211 75266242 73954391 72647858
1444G2647858j321304j477271j887942k435398k670586k198166j145613q17162j053101
$$ 72647858 71326554 69849283 67961341 65525943 62855357 60657191 59511578 58694416 57641315
1462.4E7641315j032066L05557L322071P147640J0310483Q557910M568118K700650
$$ 57641315 56609249 56914806 60236877 67384517 77695000 86252910 90821028 93521678
1478.7I3521678K080214J725495J314527J043171R03702O40928L20876J43743o0308
$$ 93521678 95601892 97327387 98641914 99685085 100588787 101229715 101550591 101694334 101634026
1497A01634026k32494P8427N66376R48381R94241L82412P5531R6035J44339J44755
$$ 101634026 101401532 101479959 102046335 102994716 103988957 104371369 104446900 104542935 104687274 104832029
1517.4A04832029J09327P3123j7738o1500n7245p4720o0928j01673j84966j41668r1481
$$ 104832029 104941356 105014479 104996741 104935241 104877996 104803276 104742348 104640675 104455709 104314041 104222560
1539.9A04222560k28560l19505k88772k10584j04343J9681J61231K76303M33421K87425
$$ 104222560 103994000 103674495 103385723 103175139 103070796 103090477 103251708 103528011 103961432 104248857
1560.3A04248857n5956l9494Q5449K04563K23708J05751P7629P6520m9567r9540o4552
$$ 104248857 104192901 104153407 104238856 104443419 104667127 104772878 104850507 104927027 104877460 104777920 104713368
1582.7A04713368Q738J16766J85955J44004L7277n4002j24776j75452k07234j96290
$$ 104713368 104722106 104838872 105024827 105168831 105206108 105152106 105027330 104851878 104644644 104448354
1603.1A04448354j33073m0364o68l6466p5483q1766j47259k45607k48099k72727l21638
$$ 104448354 104315281 104274917 104274249 104237783 104162300 104080534 103933275 103687668 103439569 103166842 102845204
1625.5A02845204l12066k68078k27606j59943j54293l26669m57716n09501m99326m44722
$$ 102845204 102533138 102265060 102037454 101877511 101723218 101396549 100938833 100429332 99930006 99485284
1645.9I9485284m24337l90905k45023l05665n67388n76383m83322l81285k81728o6077
$$ 99485284 99060947 98670042 98425019 98119354 97551966 96975583 96492261 96110976 95829248 95763171
1666.3I5763171L72427Q04753Q23050R09716Q69751M09031P2634q0740l91382q18587
$$ 95763171 96135598 96940351 97763401 98673117 99542868 99951899 100024533 99943793 99552411 98733824
1686.7I8733824j040643j201892j118034r41992q56811r37223j238835j379418j381147
$$ 98733824 97693181 96491289 95373255 94431263 93574452 92637229 91398394 90018976 88637829
1705.1H8637829j449049j379788j249951j231718j453835k218025l042126l374011
$$ 88637829 87188780 85808992 84559041 83327323 81873488 79655463 76613337 73239326
1721.4G3239326l826510m417336m895425n459303n885637o895297p063523n540762
$$ 73239326 69412816 64995480 60100055 54640752 48755115 41859818 34796295 29255533
1737.7B9255533m702317l648985k085918n78363J120321L480677N720522O810459Q480651
$$ 29255533 24553216 20904231 18818313 18239950 19360271 22840948 28561470 35371929 43852580
1756.1D3852580R917962R607148R152812P266808N054581L978234L132904K571154
$$ 43852580 53770542 63377690 72530502 79797310 84851891 88830125 91963029 94534183
1772.4I4534183J882976J194304R64725R04787P60567O53028N49090M59671M56643
$$ 94534183 96417159 97611463 98576188 99480975 100241542 100894570 101443660 101903331 102359974
1790.7A02359974M65167L31008K46227K74611K73883K31206J94300K06828K12788K12586
$$ 102359974 102825141 103156149 103402376 103676987 103950870 104182076 104376376 104583204 104795992 105008578
1811.1A05008578J73903J53804J57046J50859J53160J66619J60897J25670J30046R7012
$$ 105008578 105182481 105336285 105493331 105644190 105797350 105963969 106124866 106250536 106380582 106477594
1831.5A06477594O1334O5982Q0144P9966R5057J10972O0034K0659K8575M4059M0615
$$ 106477594 106538928 106604910 106685054 106765020 106860077 106971049 107031083 107051742 107080317 107124376 107164991
1854A07164991L9029L0637K6750K6429L2044N0652N5253J4949k4784j2767K813J4520
$$ 107164991 107204020 107234657 107261407 107287836 107319880 107370532 107425785 107440734 107415950 107403183 107405996 107420516
1878.4A07420516J9729K7383L1530L5417M0699K7811J7643J9515K0063J1968J1051
$$ 107420516 107440245 107467628 107499158 107534575 107575274 107603085 107620728 107640243 107660306 107672274 107683325
1900.9A07683325P975O366Q189J2827O914m470N210J4042j216j4722j3173j8692j0919
$$ 107683325 107691300 107697666 107705855 107718682 107725596 107721126 107726336 107740378 107739162 107724440 107711267 107692575 107681656
1927.4A07681656K038J1409J1050j78k27R406J9896R012m113L398J6045J4818J1373
$$ 107681656 107683694 107695103 107706153 107705975 107705748 107715154 107735050 107744062 107739949 107743347 107759392 107774210 107785583
1953.9A07785583J6176J7298P319q58P009J0264L672l922p475j788P248J335j2779
$$ 107785583 107801759 107819057 107826376 107825518 107832527 107842791 107846463 107842541 107835066 107833278 107840526 107841861 107829082
1980.4A07829082j4210j1658r621J491J2695o43k2150k2077j1265n794n484p736j4162
$$ 107829082 107814872 107803214 107793593 107795084 107807779 107807136 107784986 107762909 107751644 107745850 107740366 107732630 107718468
2006.9A07718468k6191l5488l2413k6226k9350l9088l8946k7049k3579k2948m685J5938
$$ 107718468 107692277 107656789 107624376 107598150 107568800 107529712 107490766 107463717 107440138 107417190 107412505 107428443
2031.4A07428443J5128N567J0228K0910K1612J3197O211O115P963J0514J2482P867
$$ 107428443 107443571 107449138 107459366 107480276 107501888 107515085 107521296 107527411 107535374 107545888 107558370 107566237
2055.9A07566237N484J4007K1112J9169P987M41Q714J7345J5605J3160J3996J5533
$$ 107566237 107571721 107585728 107606840 107626009 107633996 107634437 107643151 107660496 107676101 107689261 107703257 107718790
2080.3A07718790J8775K5237K7775J7000J3244K0289K0981J8811J6761J2767N949N281
$$ 107718790 107737565 107762802 107790577 107807577 107820821 107841110 107862091 107880902 107897663 107910430 107916379 107921660
2104.8A07921660J3947K4379K3997J1885Q034J4544J3494J0360J3840J5426J3017K528
$$ 107921660 107935607 107959986 107983983 107995868 108003902 108018446 108031940 108042300 108056140 108071566 108084583 108087111
2129.3A08087111j1015j1683J705P820J836j073m995j4663j7178j0264p963p474j777
$$ 108087111 108076096 108064413 108066118 108073938 108075774 108074701 108069706 108055043 108037865 108027601 108019638 108012164 108010387
2155.8A08010387M197N233R525J7726J7524J2541J4269K0969K1279J2886O080J4317
$$ 108010387 108014584 108019817 108029342 108047068 108064592 108077133 108091402 108112371 108133650 108146536 108152616 108166933
2180.3A08166933K1315J4913J2743J6165J7166J6558J5748J5342J6976J5497R143M625
$$ 108166933 108188248 108203161 108215904 108232069 108249235 108265793 108281541 108296883 108313859 108329356 108338499 108343124
2204.8A08343124O223N818K169N150Q404R740J1158O950L09j55n24p129j2111r108
$$ 108343124 108349347 108355165 108357334 108362484 108370888 108380628 108391786 108398736 108399045 108398890 108398366 108391237 108379126 108370018
2233.3A08370018k122l362j2540j6344j5128j3673j0693q750n615m756n913m494k694
$$ 108370018 108367896 108364534 108351994 108335650 108320522 108306849 108296156 108287406 108281791 108277035 108271122 108266628 108263934
2259.8A08263934j20l790j0622j2135j0360n293j478l457q511j8371k7394j9252l660
$$ 108263934 108263814 108260024 108249402 108237267 108226907 108221614 108220136 108216679 108208168 108189797 108162403 108143151 108139491
2286.3A08139491k03l57O67p522j2409j133J0967J4389J5497J9837K9468L9864M0900
$$ 108139491 108139288 108138931 108139598 108132076 108119667 108118534 108129501 108143890 108159387 108179224 108208692 108248556 108289456
2312.9A08289456M0222N7911Q8478J09768J02031P9751Q0621R5928Q2051M1330K8992
$$ 108289456 108329678 108387589 108476067 108585835 108687866 108767617 108848238 108944166 109026217 109067547 109096539
2335.3A09096539L5918L6502L0958k6357j55890j97935m2939J90317L23093K78867
$$ 109096539 109132457 109168959 109199917 109173560 109017670 108819735 108776796 108967113 109290206 109569073
2355.7A09569073J92678J26719L9923p1120j61302k17211k46597k32255j88124j57571
$$ 109569073 109761751 109888470 109928393 109857273 109695971 109478760 109232163 108999908 108811784 108654213
2376.1A08654213j47557j21296p4494l8421k3269j5033m482k539m757L660L493j1289
$$ 108654213 108506656 108385360 108310866 108272445 108249176 108234143 108229661 108227122 108222365 108226025 108229518 108218229
2400.6A08218229j1897R06Q964J6213J5962L719l064k014L219P355N996O986J1193
$$ 108218229 108206332 108207238 108216202 108232415 108248377 108252096 108249032 108247018 108250237 108257592 108263588 108270574 108281767
2427.1A08281767J2076L040p641n830M805O067l397l255K182j264o842l791K158j741
$$ 108281767 108293843 108296883 108289242 108283412 108288217 108294284 108290887 108287632 108289814 108288550 108281708 108277917 108280075 108278334
2455.6A08278334q273p284o306q774j1146j0013p057j0479r513j621p415k0981k1839
$$ 108278334 108270061 108262777 108256471 108247697 108236551 108226538 108219481 108209002 108199489 108197868 108190453 108169472 108147633
2482.1A08147633k0921l2425l5632j6880m112j2661k4652k8253k5093k3568k7680l2342
$$ 108147633 108126712 108094287 108058655 108041775 108037663 108025002 108000350 107972097 107947004 107923436 107895756 107863414
2506.6A07863414k9933k6179l2961m2176m6802m8685l8039j9157j6261k8228l7015
$$ 107863414 107833481 107807302 107774341 107732165 107685363 107636678 107598639 107579482 107563221 107534993 107497978
2529.1A07497978l0386j0586p2k682k551r65r18n25q035k0325k4175j9741j7190k3163
$$ 107497978 107467592 107457006 107456934 107454252 107451701 107450736 107449818 107449293 107441258 107420933 107396758 107377017 107359827 107336664
2557.6A07336664l2091l1829k9838l7944m5955m7231m5967m8816n3156m6515l3152
$$ 107336664 107304573 107272744 107242906 107204962 107159007 107111776 107065809 107016993 106963837 106917322 106884170
2580A06884170l0113m2152n4860n9092n3716m1389l7611l7098l1245l5596m9579n9771
$$ 106884170 106854057 106811905 106757045 106697953 106644237 106602848 106565237 106528139 106496894 106461298 106411719 106351948
2604.5A06351948n8353m8947m4036n3382o7044o4349o1440p2611q3577q6808p7582
$$ 106351948 106293595 106244648 106200612 106147230 106080186 106015837 105954397 105881786 105798209 105711401 105633819
2626.9A05633819o4361o0439o1238n9581m4059j8156j3804l1066m7172o1821o7318
$$ 105633819 105569458 105509019 105447781 105388200 105344141 105325985 105312181 105281115 105233943 105172122 105104804
2649.4A05104804o4385o8509q5772j13940j36077j37794j25754j09065q6200o7496
$$ 105104804 105040419 104971910 104886138 104772198 104636121 104498327 104372573 104263508 104177308 104109812
2669.8A04109812n3513l4499k8289k8300l493L4916N1702N0389O0642P6306P7236P4243
$$ 104109812 104056299 104021800 103993511 103965211 103961718 103996634 104048336 104098725 104159367 104235673 104312909 104387152
2694.3A04387152P1705O2227N0902L6276J4972j2052l6096m6540n1784n9211n5314
$$ 104387152 104458857 104521084 104571986 104608262 104623234 104611182 104575086 104528546 104476762 104417551 104362237
2716.7A04362237n3978p8594j03224j15370r9731m3881R191L8064M9591N4026O4468
$$ 104362237 104308259 104229665 104126441 104011071 103911340 103867459 103876650 103914714 103964305 104018331 104082799
2739.1A04082799O5649L5643j0669l3403j1479K4378J8489k3448n3883o4158o6996
$$ 104082799 104148448 104184091 104173422 104140019 104128540 104152918 104171407 104147959 104094076 104029918 103962922
2761.6A03962922p6723r1290r9159j24025j82045k28679k25556k19142k58720l12603
$$ 103962922 103886199 103794909 103695750 103571725 103389680 103161001 102935445 102716303 102457583 102144980
2782A02144980l42571l67427l91710l84998l73531m11027m76426n03212m96364n19461
$$ 102144980 101802409 101434982 101043272 100658274 100284743 99873716 99397290 98894078 98397714 97878253
2802.4I7878253n73575o27691o92731p60841q25828r23419j053119j188731j336986
$$ 97878253 97304678 96676987 95984256 95223415 94397587 93474168 92421049 91232318 89895332
2820.7H9895332j514673j718659j953917k234251k568513l001094l632307m569399
$$ 89895332 88380659 86662000 84708083 82473832 79905319 76904225 73271918 68702519
2837F8702519n844235p329935q593375q998096q187777o345492l945683j448479Q04500
$$ 68702519 62858284 55528349 46934974 37936878 29749101 23403609 19457926 18009447 18813947
2855.4A8813947K640787L958767M665506M698274M034742K901370J948386J800955
$$ 18813947 21454734 25413501 30079007 34777281 38812023 41713393 43661779 45462734
2871.7D5462734K305272K632525K211541J187378K7442r69183j717609k213809k489305
$$ 45462734 47768006 50400531 52612072 53799450 53826892 52857709 51140100 48926291 46436986
2890.1D6436986k596199k592766k537233k489096k478993k501577k563271k679077
$$ 46436986 43840787 41248021 38710788 36221692 33742699 31241122 28677851 25998774
2906.4B5998774k834475k968587l015925k916291k603559k076915j426525p54397j47987
$$ 25998774 23164299 20195712 17179787 14263496 11659937 9583022 8156497 7402100 7254113
2924.7G254113L67967Q13129J198264J605027K081691K538316K877616L070692L035353
$$ 7254113 7622080 8435209 9633473 11238500 13320191 15858507 18736123 21806815 24842168
2943.1B4842168K655803J952440J130262N03686K92188N50937J186517J994369K834394
$$ 24842168 27497971 29450411 30580673 31084359 31376547 31927484 33114001 35108370 37942764
2961.4C7942764L627870M283180M695192M790354M607880M240901L775721L299421
$$ 37942764 41570634 45853814 50549006 55339360 59947240 64188141 67963862 71263283
2977.8G1263283K849925K435887K079856J775319J490545J165140P37857J97632m56709
$$ 71263283 74113208 76549095 78628951 80404270 81894815 83059955 83797812 83995444 83538735
2996.1H3538735j192880j916539k444238k541709k071941j046496L44157J767808K911955
$$ 83538735 82345855 80429316 77985078 75443369 73371428 72324932 72669089 74436897 77348852
3014.5G7348852L590870L753442L495586K997016K423376J888961J431304J075304
$$ 77348852 80939722 84693164 88188750 91185766 93609142 95498103 96929407 98004711
3030.8I8004711Q28588O62291N37514M01414K73239K12551K18689K43092K44796K38836
$$ 98004711 98833299 99495590 100033104 100434518 100707757 100920308 101138997 101382089 101626885 101865721
3051.2A01865721K39408K26319J97994J60563J18137R2423R1302J26481J88017K16758
$$ 101865721 102105129 102331448 102529442 102690005 102808142 102900565 102991867 103118348 103306365 103523123
3071.6A03523123J98603J57714J25360J26469J33813J30963J26195R6822O2370P3505
$$ 103523123 103721726 103879440 104004800 104131269 104265082 104396045 104522240 104619062 104681432 104754937
3092A04754937R0074O2192J5652l338P87k6214o7926n0878K1863O1619M2367M3452
$$ 104754937 104845011 104907203 104922855 104919517 104920304 104894090 104826164 104775286 104797149 104858768 104901135 104944587
3116.4A04944587Q4209J25909J46604J27315P8023M0006M5789N9652K3198l6240m0757
$$ 104944587 105028796 105154705 105301309 105428624 105506647 105546653 105592442 105652094 105675292 105639052 105598295
3138.9A05598295J3685N2571M6158K6202q10k8837L242P5007Q5998M7481K1326J3375
$$ 105598295 105611980 105664551 105710709 105736911 105736101 105707264 105710506 105785513 105871511 105918992 105940318 105953693
3163.4A05953693O318L684J1170R906N49k063N639J2374P653N162J1551O998j848P677
$$ 105953693 105960011 105963695 105974865 105984771 105985320 105983257 105988896 106001270 106008923 106014085 106025636 106032634 106030786 106038463
3191.9A06038463J3411Q941J6987K4855K5916K8086K1696J1647R155J2148J9657K1434
$$ 106038463 106051874 106060815 106077802 106102657 106128573 106156659 106178355 106190002 106199157 106211305 106230962 106252396
3216.4A06252396J8156K2530J8871O747l5j1206l0542l1852J7667N8865L3724L076
$$ 106252396 106270552 106293082 106311953 106318700 106318665 106307459 106276917 106245065 106262732 106321597 106355321 106358397
3240.9A06358397o199l1435m6301j0407K1422j431l1364j3256J4842O509p666k3424
$$ 106358397 106352198 106320763 106274462 106264055 106285477 106284046 106252682 106239426 106254268 106260777 106253111 106229687
3265.3A06229687p0644j04236n7519P737J9014J5902K754l4189n0652l3689k7573o0010
$$ 106229687 106159043 106054807 105997288 106005025 106024039 106039941 106042695 106008506 105957854 105924165 105896592 105836582
3289.8A05836582q3530n3692K420M3786K0838p3052j38080r2745J1099Q1575Q8346
$$ 105836582 105753052 105699360 105701780 105745566 105766404 105693352 105555272 105462527 105473626 105555201 105643547
3312.2A05643547M1759p642k2518k4212m2605n9962k5201K2280Q273k4521l7098o7604
$$ 105643547 105685306 105677664 105655146 105630934 105588329 105528367 105503166 105525446 105533719 105509198 105472100 105404496
3336.7A05404496p6937l4476P594K5678j5879q9693o8081K2579K9707m6397j00815
$$ 105404496 105327559 105293083 105300677 105326355 105310476 105220783 105152702 105175281 105204988 105158591 105057776
3359.1A05057776r0909o6233r3209j16575m7994P1395J24144J08612J17027J49763
$$ 105057776 104966867 104900634 104807425 104690850 104642856 104714251 104838395 104947007 105064034 105213797
3379.5A05213797J66774J59705J25503N4920k8777k2888O5863P1454l4654q7774J0395
$$ 105213797 105380571 105540276 105665779 105720699 105691922 105669034 105734897 105806351 105771697 105683923 105694318
3402A05694318J18613P8619j2982l1913k0933M77L0482J0145j9706j9943m8268j07658
$$ 105694318 105812931 105891550 105878568 105846655 105825722 105826199 105856681 105866826 105847120 105827177 105778909 105671251
3426.5A05671251j34742r9433r0587j25873p3850M5252P3111m590q2564j03104r0039
$$ 105671251 105536509 105437076 105346489 105220616 105146766 105192018 105265129 105260539 105177975 105074871 104984832
3448.9A04984832q9538r9075j14882j55163j72806j08134r5785k37525k99549p4565
$$ 104984832 104895294 104796219 104681337 104526174 104353368 104245234 104149449 103911924 103612375 103537810
3469.3A03537810K17450K40242P2467n8794k9647J69849K17939O3813N3143J26326
$$ 103537810 103755260 103995502 104067969 104009175 103979528 104149377 104367316 104431129 104484272 104610598
3489.7A04610598P4804j0371n2929l6919j0729k2435N8841J42086O8939o5005j72162
$$ 104610598 104685402 104675031 104622102 104585183 104574454 104552019 104610860 104752946 104821885 104756880 104584718
3512.1A04584718j47212k5546L636o4612j15013o3312M9221O6185j907l4034k3163
$$ 104584718 104437506 104411960 104415596 104350984 104235971 104172659 104221880 104288065 104286158 104252124 104228961
3534.5A04228961J6010N7614M5645L4440J02365J81091J75798J45936J56426J53732
$$ 104228961 104244971 104302585 104348230 104382670 104485035 104666126 104841924 104987860 105144286 105298018
3554.9A05298018J33753J31643J42562J82820K47991K37918J08528N9843J21379J48582
$$ 105298018 105431771 105563414 105705976 105888796 106136787 106374705 106483233 106543076 106664455 106813037
3575.3A06813037J29593J04248O7902N0783J06311J47855O879j31488j17350p8165
$$ 106813037 106942630 107046878 107114780 107165563 107271874 107419729 107426608 107295120 107177770 107099605
3595.7A07099605k3640J04881J90627J79756K09939K65718K12800J31333R7001R9075
$$ 107099605 107075965 107180846 107371473 107551229 107761168 108026886 108239686 108371019 108468020 108567095
3616.1A08567095J19948N9927r728K6131J24204J76549K8408q3411m8185j4889J0765
$$ 108567095 108687043 108746970 108737242 108763373 108887577 109064126 109092534 109009123 108960938 108946049 108956814
3638.6A08956814J9407P284M1568J21820J17552k7597p9596j4472k3210p8583j7464
$$ 108956814 108976221 108983505 109025073 109146893 109264445 109236848 109157252 109142780 109119570 109040987 109023523
3661A09023523N6982N4598P7760J25432N0354P058P4422j0014j14798q2040k1422K5332
$$ 109023523 109080505 109135103 109212863 109338295 109388649 109395707 109470129 109460115 109345317 109263277 109241855 109267187
3685.5A09267187P5019R8586L9625l0446l7635L469N0116N1367N090R978O4683Q3065
$$ 109267187 109342206 109440792 109480417 109449971 109412336 109415805 109465921 109517288 109522378 109532356 109597039 109680104
3710A09680104J4818p7081p4339j2803K9111L1221K1875j717k0825K1934Q4317O9761
$$ 109680104 109694922 109617841 109543502 109530699 109559810 109591031 109612906 109611189 109590364 109612298 109696615 109766376
3734.4A09766376m4286j33634p7641P7462J26553o116j1384K4772q0669j08755k3174
$$ 109766376 109722090 109588456 109510815 109588277 109714830 109708714 109697330 109722102 109641433 109532678 109509504
3756.9A09509504K8670j3244m9162k2126L255j586l8314m9281j2135P057l302r143
$$ 109509504 109538174 109524930 109475768 109453642 109456897 109455311 109416997 109367716 109355581 109362638 109359336 109350193
3781.3A09350193M506L326j8549j2494J2970K6763K4009J6045N1487L3939n7924k8944
$$ 109350193 109354699 109358025 109339476 109326982 109339952 109366715 109390724 109406769 109458256 109492195 109434271 109405327
3805.8A09405327j2005o4611l8290L9029O3956K3091L0231j0729q1491n3096j9157
$$ 109405327 109393322 109328711 109290421 109329450 109393406 109416497 109446728 109435999 109354508 109301412 109282255
3828.2A09282255O533K5427K2304M3392L6288l6872p9691q4579n6911K3556J40441
$$ 109282255 109288788 109314215 109336519 109379911 109416199 109379327 109299636 109215057 109158146 109181702 109322143
3850.7A09322143J99496j8119j94741j07908J2183P1216M2093J144J8060j4841o3253
$$ 109322143 109521639 109503520 109308779 109200871 109213054 109284270 109326363 109327507 109345567 109330726 109267473
3873.1A09267473n8901k9254L0398K4343k2662j6665k0576m732Q595m7100m6670M2116
$$ 109267473 109208572 109179318 109209716 109234059 109211397 109194732 109174156 109169424 109178019 109130919 109084249 109126365
3897.6A09126365Q4317L7587j6678p3802j04380o4039l708K6513K2173J0490P534k444
$$ 109126365 109210682 109248269 109231591 109157789 109053409 108989370 108985662 109012175 109034348 109044838 109052372 109049928
3922.1A09049928j4734l2973l0721N305j395l9756k6488O986J5664j848k7847k9076
$$ 109049928 109035194 109002221 108971500 108976805 108975410 108935654 108909166 108916152 108931816 108929968 108902121 108873045
3946.5A08873045j9848k1243j8096m899M565m697j9979k0588j7297j6212j2923j9002
$$ 108873045 108853197 108831954 108813858 108808959 108813524 108808827 108788848 108768260 108750963 108734751 108721828 108702826
3971A08702826k3949j3530m828j407k777N674K6274J2529k3258l7694k9838j1754k539
$$ 108702826 108678877 108665347 108660519 108659112 108656335 108662009 108688283 108700812 108677554 108639860 108610022 108598268 108595729
3997.5A08595729
$$ 108595729
##END=$$ End of the data block
