##TITLE=$$ Begin of the data block
##JCAMP-DX=5.00 $$ ACD/SpecManager v 10.08
##SPECTROMETER/DATA SYSTEM=Alpha
##DATE=27 Jun 2014 15:13:00
##DATA TYPE=INFRARED SPECTRUM
##DATA CLASS=XYDATA
##ORIGIN=
##OWNER=
##NPOINTS=1667
##FIRSTX=599.63549805
##LASTX=3997.56909180
##MAXX=3997.56909180
##MINX=599.63549805
##MAXY=1.09832990
##MINY=0.07339423
##XFACTOR=1.0000000000
##YFACTOR=0.000000010000000
##FIRSTY=0.99918008
##DELTAX=2.03957605
##XUNITS=1/CM
##YUNITS=ARBITRARY UNITS
##XYDATA=(X++(Y..Y))
599.6 99918008 99844265 100029349 100219321 100350130 100491989 100714827 101036847 101386213 101641595 101750851
620 101750851 101795805 101870739 101979005 102069747 102122557 102139008 102103674 102016175 101910341 101805711 101709604
642.5 101709604 101637089 101564157 101466262 101369750 101284766 101150727 100923479 100628090 100287509 99901533 99544162
664.9 99544162 99276727 98971450 98530942 98038375 97519982 96987921 96465117 95980340 95528394 95096761
685.3 95096761 94673914 94255680 93847150 93441522 92983758 92402673 91666108 90679771 89233547 87181795
705.7 87181795 84655088 82144988 80159223 78705519 77446860 76280022 75574791 75840569 77167553
724 77167553 79151022 81284899 83242178 84974688 86603916 88175231 89626878 90883452 91913044
742.4 91913044 92828703 93802255 94820291 95790255 96648943 97255218 97544432 97679180 97872162 98264068
762.8 98264068 98817664 99299639 99608308 99842852 100092781 100375915 100663447 100928342 101175201 101432788
783.2 101432788 101676869 101847899 101970410 102107334 102230895 102262485 102207959 102140307 102077818 101963019
803.6 101963019 101759088 101540959 101391816 101234031 101005816 100808299 100668168 100514436 100408649 100453937
824 100453937 100558674 100527167 100284827 99910581 99544758 99276388 99103838 98992515 98892128 98777920
844.4 98777920 98712492 98769647 98929834 99099380 99199766 99214536 99165165 99062210 98905724 98699039 98435718
866.8 98435718 98102993 97706258 97311133 97052842 97020704 97151816 97327530 97511262 97722161 97947544
887.2 97947544 98131883 98198980 98039079 97498536 96729308 96260494 96216702 96298069 96394324 96441025 96328533
909.6 96328533 96109718 95919687 95824999 95780993 95640606 95257926 94702792 94265729 94182122 94481510
930 94481510 94948500 95216078 95152253 95020729 95088142 95303762 95479977 95519155 95405895 95148128 94776374
952.5 94776374 94360816 93988740 93739015 93636811 93632221 93637866 93575895 93426156 93199593 92868537 92423910
974.9 92423910 92026109 91903937 92020071 92159057 92298824 92538637 92849189 93097478 93190843 93144763
995.3 93144763 93030924 92862165 92588377 92199403 91719800 91149789 90609038 90388232 90490812 90494716
1015.7 90494716 90140545 89613265 89198560 88925374 88667673 88440150 88348645 88365966 88311762 87958449
1036.1 87958449 87085640 85605508 83951133 82991284 83015931 83517075 84107685 84720576 85245621 85576636
1056.5 85576636 85743713 85854560 85970664 86068386 86098474 86022288 85813355 85424083 84771997 83793539
1076.9 83793539 82479852 80917490 79282176 77710712 76210392 74727046 73254395 71853209
1093.2 71853209 70626897 69713461 69235873 69215685 69561929 70101565 70594680 70792031 70570856 70031232
1113.6 70031232 69448036 69165158 69440311 70260161 71301943 72035480 71985972 71107841 69623882 67538017
1134 67538017 64817953 61796194 58976239 56639111 54776007 53239352 51856911 50498104 49115473
1152.4 49115473 47743297 46487802 45476666 44782332 44400084 44274303 44346863 44578922 44969496
1170.7 44969496 45607737 46603668 47928697 49500057 51284140 53170592 54990089 56656486 58168560
1189.1 58168560 59537834 60779935 61956042 63157701 64411336 65634739 66706103 67540127 68110847
1207.4 68110847 68449837 68641680 68772531 68885416 68964946 68938345 68739206 68364680 67882705 67406368
1227.8 67406368 67006367 66644752 66259563 65883613 65645278 65668690 66005266 66638690 67492640 68450266
1248.2 68450266 69375730 70165294 70795411 71316594 71801931 72275138 72696596 73038024 73339576 73675036
1268.6 73675036 74073124 74480218 74834633 75113434 75332326 75598741 76081353 76822710 77660471 78381538
1289 78381538 78888243 79237455 79528189 79768473 79918647 80058956 80340403 80774611 81230813 81624562
1309.4 81624562 82002836 82381433 82677907 82877594 83068234 83329827 83694708 84123385 84515071 84768456
1329.8 84768456 84814239 84637743 84273243 83787388 83276540 82845265 82506174 82190108 81850296 81497550
1350.2 81497550 81154227 80814850 80480075 80209583 80094874 80107135 80059701 79894233 79714221 79460007
1370.6 79460007 78833854 77565533 76195198 75934088 77207929 79278308 81381381 83379692 85005403
1388.9 85005403 85962534 86501974 86910415 87345147 88008219 88917369 89955920 90939456 91343153 90832162
1409.3 90832162 89421391 87484717 85754389 84937102 85311598 86116487 86638933 86568981 85684752
1427.7 85684752 84062916 82056081 80114460 78324777 76675421 75244403 73930097 72629780
1444 72629780 71322656 69855154 67967653 65526164 62848145 60652041 59519744 58710605 57660276
1462.4 57660276 56629002 56929082 60238683 67373490 77675438 86229390 90797013 93495822
1478.7 93495822 95569521 97290224 98606735 99654657 100563824 101209497 101531744 101677668 101620531
1497 101620531 101384544 101455712 102016103 102959609 103956544 104347289 104424250 104518819 104665732 104814506
1517.4 104814506 104924238 104993165 104972744 104911768 104853880 104779613 104721987 104626262 104446042 104304790 104215181
1539.9 104215181 103995585 103678608 103382397 103170359 103072703 103091121 103245282 103524375 103968632 104261398
1560.3 104261398 104203308 104157925 104240847 104448640 104673302 104776597 104854441 104932952 104878938 104771411 104702508
1582.7 104702508 104709685 104823804 105007887 105153668 105191875 105132771 105002069 104826343 104619169 104420805
1603.1 104420805 104288304 104252636 104260659 104230082 104151976 104062331 103904748 103648698 103393698 103123498 102811825
1625.5 102811825 102507234 102237725 102002859 101840687 101689744 101362395 100902987 100392628 99892777 99452877
1645.9 99452877 99035937 98644316 98391461 98081070 97512811 96935308 96453059 96074289 95796323 95732898
1666.3 95732898 96105433 96910614 97735363 98647237 99519289 99927706 99996048 99916142 99528903 98703253
1686.7 98703253 97656441 96457803 95348370 94416356 93562233 92615604 91371125 89997667 88626802
1705.1 88626802 87189341 85815144 84561992 83324361 81869084 79656839 76624459 73256403
1721.4 73256403 69429362 65009922 60118842 54673845 48805797 41926029 34872365 29337862
1737.7 29337862 24650863 21018755 18933037 18345244 19459245 22936583 28649971 35446668 43908164
1756.1 43908164 53803813 63391477 72530234 79782367 84824693 88805187 91944808 94510978
1772.4 94510978 96388412 97584146 98553991 99465758 100228775 100877464 101422238 101883888 102350843
1790.7 102350843 102824759 103151786 103390682 103661680 103933239 104163492 104360759 104573500 104791033 105007172
1811.1 105007172 105185795 105339849 105492806 105646086 105805659 105973995 106130767 106249189 106375790 106473553
1831.5 106473553 106536925 106607401 106690395 106768906 106865764 106984699 107047820 107062602 107080626 107114804 107153046
1854 107153046 107196641 107233119 107262719 107290375 107326305 107382715 107439482 107448590 107423019 107418144 107421899 107428288 107443810
1880.5 107443810 107472694 107506597 107544529 107586789 107612991 107628596 107647288 107664371 107673466 107686663 107697892 107702947
1904.9 107702947 107706785 107716322 107724714 107724798 107731044 107746184 107750285 107734168 107711101 107685483 107674456 107681954 107698965
1931.5 107698965 107709861 107707453 107706130 107714939 107733107 107742095 107745552 107757819 107775080 107786465 107795811 107809711 107824111
1958 107824111 107835615 107842350 107848668 107852864 107849419 107843089 107845747 107851017 107851481 107846379 107833767 107821894 107812464 107803214
1986.5 107803214 107801747 107812679 107815313 107796073 107773674 107761061 107754242 107748449 107736015 107710552 107675159 107639217
2011 107639217 107614338 107593906 107561255 107518756 107479417 107449961 107428658 107413781 107409561 107416070 107425153 107432568 107442296
2037.5 107442296 107455719 107471335 107485330 107495451 107503450 107512033 107525742 107540500 107546723 107552290 107569337 107587194
2062 107587194 107596219 107599282 107600915 107610655 107627642 107641053 107653069 107671261 107693660 107714128 107732916 107753277 107772303
2088.5 107772303 107792354 107811999 107826591 107840228 107857096 107875347 107883859 107884693 107895446 107921338 107947934 107963979
2113 107963979 107976353 107993019 108010936 108027899 108041978 108050644 108055091 108053863 108051503 108052647 108056724 108059037 108055186
2139.5 108055186 108045506 108031726 108017457 108006120 107999051 107990229 107981324 107979536 107983875 107991946 108004940 108022404 108040953
2166 108040953 108056331 108070529 108090222 108110082 108124232 108135855 108150232 108166862 108182383 108195782 108208215 108220994
2190.5 108220994 108232570 108244264 108257926 108277690 108298838 108307683 108308291 108316565 108326709 108327293 108330250 108345616 108367252
2217 108367252 108378994 108372903 108362496 108357584 108356464 108357406 108353186 108342862 108335125 108324778 108302712 108280492 108269346
2243.5 108269346 108262289 108253407 108242929 108231962 108220422 108212638 108209634 108207858 108205128 108195472 108187735 108189464 108187962
2270 108187962 108179724 108169580 108159649 108155251 108149004 108129191 108107364 108094919 108087313 108081043 108076191 108069098 108062780 108065617
2298.6 108065617 108076406 108091080 108106101 108125782 108160257 108204806 108250141 108297539 108352089 108424759 108519936
2321 108519936 108613169 108688235 108759296 108844602 108935690 108993435 109023523 109063244 109113240 109145081 109113467 108960962
2345.5 108960962 108764720 108713377 108887386 109204280 109508896 109728718 109832990 109826541 109742475 109596932
2365.9 109596932 109399199 109177089 108966041 108784890 108628786 108486474 108370614 108295417 108253694 108233058
2386.3 108233058 108226299 108224273 108217323 108213603 108221018 108223593 108215213 108209407 108211112 108217990 108228898 108240151 108247125 108250177
2414.8 108250177 108251214 108253717 108260107 108266449 108268309 108268702 108274066 108278310 108277440 108275962 108274806 108273149 108267534 108257937 108251846
2445.4 108251846 108255005 108261371 108262551 108258700 108253753 108250451 108246052 108234346 108219004 108204877 108192074 108188975 108191741
2471.9 108191741 108187437 108175564 108156407 108129418 108106220 108091521 108069062 108034682 108005655 107991838 107979405 107956266
2496.4 107956266 107934213 107916594 107888424 107851267 107818902 107790220 107755601 107716191 107677531 107632482 107583404
2518.9 107583404 107549226 107531929 107515287 107489872 107456422 107423449 107408130 107410359 107412577 107410121 107402205 107389891
2543.3 107389891 107380688 107374644 107368040 107356751 107339704 107319272 107294130 107265222 107235599 107203329 107162273 107114959
2567.8 107114959 107069325 107021320 106969559 106921649 106878304 106838810 106806898 106776488 106734622 106679785 106621969
2590.2 106621969 106575525 106541574 106503701 106457126 106414580 106371260 106309676 106241846 106190300 106152070 106109834
2612.7 106109834 106059098 106005013 105940652 105861378 105773318 105684972 105610180 105549335 105490386 105432045 105377972
2635.1 105377972 105336380 105312300 105292189 105262089 105216157 105154562 105091894 105032575 104959869 104864454 104746532
2657.5 104746532 104612660 104477584 104350233 104240167 104154503 104082572 104026115 103998530 103985286 103967464 103960109
2680 103960109 103986037 104035056 104091525 104155099 104218209 104285169 104367650 104448950 104512072 104560828 104595971 104612172
2704.5 104612172 104601574 104563487 104514492 104462850 104402530 104346466 104295051 104217851 104113173 103994322 103890383
2726.9 103890383 103845704 103857398 103902245 103958118 104011345 104076004 104143012 104179215 104171813 104141128 104127622 104144311
2751.4 104144311 104160559 104139805 104083061 104020655 103958678 103877842 103778946 103674173 103550875 103376019 103151691
2773.8 103151691 102929235 102708220 102438045 102120149 101780260 101414692 101024926 100636029 100251174 99836063
2794.2 99836063 99365824 98863018 98361719 97847277 97286481 96663487 95964634 95200169 94373327 93445259
2814.6 93445259 92388171 91193944 89848167 88325024 86600441 84646726 82416236 79851264
2830.9 79851264 76854253 73231119 68677789 62849706 55534369 46959752 37989292 29834214
2847.2 29834214 23508187 19559403 18104404 18911248 21549839 25498223 30155736 34847143 38870049
2865.6 38870049 41764972 43716410 45510495 47791657 50405377 52618963 53816134 53846037 52872699
2883.9 52872699 51153612 48941770 46454218 43866310 41290975 38770789 36290342 33813661
2900.2 33813661 31315750 28759295 26084846 23258314 20303370 17292874 14370212 11758957
2916.6 11758957 9683175 8259944 7499608 7339423 7694604 8503112 9713037 11336905 13423191
2934.9 13423191 15953517 18833497 21909989 24936798 27584031 29534176 30658036 31156486 31448263
2953.3 31448263 31997299 33181971 35182667 38021851 41637209 45903870 50589585 55365068 59953475
2971.6 59953475 64184463 67958063 71254629 74099523 76527286 78600264 80368775 81841660
2987.9 81841660 82992584 83739161 83957332 83512795 82317060 80398339 77957696 75410575 73335701
3006.3 73335701 72299272 72647226 74408054 77314156 80899847 84649152 88143700 91137356 93555409
3024.7 93555409 95438761 96869600 97954297 98785967 99434233 99958324 100363719 100650406 100874186
3043 100874186 101096380 101332510 101573026 101820683 102069628 102295375 102488160 102644622 102759624 102850163
3063.4 102850163 102941394 103069103 103258300 103475690 103672993 103823864 103938413 104060757 104201126 104334545
3083.8 104334545 104451370 104547989 104627812 104712117 104798961 104857433 104873407 104871583 104869199 104829216 104742324 104686987
3108.3 104686987 104719353 104788589 104833925 104878879 104960728 105080700 105224657 105356896 105441034 105480993 105521166
3130.7 105521166 105573940 105592680 105560625 105528009 105542314 105592692 105640566 105665326 105661249 105637205 105648136 105724061
3155.2 105724061 105805671 105853271 105878043 105887198 105890453 105901289 105918205 105927074 105924416 105921304 105925119 105927622 105926919
3181.7 105926919 105930698 105940402 105952561 105967212 105991566 106014991 106021452 106025195 106039584 106058884 106081116 106100583
3206.2 106100583 106113863 106131983 106159282 106187320 106207860 106226468 106250584 106266439 106267560 106266689 106260097 106232023
3230.7 106232023 106197393 106207430 106265008 106307995 106315815 106309378 106285155 106256080 106258094 106271327 106245244 106197929
3255.1 106197929 106197655 106233060 106243002 106231141 106205392 106137156 106036317 105978656 105992830 106019282 106030762 106033361
3279.6 106033361 106017816 105988193 105957711 105914652 105836308 105745208 105688810 105689955 105735266 105758750 105696702 105574322
3304.1 105574322 105486727 105491006 105565691 105648255 105678225 105669785 105668664 105662763 105612397 105531108 105496776 105521894
3328.6 105521894 105535829 105512595 105463552 105380738 105300295 105277526 105296636 105325091 105317092 105233705 105155015 105160725
3353 105160725 105178797 105128062 105037808 104965770 104905331 104803360 104680336 104630518 104700172 104830432 104946625
3375.5 104946625 105059230 105195701 105352712 105511951 105641437 105703628 105680633 105657423 105723596 105799866
3395.9 105799866 105766535 105670333 105672228 105788612 105868375 105858171 105821490 105795527 105809200 105859554 105876112
3418.3 105876112 105843508 105808628 105764222 105665827 105526328 105418158 105330455 105206287 105123150 105157995 105223882
3440.7 105223882 105219054 105144978 105052602 104964674 104868448 104769778 104661691 104503357 104320872 104212284 104128873
3463.2 104128873 103906953 103615856 103539121 103748024 103982031 104057610 104007852 103982139 104145026 104352200
3483.6 104352200 104414999 104475975 104605508 104668665 104638481 104584801 104564798 104560387 104538488 104602993 104748213
3506 104748213 104818988 104753983 104577351 104430461 104409289 104409659 104330790 104199433 104132020 104182315 104244697 104252207
3530.5 104252207 104236901 104216146 104228675 104296231 104351962 104379082 104467201 104645693 104825044 104977667 105142939
3552.9 105142939 105292833 105418873 105553412 105696976 105875027 106124794 106372654 106489384 106546628 106655228
3573.3 106655228 106794751 106932545 107049727 107117486 107162929 107268333 107416546 107419682 107283318 107169735
3593.7 107169735 107106197 107089961 107181895 107364321 107555723 107778895 108051825 108269501 108404970 108497155
3614.1 108497155 108577669 108677328 108729589 108728218 108765256 108892381 109064507 109083354 108994889 108947301 108932126
3636.5 108932126 108945501 108970094 108976138 109011841 109133887 109261215 109242594 109162807 109146380 109129369 109054279
3659 109054279 109026313 109071302 109124672 109207618 109336448 109385049 109385741 109450877 109440482 109339952 109268415 109241104
3683.4 109241104 109254992 109326053 109426749 109468877 109443128 109413481 109423459 109473372 109523439 109522331 109508944 109549427
3707.9 109549427 109635293 109675193 109614193 109541059 109522176 109543753 109571707 109594572 109594631 109567058 109580958 109672153
3732.4 109672153 109748018 109697723 109564292 109497833 109588242 109712076 109698379 109692121 109719706 109634376 109507811
3754.8 109507811 109453440 109462571 109450126 109410381 109403753 109418774 109417355 109387851 109353638 109340215 109347677 109356272
3779.3 109356272 109343421 109330142 109317243 109286714 109272051 109287620 109310603 109331524 109351516 109402621 109433246
3801.7 109433246 109380376 109350097 109329355 109265482 109234810 109284210 109361565 109404516 109449720 109431326 109335661
3824.2 109335661 109276485 109253800 109256947 109289169 109324241 109363019 109384906 109355974 109295714 109216678 109152973 109166396
3848.6 109166396 109303510 109508336 109498632 109312677 109197044 109187806 109243202 109286118 109302711 109333014 109329832
3871.1 109329832 109282207 109216881 109158397 109160650 109178483 109175253 109182143 109169614 109155715 109157753 109131587 109103513
3895.5 109103513 109133828 109215343 109274101 109253216 109149027 109026575 108970714 108988619 109027851 109042370 109028924
3918 109028924 109016728 109013999 109012747 108997238 108976185 108976316 108968687 108925569 108887732 108885479 108914697 108944011 108931422
3944.5 108931422 108889449 108848667 108815539 108794010 108790684 108792269 108771431 108742130 108734071 108735824 108727503 108706307
3969 108706307 108680367 108667541 108659589 108645058 108641636 108641863 108637464 108638883 108636439 108626163 108608985 108580542 108553755
3995.5 108553755 108546162
3997.5 108546162
##END=$$ End of the data block
