##TITLE=$$ Begin of the data block
##JCAMP-DX=5.00 $$ ACD/SpecManager v 10.08
##SPECTROMETER/DATA SYSTEM=Alpha
##DATE=27 Jun 2014 15:13:00
##DATA TYPE=INFRARED SPECTRUM
##DATA CLASS=XYDATA
##ORIGIN=
##OWNER=
##NPOINTS=1667
##FIRSTX=599.63549805
##LASTX=3997.56909180
##MAXX=3997.56909180
##MINX=599.63549805
##MAXY=1.09804857
##MINY=0.07499914
##XFACTOR=1.0000000000
##YFACTOR=0.000000010000000
##FIRSTY=0.99898016
##DELTAX=2.03957605
##XUNITS=1/CM
##YUNITS=ARBITRARY UNITS
##XYDATA=(X++(Y..Y))
599.6I9898016p1024J74009J92142J54400J37102J83821K98417L68344K97845J31333
620A01764405M0662N9497Q8013Q7940P9251M6825k7347r6273j19913j09672p0429l8767
644.5A01704192o6089j05715j07789j04571j46722k19942k92539l58427m02599l72571
664.9I9527228k99031l23766m18919m72695n05859n16510n19633m86416m43554m31549
685.3I5109296m23628m04310l98767m15844m77153n87654p33358r93532j452559k041090
705.7H7181401k513987k511465j996845j463533j260489j150292o74123K76667J307744
724G7195078J957947K108735J942635J731711J629943J579904J456839J251281J035356
742.4I1889429R31507R88877J027894R59480Q24529N82874K97570J41370J73349L69960
$$ y = [99898016, 99826992, 100001001, 100193143, 100347543, 100484645, 100668466, 100966883, 101335227, 101633072, 101764405, 101805067, 101864564, 101952577, 102040517, 102119768, 102166593, 102139246, 102042973, 101923060, 101813388, 101742959, 101704192, 101638103, 101532388, 101424599, 101320028, 101173306, 100953364, 100660825, 100302398, 99899799, 99527228, 99228197, 98904431, 98485512, 98012817, 97506958, 96990448, 96470815, 95984399, 95540845, 95109296, 94685668, 94281358, 93882591, 93466747, 92989594, 92401940, 91668582, 90675050, 89222491, 87181401, 84667414, 82155949, 80159104, 78695571, 77435082, 76284790, 75610667, 75887334, 77195078, 79153025, 81261760, 83204395, 84936106, 86566049, 88145953, 89602792, 90854073, 91889429, 92820936, 93809813, 94837707, 95797187, 96621716, 97204590, 97502160, 97643530, 97816879, 98186839]
762.8I8186839N57220M97835L16138K43890K58517K77078K78437K63822K49386K51770
783.2A01380932K24328J54841J32478J68526J35124L039p4100m3392l5167j17576k08378
805.6A01720655k08271j55687j81830k39861j99389j37699j37901q4329N9605J04260
826A00539553m6182k48658l62826l59767k69884j66839j02294r1284j06305o6996N1558
848.5I8770076J70583J93637J17707K0504n5551j13666j59621k07580k63649l32790
868.9I8139650l98922l93236k56956l1501J42247J82205J63710J85055K23499J96481
889.3I8152232O9821j69617n49787p63881m51965l3348Q1694R1046L4219j26201k20168
911.7I6114045j76823q7744o0087j56892l76212n48911m50921r8014K98929M75293
$$ y = [98186839, 98744059, 99241894, 99558032, 99801922, 100060439, 100337517, 100615954, 100879776, 101129162, 101380932, 101605260, 101760101, 101892579, 102061105, 102196229, 102199268, 102125168, 102081776, 102046609, 101929033, 101720655, 101512384, 101356697, 101174867, 100935006, 100735617, 100597918, 100460017, 100375688, 100435293, 100539553, 100493371, 100244713, 99881887, 99522120, 99252236, 99085397, 98983103, 98891819, 98785514, 98718518, 98770076, 98940659, 99134296, 99252003, 99272507, 99216956, 99103290, 98943669, 98736089, 98472440, 98139650, 97740728, 97347492, 97090536, 97059035, 97201282, 97383487, 97547197, 97732252, 97955751, 98152232, 98222053, 98052436, 97502649, 96738768, 96286803, 96253455, 96335149, 96426195, 96460414, 96334213, 96114045, 95937222, 95849478, 95789391, 95632499, 95256287, 94707376, 94256455, 94158441, 94457370, 94932663]
932.1I4932663K75493o1381j36626N3943K00104J72067N0807j06043k65848l80093
952.5I4735086m24695l87961k54845r2817J699J4633m6420j48928k43438l46815m41814
974.9I2363685l79651j15323J03718J25992J37001K42657L12680K45457R0695l7646
995.3I3089265j01424j64079k79707l99822m85420n71132n35130k13910R8473J282
1015.7I0438396l42667n18012m19885k76351k46287k11811q3810J6612n2691l47411
1036.1H7956083q81708j500493j657909r46886M1926N14323N89007O05893N22536L30126
1056.5H5572898J70064J13345J10936R3823L6294o9106k13265m00132o54352r71401
1076.9H3789104j304793j548588j623387j576215j512807j483709j460540j384115
$$ y = [94932663, 95208156, 95146775, 95010149, 95064092, 95264196, 95436263, 95487070, 95381027, 95115179, 94735086, 94310391, 93922430, 93667585, 93574768, 93576467, 93591100, 93544680, 93395752, 93152314, 92805499, 92363685, 91984034, 91868711, 91972429, 92098421, 92235422, 92478079, 92790759, 93036216, 93126911, 93089265, 92987841, 92823762, 92544055, 92144233, 91658813, 91087681, 90552551, 90338641, 90437114, 90438396, 90095729, 89577717, 89157832, 88881481, 88635194, 88423383, 88339573, 88356185, 88303494, 87956083, 87074375, 85573882, 83915973, 82969087, 83011013, 83525336, 84114343, 84720236, 85242772, 85572898, 85742962, 85856307, 85967243, 86061066, 86097360, 86028254, 85814989, 85414857, 84760505, 83789104, 82484311, 80935723, 79312336, 77736121, 76223314, 74739605, 73279065, 71894950]
1093.2G1894950j212389r17536m92096k4896L47781N42968N02986K03305k27499n47397
1113.6G0070177n84322k82270K70385Q14110J045185P40803m8507q76200j472974k073174
1134F7603213k712757l022432k826977k338248j857531j535029j380467j350206j369873
1152.4D9209693j358980j251367j017156o97371l85803j35306P2217K40395L91507
1170.7D5067829O34751R99608J332084J567760J770681J878249J815177J658701J509375
1189.1E8234215J374084J242059J165450J191347J249809J219534J065755Q28070N66154
1207.4F8136477L39628J93727J29986J14077Q1068k8789j98638l68810m77576m76444
1227.8F7444706l99989l60078l83830l70854k31939K3806L31056O27476Q50278R53221
$$ y = [71894950, 70682561, 69765025, 69272929, 69248033, 69595814, 70138782, 70641768, 70845073, 70617574, 70070177, 69485855, 69203585, 69473970, 70288080, 71333265, 72074068, 72025561, 71149361, 69676387, 67603213, 64890456, 61868024, 59041047, 56702799, 54845268, 53310239, 51929772, 50579566, 49209693, 47850713, 46599346, 45582190, 44884819, 44499016, 44363710, 44435927, 44676322, 45067829, 45702580, 46702188, 48034272, 49602032, 51372713, 53250962, 55066139, 56724840, 58234215, 59608299, 60850358, 62015808, 63207155, 64456964, 65676498, 66742253, 67570323, 68136477, 68476105, 68669832, 68799818, 68913895, 68994963, 68966174, 68767536, 68398726, 67921150, 67444706, 67044717, 66684639, 66300809, 65929955, 65698016, 65721822, 66052878, 66680354, 67530632, 68483853]
1248.2F8483853R24361P93499O29288N15026M84699M80461M25678L37738K96599L33315
1268.6G3704517L97622M05252L48509K72852K17658K67679M86415P44570Q35383P18581
1289G8399038N07069L47215K84922K37352J53595J42121K77919M31794M55171L91662
1309.4H1627858L79425L82030K94882J93489J85632K59710L68493M32826L86798K46614
1329.8H4757757M5639j76191l68839m86327n04404m29410l40956l15708l41272l59375
1350.2H1480914l46577l33607l27075k66790j15412J1372m9132j72645j87039k51645
1370.6G9442364o20753j272279j375335k60562J274157K067107K100384K000475J624602
1388.9H4980160R49633N33283M06456M35930O65754R06694J028878R74911M01461n11473
$$ y = [68483853, 69408214, 70201713, 70831001, 71346027, 71830726, 72311187, 72736865, 73074603, 73371202, 73704517, 74102139, 74507391, 74855900, 75128752, 75346410, 75614089, 76100504, 76845074, 77680457, 78399038, 78906107, 79253322, 79538244, 79775596, 79929191, 80071312, 80349231, 80781025, 81236196, 81627858, 82007283, 82389313, 82684195, 82877684, 83063316, 83323026, 83691519, 84124345, 84511143, 84757757, 84803396, 84627205, 84258366, 83772039, 83267635, 82838225, 82497269, 82181561, 81840289, 81480914, 81134337, 80800730, 80473655, 80206865, 80091453, 80102825, 80053693, 79881048, 79694009, 79442364, 78821611, 77549332, 76173997, 75913435, 77187592, 79254699, 81355083, 83355558, 84980160, 85929793, 86463076, 86869532, 87305462, 87971216, 88877910, 89906788, 90881699, 91283160, 90771687]
1409.3I0771687j411658j932723j721304q14713L68613Q05420N25433o9004q78156
1427.7H5643595j613801k004826j941061j780409j636392j424515j311386j300376
1444G2630829j307243j465101j882576k429647k660662k181744j130855q17567j054788
1462.4E7700646j023591L06887L296822P107729J0276961Q538371M553187K690345
1478.7I3447357K077538J729268J319802J047271R09889O45220L21782J49202n6266
1497A01591063k37561P7093N69868R49204R97233L88801P7892R6977J46651J47939
1517.4A04805160J11949P4661j2529n5242n5539p5174o1452r8407j77741j38235r2102
1539.9A04225349k25806l17347k91216k07150r6047J6439J52886K80726M40585K78271
$$ y = [90771687, 89360029, 87427306, 85706002, 84891289, 85259902, 86065322, 86590755, 86521751, 85643595, 84029794, 82024968, 80083907, 78303498, 76667106, 75242591, 73931205, 72630829, 71323586, 69858485, 67975909, 65546262, 62885600, 60703856, 59573001, 58755434, 57700646, 56677055, 56983942, 60280764, 67388493, 77665454, 86203825, 90757012, 93447357, 95524895, 97254163, 98573965, 99621236, 100531125, 101176345, 101498127, 101647329, 101591063, 101353502, 101430595, 102000463, 102949667, 103946900, 104335701, 104413593, 104510570, 104657221, 104805160, 104917109, 104991770, 104979241, 104923999, 104868460, 104793286, 104731834, 104633427, 104455686, 104317451, 104225349, 103999543, 103682196, 103390980, 103183830, 103087783, 103104222, 103257108, 103537834, 103978419, 104256690]
1560.3A04256690o3646m2737P9358J96612K18689J06669Q3172Q0442n5384j09744p3195
1582.7A04676926J049J09232J78206J39892L9530n5337j33253j80876k08306j98293
1603.1A04368770j36208m0329N543l3712q2970r4831j58655k53761k54643k69759l11863
1625.5A02737582l08669k73061k35736j60086j40465l19778m60422n11265n01412m41599
1645.9I9385089m17042l89034k41673k98422n69904n80758m81993l77017k78306o4743
1666.3I5686197L74437Q05217Q18044R06175Q70240M09192P4553p4720l91472q29208
1686.7I8648655j049161j201850j108193r25773q47024r38851j234895j366389j364141
1705.1H8612378j433695j376480j253163j233626j451558k206433l026932l360963
$$ y = [104256690, 104193044, 104150307, 104229665, 104426277, 104644966, 104751635, 104834807, 104915249, 104859865, 104750121, 104676926, 104677975, 104787207, 104965413, 105105305, 105144835, 105089498, 104956245, 104775369, 104567063, 104368770, 104232562, 104192233, 104197776, 104164064, 104081094, 103986263, 103827608, 103573847, 103319204, 103049445, 102737582, 102428913, 102155852, 101920116, 101760030, 101619565, 101299787, 100839365, 100328100, 99826688, 99385089, 98968047, 98579013, 98337340, 98038918, 97469014, 96888256, 96406263, 96029246, 95750940, 95686197, 96060634, 96865851, 97683895, 98590070, 99460310, 99869502, 99944055, 99869335, 99477863, 98648655, 97599494, 96397644, 95289451, 94363678, 93516654, 92577803, 91342908, 89976519, 88612378, 87178683, 85802203, 84549040, 83315414, 81863856, 79657423, 76630491, 73269528]
1721.4G3269528l810990m402142m880649n434609n852297o855646p025232n514622
1737.7B9493341m674173l621475k081823n90179J115941L476633N695759O767261Q423283
1756.1D4004568R854809R556955R114701P234573N038255L980840L134065K563620
1772.4I4482386J879192J192647R67467R13733P63094O52695N53989M62342M60243
1790.7A02327788M72557L34990K48349K77698K77376K30301J89566K08581K21229K19440
1811.1A05007875J76501J52362J58429J59693J59120J66452J61994J27577J29807R1470
1831.5A06491280N6469P2110Q8107P8786R3353J14679O1691J9562K7859M2772L9137
1854A07185805L9625L6669L5083L0398L2557N3524N7173N973l4857j1933O759J3733
$$ y = [73269528, 69458538, 65056396, 60175747, 54741138, 48888841, 42033195, 35007963, 29493341, 24819168, 21197693, 19115870, 18525691, 19641632, 23118265, 28814024, 35581285, 44004568, 53859377, 63416332, 72531033, 79765606, 84803861, 88784701, 91918766, 94482386, 96361578, 97554225, 98521692, 99435425, 100198519, 100851214, 101405203, 101867545, 102327788, 102800345, 103135335, 103383684, 103661382, 103938758, 104169059, 104358625, 104567206, 104788435, 105007875, 105184376, 105336738, 105495167, 105654860, 105813980, 105980432, 106142426, 106270003, 106399810, 106491280, 106547749, 106619859, 106707966, 106786752, 106880105, 106994784, 107056475, 107076037, 107103896, 107146668, 107185805, 107225430, 107262099, 107297182, 107327580, 107360137, 107413661, 107470834, 107476807, 107441950, 107430017, 107436776, 107450509]
1878.4A07450509J8942K9099K9993L0971M1115K6393J1254K2745K9671J3065O998P510
1902.9A07718265O604P928J4567Q452n019l5Q499N84r739j0502j7691q524J634K837
1931.5A07717860L111k503k408Q917K1886J2029J406P880J5748J3828J4174J6522J1957
1958A07840407M661k527K479J0252M411n746j478L159k909r489j1086q250n865n114
1986.5A07812905k575L994l755j8859j6844j2327j2076n471l386j5604l3164m1616
2011A07651222l3069k2936k7418l9160m0841l1364k4450j8656n234Q560J1015O544
2035.5A07434213J2016K3127K1911J0252P462J2553J0085N758O878O020J681O199J9074
2062A07577229K2935J1039J514Q643J6975J4138J3090J9812K0230J5771K0314K4533
$$ y = [107450509, 107469451, 107498550, 107528543, 107559514, 107600629, 107627022, 107638276, 107661021, 107690692, 107703757, 107710755, 107718265, 107724869, 107732797, 107747364, 107755816, 107750797, 107750762, 107759261, 107759845, 107750106, 107739604, 107721913, 107713389, 107715023, 107717860, 107720971, 107718468, 107716060, 107724977, 107746863, 107758892, 107760298, 107768178, 107783926, 107797754, 107811928, 107828450, 107840407, 107845068, 107842541, 107845020, 107855272, 107859683, 107853937, 107852459, 107855618, 107852709, 107843220, 107832134, 107823884, 107818019, 107812905, 107810330, 107814324, 107810569, 107791710, 107774866, 107762539, 107750463, 107744992, 107741606, 107726002, 107692838, 107651222, 107618153, 107595217, 107567799, 107528639, 107487798, 107456434, 107431984, 107413328, 107408094, 107416654, 107427669, 107434213, 107446229, 107469356, 107491267, 107501519, 107508981, 107521534, 107531619, 107537377, 107544255, 107550275, 107551956, 107558155, 107577229, 107600164, 107611203, 107612717, 107621360, 107638335, 107652473, 107665563, 107685375, 107705605, 107721376, 107741690, 107766223]
2086.5A07766223J5700J3566K1660K3425J8203J2839R751O509R012J4162J8251J6749
2110.9A07946050R239J0931J7691J6940J5759J4830R191M864m8n579n281J430K718
2137.5A08038735n936j2183j1421j1170j0955q249j1790j1206j073K504Q82Q285J5914
2164A07982337J5069J3101J3435K0468K6166J8919Q571R310J2016J0789J0049R096
2188.4A08149326Q035R059J3900J6129J9086J9049R430M315O974M613j943M77J0574
2215A08269024J7536J4841K897l445K301M076j835r501j5223j5462j3470j0694p379
2241.5A08233666q344j2923j5664j5914q309R66K169j144m697p582j3733j8274j4472
2268A08115745n544L398O854L469m220j6915k4736j6439p904j0931j1468n293n305
$$ y = [107766223, 107781923, 107795489, 107817149, 107840574, 107858777, 107871616, 107881367, 107887876, 107896888, 107911050, 107929301, 107946050, 107955289, 107966220, 107983911, 108000851, 108016610, 108031440, 108040631, 108045495, 108045447, 108039868, 108034587, 108036017, 108038735, 108032799, 108020616, 108009195, 107998025, 107987070, 107978821, 107967031, 107955825, 107954752, 107957256, 107958138, 107966423, 107982337, 107997406, 108010507, 108023942, 108044410, 108070576, 108089495, 108098066, 108107376, 108119392, 108130181, 108140230, 108149326, 108157361, 108166420, 108180320, 108196449, 108215535, 108234584, 108244014, 108248329, 108255303, 108259916, 108257973, 108258450, 108269024, 108286560, 108301401, 108304298, 108300853, 108303154, 108307230, 108305395, 108295894, 108280671, 108265209, 108251739, 108241045, 108233666, 108225322, 108212399, 108196735, 108180821, 108172512, 108173478, 108175647, 108174503, 108169806, 108162224, 108148491, 108130217, 108115745, 108110201, 108113599, 108120453, 108123922, 108119702, 108102787, 108078051, 108061612, 108053708, 108042777, 108031309, 108026016, 108020711]
2294.5A08020711m029M327R215J3923J7262K1160L6406N1439N3084N0664N6195P2479
2319A08402836Q8442Q3935P6938Q3446Q4496P2229M6873L6430M9651O0224M6277k5963
2343.5A09105814j60766k03693n6994J68693L16691K98095K01702J09065K6250o9249
2363.8A09735608j50537k01929k30229k07984j68038j56259j45388j09529o7378l5023
2384.2A08263314j9062j4376r847j0216p904L326L076p153n758M542J0693J3852J5641
2410.8A08240128Q738j419TO628J0097L517l147Q70P761L123k646P98O56o259q368
2441.3A08259058n841m351J549N675K443j215m483p724r454j0681j3244j0705j538
2467.9A08199489K217o997j5593j3327j4508k1410k2209k2280l0661l5822k3687r704
$$ y = [108020711, 108016682, 108021009, 108030224, 108044147, 108061409, 108082569, 108118975, 108170414, 108223498, 108274162, 108330357, 108402836, 108491278, 108575213, 108652151, 108735597, 108820093, 108892322, 108939195, 108975625, 109025276, 109085500, 109131777, 109105814, 108945048, 108741355, 108684361, 108853054, 109169745, 109467840, 109669542, 109778607, 109804857, 109735608, 109585071, 109383142, 109152913, 108944929, 108776891, 108620632, 108475244, 108365715, 108298337, 108263314, 108244252, 108229876, 108220029, 108209813, 108201909, 108205235, 108208311, 108201158, 108195400, 108199942, 108210635, 108224487, 108240128, 108248866, 108247447, 108246028, 108252656, 108262753, 108266270, 108263123, 108263993, 108271754, 108274877, 108272231, 108273029, 108273685, 108267426, 108259058, 108253217, 108248866, 108250415, 108256090, 108258533, 108257318, 108252835, 108245111, 108235657, 108224976, 108211732, 108201027, 108199489, 108201706, 108194709, 108179116, 108165789, 108151281, 108129871, 108107662, 108085382, 108054721, 108018899, 107995212, 107985508]
2492.3A07985508j5890k9409k6107j8692k6083l3855l2449k8980l0363l6048m1700
2514.8A07665932m9567m9245l4225j9646j7154k4474l2675l2699k0635p260j204R53
2539.2A07378101k241j0359j3876q786n960j1337j7285k0290k1994k3878k9647m1425
2563.7A07171023m7314m0806l7777m6003n5456n9187n3454l7920l2688m4930n1820
2586.2A06663668n0974n0497m4286l7718l5369l3522l7205n0056o5243o7294n0879
2608.6A06140625l7169m6825o2275o0809o0523p2443q2803q4877p4565o3300o3527
2631A05431509o1929n1022l6800k2852j8537l0089m8756o3896o6221o4325p3421q8859
2655.5A04804802j07575j28483j40667j30999j05429q3208p0846n5182k9111j7560
$$ y = [107985508, 107969618, 107940209, 107914102, 107895410, 107869327, 107835472, 107803023, 107774043, 107743680, 107707632, 107665932, 107616365, 107567120, 107532895, 107513249, 107496095, 107471621, 107438946, 107406247, 107385612, 107378352, 107377148, 107378101, 107375860, 107365501, 107351625, 107342839, 107336879, 107325542, 107308257, 107287967, 107265973, 107242095, 107212448, 107171023, 107123709, 107082903, 107045126, 106999123, 106943667, 106884480, 106831026, 106793106, 106760418, 106715488, 106663668, 106612694, 106562197, 106517911, 106480193, 106444824, 106411302, 106374097, 106324041, 106258798, 106191504, 106140625, 106103456, 106056631, 105994356, 105933547, 105873024, 105800581, 105717778, 105632901, 105558336, 105495036, 105431509, 105369580, 105318558, 105281758, 105258906, 105240369, 105210280, 105161524, 105097628, 105031407, 104967082, 104893661, 104804802, 104697227, 104568744, 104428077, 104297078, 104191649, 104108441, 104037595, 103982413, 103953302, 103935742]
2675.9A03935742k1278l148L4738N5122N8735O4325O5959P0285Q1397P6746O1822N3835
2700.4A04534280L9947J4782j5235m0364m9210n1188n6338n0283m7767p1871r8014
2722.8A04108739j19889j12080n1296J0419M6479O2466O3002O5327O2406L3665p773
2745.2A04161465k7978j0145J9646J1563k7668n1046n8508p0464q4532r6500j10352
2767.7A03655481j30713j69229k17056k31684k29406k58803l03150l37469l74460m04668
2788.1A00998843l99053l84879m14330m73148m99678m96912n20962n71537o27381o93392
2808.5I5917571p56884q27676r35304j061011j188427j334452j513422j719481j951194
2826.8H4629720k226704k563596k996021l615385m543174n817467p299071q551231
$$ y = [103935742, 103914464, 103911316, 103946054, 104001176, 104059911, 104124236, 104190195, 104260480, 104341877, 104418623, 104480445, 104534280, 104574227, 104589009, 104573774, 104533410, 104484200, 104433012, 104376674, 104326391, 104278624, 104206753, 104108739, 103988850, 103876770, 103825474, 103835893, 103882372, 103944838, 104007840, 104073167, 104135573, 104169238, 104161465, 104133487, 104123342, 104142988, 104154551, 104126883, 104075837, 104017329, 103946865, 103862333, 103765833, 103655481, 103524768, 103355539, 103138483, 102906799, 102677393, 102418590, 102115440, 101777971, 101403511, 100998843, 100599790, 100214911, 99800581, 99327433, 98827755, 98330843, 97809881, 97238344, 96610963, 95917571, 95160687, 94333011, 93397707, 92336696, 91148269, 89813817, 88300395, 86580914, 84629720, 82403016, 79839420, 76843399, 73228014, 68684840, 62867373, 55568302, 47017071]
2843.1D7017071q943451q131626o304911l928634j448074Q00584K637896L952600M645824
2861.5C0297279M665760M004514K886936J946145J791918K282125K608401K194887
2877.8E2677965J179737L0947r60702j709741k205858k478778k579004k569067k520159
2896.2C8865340k482993k465769k483145k556714k672646k810031k937366k996808
2912.5A7459868k912960k607806k078826j431998p68346j60018L64746Q15492J206728
2930.8I886880J622071K090218K532751K875471L063267L013799K638510J941764J120186
2949.2C0784917N01117K99352N54458J176905J984513K823553L603103M254970M672435
2967.6E0655323M765439M581446M218232L757477L290802K843893K418101K056521
$$ y = [47017071, 38073620, 29941994, 23637083, 19708449, 18260375, 19060959, 21698855, 25651455, 30297279, 34963039, 38967553, 41854489, 43800634, 45592552, 47874677, 50483078, 52677965, 53857702, 53888649, 52927947, 51218206, 49012348, 46533570, 43954566, 41385499, 38865340, 36382347, 33916578, 31433433, 28876719, 26204073, 23394042, 20456676, 17459868, 14546908, 11939102, 9860276, 8428278, 7659932, 7499914, 7864660, 8680152, 9886880, 11508951, 13599169, 16131920, 19007391, 22070658, 25084457, 27722967, 29664731, 30784917, 31286034, 31585386, 32139844, 33316749, 35301262, 38124815, 41727918, 45982888, 50655323, 55420762, 60002208, 64220440, 67977917, 71268719, 74112612, 76530713, 78587234]
2983.9G8587234J757747J476729J154947P38329K06667m47911j187128j911723k440447
3002.2G7934444k534658k058941j038504L40850J758229K899146L576857L745824L491629
3020.6H8114876K989810K420277J890921J435286J079583Q26508O58155N36865M04036
3038.9A00356317K82132K23744K20788K34079K35963K35438K35546K23660K01965J64175
3059.3A02613807J11365P8273Q2528J28901J94586K18010J90484J42980J12307J24860
3079.7A03998101J42956J36792J21796R3854O6447P2098Q2671N7233J1158p618k050
3102.2A04773438l2091p2706n0497J8251N7805M4047M1688P8106J17075J41382J35720
3124.6A05252218Q8668L9697L6549N1344K6011l0803m3333P415M6658M5097L3176P272
$$ y = [78587234, 80344981, 81821710, 82976657, 83714986, 83921653, 83473742, 82286614, 80374891, 77934444, 75399786, 73340845, 72302341, 72643191, 74401420, 77300566, 80877423, 84623247, 88114876, 91104686, 93524963, 95415884, 96851170, 97930753, 98757261, 99415416, 99952281, 100356317, 100638449, 100862193, 101082981, 101317060, 101553023, 101788461, 102024007, 102247667, 102449632, 102613807, 102725172, 102803445, 102885973, 103014874, 103209460, 103427470, 103617954, 103760934, 103873241, 103998101, 104141057, 104277849, 104399645, 104493499, 104559946, 104632044, 104714715, 104771948, 104783106, 104775488, 104773438, 104741347, 104668641, 104618144, 104636395, 104694200, 104738247, 104779935, 104858041, 104975116, 105116498, 105252218, 105340886, 105380583, 105417132, 105468476, 105494487, 105463684, 105420351, 105427766, 105474424, 105519521, 105552697, 105559969]
3149.1A05559969k2328J4162Q1802P8988L7908K0635K1136J6522P201Q344R358K802
3173.5A05836499L218J1516J3399P975N329Q142R143P951J3400J9943J9169J8275J8823
3200.1A05992782J8025J8608K1160K5320K2781K3484L3915K5678J2207K3639L2043
3222.5A06249642K2412Q177j2576l9995m3320J3148O6603M8470J0133j0634l8695m1819
3247A06231546P248K9600q309l0100J216J9145l517j2481k4820p9274j11913n2655
3271.4A05965686K1469K7872J3101j836k6024l8886l2639l3355o7222r1588n9867J394
3295.9A05678105M3643K2793o4028j32513j03950r835O7484Q5187M9365M613j6045
3318.4A05624819k2435m6325o9142k8407K3281P082l0864n3966q0085o7174j1241J4865
$$ y = [105559969, 105537641, 105551803, 105633605, 105712593, 105750501, 105771136, 105792272, 105808794, 105815995, 105824339, 105833697, 105836499, 105839717, 105851233, 105864632, 105872607, 105877936, 105886078, 105895221, 105903172, 105916572, 105936515, 105955684, 105973959, 105992782, 106010807, 106029415, 106050575, 106075895, 106098676, 106122160, 106156075, 106181753, 106193960, 106217599, 106249642, 106272054, 106280231, 106267655, 106227660, 106184340, 106197488, 106264091, 106312561, 106322694, 106312060, 106273365, 106231546, 106238794, 106268394, 106260085, 106229985, 106231201, 106250346, 106246829, 106234348, 106209528, 106130254, 106018341, 105965686, 105987155, 106015027, 106028128, 106026292, 106000268, 105961382, 105928743, 105895388, 105828166, 105736578, 105676711, 105678105, 105721748, 105744541, 105680513, 105548000, 105444050, 105434215, 105501699, 105586886, 105636251, 105640864, 105624819, 105602384, 105556059, 105486917, 105458510, 105481791, 105488873, 105458009, 105404043, 105323958, 105256784, 105245543, 105260408]
3342.8A05260408J6940j5259q8895p7748J2887K2077n1355r8002q2135n6637q5926
3365.3A04756355j15561n6291O1393J20771J03164J11746J56248J79350J65117J22225
3385.7A05604517N0831l1447j5915Q0920P5280m8720j03379J1289J27328R0205j54
3408.1A05840755l7551k8873J3530M1366Q082j9824k1112n4288j04690j26659r9004
3430.5A05411732j02591j50061q2862O3181R0432o449r4700j08838q4663p9512r1589
3453A04764080j08826j53315j82414j20294r7072k32685k98512p4935K25222K55156
3473.4A03976405P7986p2097n1153J58274K21503P2491N3620J14513N9032k1577m9233
3495.8A04539764k6310j4329k2494P9882J55032O5958o1488j62542j41954k7836p212
$$ y = [105260408, 105277348, 105262089, 105173194, 105095446, 105108333, 105130410, 105079055, 104981053, 104898918, 104842281, 104756355, 104640794, 104584503, 104645896, 104766667, 104869831, 104981577, 105137825, 105317175, 105482292, 105604517, 105655348, 105623901, 105607986, 105688906, 105764186, 105715466, 105612087, 105623376, 105750704, 105840909, 105840755, 105803204, 105774331, 105787861, 105829227, 105837309, 105817485, 105796373, 105742085, 105637395, 105510736, 105411732, 105309141, 105159080, 105076218, 105139399, 105229831, 105223382, 105128682, 105019844, 104935181, 104855669, 104764080, 104655254, 104501939, 104319525, 104199231, 104102159, 103869474, 103570962, 103496027, 103721249, 103976405, 104054391, 103982294, 103931141, 104089415, 104310918, 104383409, 104437029, 104551542, 104610574, 104588997, 104539764, 104513454, 104499125, 104476631, 104556513, 104711545, 104777503, 104716015, 104553473, 104411519, 104383683, 104376471]
3518.2A04376471q0740j27268o8152M6491O5721M220k6787l2615l911O0440O6053L9971
3542.7A04319894R9051J89126J85096J46520J47176J41215J33407J35601J39725J90687
3563.1A05827498K70808K51746J05048M7040J03640J37305J28806J08814P7760N5790
3583.5A07114255R7335J47402K7406j25312j30940q0812j9050R9385J93107J92917
3603.9A07515693K11882K61402K15996J39153J01578R5999J15121O1690o544J2719
3624.3A08724689J00875J70660L6490q2349n2596k0265R358K5177O008L0220J22833
3646.7A09071100J38151r381p7582j5032j7202q0585l6633L9935O0105Q8179J14453
3669.2A09275508K6894l517Q8036J6057j02269q6367l3057J5223O6447R2709L9017
$$ y = [104376471, 104295731, 104168463, 104100311, 104146802, 104212523, 104216743, 104189956, 104157341, 104153430, 104213870, 104279923, 104319894, 104418945, 104608071, 104793167, 104939687, 105086863, 105228078, 105361485, 105497086, 105636811, 105827498, 106098306, 106350052, 106455100, 106502140, 106605780, 106743085, 106871891, 106980705, 107058465, 107114255, 107211590, 107358992, 107386398, 107261086, 107130146, 107049334, 107030284, 107129669, 107322776, 107515693, 107727575, 107988977, 108204973, 108344126, 108445704, 108541703, 108656824, 108718514, 108711970, 108724689, 108825564, 108996224, 109032714, 108950365, 108897769, 108877504, 108886862, 108912039, 108918047, 108948267, 109071100, 109209251, 109199870, 109122288, 109107256, 109090054, 109009469, 108972836, 109012771, 109072876, 109161055, 109275508, 109302402, 109298885, 109386921, 109402978, 109300709, 109214342, 109181285, 109196508, 109262955, 109355664, 109394681]
3691.6A09394681k7835l2449P952N5134N2404n305J741O4051Q9324L1054o6531p7486
3716.1A09486735k4855J7976K9839K6834Q165k4247k992P2634P6628m6074j30713o4934
3740.5A09424996Q2243J07396l4404k1398M7373l8504r9158n1260n520k8694l7455
3763A09345615L254K0099L898k7048l8875j9538R18K778q905o032o128k2399j9193
3789.5A09228444O771K9576L5763K4032M6146L5119m3356k8050k1446o2525l2663M6908
3814A09264719Q8370N2953L6419m0794j23179o5267J574K4807L2353J9968L1292M1056
3838.4A09364271o306m6802p6079p3719J1718J48821K17128n114j97578j25801l934
3860.9A09206605O3825L0660j0109K6739J1551m1318n5670m3714J9812K5547k1518
$$ y = [109394681, 109366846, 109334397, 109342349, 109397483, 109449887, 109444582, 109446323, 109510374, 109599698, 109630752, 109564221, 109486735, 109461880, 109479856, 109509695, 109536529, 109544694, 109520447, 109517455, 109590089, 109666717, 109620643, 109489930, 109424996, 109507239, 109614635, 109580231, 109558833, 109606206, 109567702, 109468544, 109417284, 109411764, 109383070, 109345615, 109348869, 109368968, 109372866, 109345818, 109306943, 109287405, 109288323, 109291101, 109282196, 109276164, 109270036, 109247637, 109228444, 109235215, 109264791, 109300554, 109324586, 109370732, 109405851, 109362495, 109334445, 109312999, 109250474, 109217811, 109264719, 109353089, 109406042, 109442461, 109401667, 109278488, 109213221, 109214795, 109239602, 109271955, 109291923, 109323215, 109364271, 109357965, 109311163, 109235084, 109161365, 109173083, 109321904, 109539032, 109533918, 109336340, 109210539, 109206605, 109270430, 109301090, 109290981, 109317720, 109329271, 109287953, 109232283, 109188569, 109208381, 109233928, 109212410]
3883.3A09212410j3053j4949k026J4698l6490m4906L0935Q0490N2142q905q4066j09899
3907.8A09076381n6899m77J9992J7011K932q285j0240j3637l4011k4938K1219N639
3932.3A08994687n2846m8542n352K8514K0671k8205m6849l2294l2019l5691j5510K647
3956.7A08749211p868j9097j4746p356r250k5237k9540j3459j8108k5665K443J7453
3981.2A08598781M649K372k15j5580l2711m3106l9530k5189
3997.5A08449471
$$ y = [109212410, 109199357, 109184408, 109182382, 109197080, 109160590, 109115684, 109146619, 109227109, 109279251, 109270346, 109186280, 109076381, 109019482, 109019005, 109038997, 109056008, 109058940, 109050655, 109040415, 109026778, 108992767, 108967829, 108989048, 108994687, 108941841, 108893299, 108887947, 108916461, 108937132, 108908927, 108862078, 108829784, 108797765, 108762074, 108746564, 108749211, 108741343, 108722246, 108707500, 108700144, 108690894, 108665657, 108636117, 108622658, 108604550, 108578885, 108581328, 108598781, 108603430, 108605802, 108605587, 108590007, 108557296, 108514190, 108474660, 108449471]
##END=$$ End of the data block
