##TITLE=$$ Begin of the data block
##JCAMP-DX=5.00 $$ ACD/SpecManager v 10.08
##SPECTROMETER/DATA SYSTEM=Alpha
##DATE=27 Jun 2014 15:13:00
##DATA TYPE=INFRARED SPECTRUM
##DATA CLASS=XYDATA
##ORIGIN=
##OWNER=
##NPOINTS=1667
##FIRSTX=599.63549805
##LASTX=3997.56909180
##MAXX=3997.56909180
##MINX=599.63549805
##MAXY=1.12173355
##MINY=0.26131156
##XFACTOR=1.0000000000
##YFACTOR=0.000000010000000
##FIRSTY=1.05419374
##DELTAX=2.03957605
##XUNITS=1/CM
##YUNITS=ARBITRARY UNITS
##XYDATA=(X++(Y..Y))
599.6A05419374k9755J22201J89531J54710J00195J05763J45841J60408R4747J0014
620A06473029J9121O1619P3195N5539R084l1829l8850k4104k2829l4487k8920k1565
644.5A06489003j4139R251r966p2777j09994j39654j70386j84417j86479p8666N3942
666.9A05585718j71149l97408l14188k70462k69627k62261k47407k14529k08795k37739
687.3A02992153k34389k21396k29632k34938k76244l86691n48720p90370j117778j390111
707.7I7561884j389855j105732q17418o96802o01566l28010J65182P22229J096654
726.1I4606566J168615J049191R42945R08643Q78007Q15773P29477O65736O22904N29981
746.5A02917838M07541L48723L49486L07190K00284J25992J31893J82903K12657J75536
$$ plain form
599.6 105419374 105389619 105511820 105701351 105856061 105956256 106062019 106207860 106368268 106463015 106473029
620 106473029 106492150 106553769 106626964 106682503 106691587 106659758 106620908 106596804 106573975 106539488 106510568 106489003
644.5 106489003 106474864 106484115 106474149 106401372 106291378 106151724 105981338 105796921 105610442 105531776 105585718
666.9 105585718 105414569 105017161 104702973 104432511 104162884 103900623 103653216 103438687 103229892 102992153
687.3 102992153 102757764 102536368 102306736 102071798 101795554 101408863 100860143 100069773 98951995 97561884
707.7 97561884 96172029 95066297 94248879 93552077 92950511 92622501 92787683 93509912 94606566
726.1 94606566 95775181 96824372 97767317 98675960 99553967 100369740 101099217 101764953 102387857 102917838
746.5 102917838 103325379 103674102 104023588 104330778 104531062 104657054 104788947 104971850 105184507 105360043
766.9A05360043J17540R2125J08493J53470J74761J51562J27113J30808J47963J44374
787.3A06708252J15395R1124P3421M5955J1933l2139p6497j03438j36530j34492p2348
809.7A06490636p4017j37758j39773j00327p6973k9636M7267N8985j9420j11341j72734
832.1A05734909j89031j44827p3421n0080p2312o6853l0553K3138Q9014J11139P9155
854.6A05410278K9933j7929n1701p3790j03963j44863j85025k13480k13098j52803
875A04283559l1435O8939Q9168Q0979J04499J29604R1028p63j20341k98608l89266
897.4A04007363k20525j4889L7551M2581J5784n4932q8370o5160k8145l2485j08838
919.8A03489935k17974k72596k03585j3662K07115K82430J39308m2295p0978J8311
$$ plain form
766.9 105360043 105477583 105569708 105678201 105831671 106006432 106157994 106285107 106415915 106563878 106708252
787.3 106708252 106823647 106914771 106988192 107034147 107046080 107013941 106937444 106834006 106697476 106562984 106490636
809.7 106490636 106416619 106278861 106139088 106038761 105961788 105932152 105979419 106038404 106018984 105907643 105734909
832.1 105734909 105545878 105401051 105327630 105277550 105205238 105138385 105107832 105130970 105219984 105331123 105410278
854.6 105410278 105440211 105422282 105370581 105296791 105192828 105047965 104862940 104649460 104436362 104283559
875 104283559 104252124 104321063 104410231 104491210 104595709 104725313 104816341 104815578 104695237 104396629 104007363
897.4 104007363 103786838 103771949 103809500 103852081 103867865 103812933 103724563 103659403 103631258 103598773 103489935
919.8 103489935 103271961 102999365 102795780 102782118 102989233 103271663 103410971 103368676 103297698 103316009
940.2A03316009P0667M2689j1158o5160j22332j88005k30014j99044j20080m9400J812
962.7A02445984J9371j3470o7842j08528j48726j99735j87421o2835N6469P4184P6342
985.1A01883793J30951J68789J24716L6228k5618m8780p5376j30082j93011k42520
1005.5A01629090k85721k61735q4997P4268K420j82450k58911k05946j37138j00327
1025.9A00188553o2108m041L2878j9884j92928m96042q51464r38189n25946K9302K84528
1048.3I7444659L22336L35294K97600J88095P9775M5877P3135P6121K671r6536j56170
1070.8I8612857k26480l80874n95390q02464r40001r78154r60683r47381r42772r31996
1091.2I0906662q94147p89482n89853l08162j4025K12061L30091L00544J01036j72114
$$ plain form
940.2 103316009 103386676 103429365 103418207 103353047 103230715 103042710 102812696 102613652 102493572 102444172 102445984
962.7 102445984 102465355 102451885 102384043 102275515 102126789 101927054 101739633 101676798 101733267 101807451 101883793
985.1 101883793 102014744 102183533 102308249 102344477 102318859 102270079 102194703 102064621 101871610 101629090
1005.5 101629090 101343369 101081634 100996637 101070905 101073325 100890875 100631964 100426018 100288880 100188553
1025.9 100188553 100126445 100122404 100155282 100135398 99942470 99446428 98594964 97656775 97130829 97160131 97444659
1048.3 97444659 97766995 98102289 98399889 98587984 98667759 98713636 98786771 98862892 98865563 98769027 98612857
1070.8 98612857 98386377 98005503 97410113 96607649 95667648 94689494 93728811 92781430 91838658 90906662
1091.2 90906662 90012515 89223033 88633180 88325018 88310993 88523054 88853145 89153689 89254725 89082611
1111.6H9082611l68637l92241k00665J49400M90832O31595M31907p1150n98222r81558
1132H8173872j381302j832723k076400j971167j656657j339865j131815j044196j040417
1150.3G4699330j074230j081884r99499q14050n64957l10147q8071R3138K35480L71182
1170.7G0466292N76109Q59922J106542J267362J389891J444327J393569J272416J124334
1189.1H0900764R78959Q59946P82871P61712P77388P56639O55341N06633L53855K19274
1209.5H7553382J32632J00994R0790N9629j6469j26267k37471l13955l34609l06904
1229.9H6601752k70194k56043k32405j38414K9028K11429L71844N02032N70094N49633
1250.3H7938756M65679L74257L21669L04276K85411K43914J91962J68509J91986K29240
$$ plain form
1111.6 89082611 88713974 88321733 88121068 88270468 88761300 89392895 89824802 89753652 89155430 88173872
1132 88173872 86792570 84959847 82883447 80912280 79255623 77915758 76783943 75739747 74699330
1150.3 74699330 73625100 72543216 71543717 70729667 70164710 69854563 69766492 69859630 70095110 70466292
1170.7 70466292 71042401 71902323 73008865 74276227 75666118 77110445 78504014 79776430 80900764
1189.1 80900764 81879723 82739669 83522540 84284252 85061640 85818279 86473620 86980253 87334108 87553382
1209.5 87553382 87686014 87787008 87877798 87937427 87920958 87794691 87557220 87243265 86908656 86601752
1229.9 86601752 86331558 86075515 85843110 85704696 85733724 85945153 86316997 86819029 87389123 87938756
1250.3 87938756 88404435 88778692 89100361 89404637 89690048 89933962 90125924 90294433 90486419 90715659
1270.6I0715659K30926J94043J47688J28395J83946L22073M58873M87870M02283K82014
1291I3553770J96898J50597J08170O4004P0893J55610K46525K65944K36827K22564
1311.4I5271802K07007J46365P8005Q0657J46442K04856K30443K16532J52677M0901
1331.8I6775687j01507k35534l19487l08132k04146j35529j48648j77568j87105j76126
1352.2I4781905j59096j28657p6306l0798j7172k1135m8364q0794j41078m03756q11690
1374.7I2863059p83038o3467Q15147J241428J204294J069659Q82619N88864L18832
1393I8137397J63728J99544L88789N67889O10257N16784K14267k64967p67296j044178
1413.4I8722214r31496n18536Q3911M53281L58987J1027m56828r09340j095331j044351
$$ plain form
1270.6 90715659 90946585 91140628 91288316 91416711 91600657 91922730 92381603 92869473 93271756 93553770
1291 93553770 93750668 93901265 94009435 94073439 94144332 94299942 94546467 94812411 95049238 95271802
1311.4 95271802 95478809 95625174 95703179 95783836 95930278 96135134 96365577 96582109 96734786 96775687
1331.8 96775687 96674180 96438646 96119159 95811027 95606881 95471352 95322704 95145136 94958031 94781905
1352.2 94781905 94622809 94494152 94417846 94387048 94369876 94348741 94300377 94219583 94078505 93674749 92863059
1374.7 92863059 92080021 92016554 92831701 94073129 95277423 96347082 97229701 97818565 98137397
1393 98137397 98301125 98500669 98889458 99457347 100067604 100584388 100798655 100533688 99766392 98722214
1413.4 98722214 97790718 97272182 97356093 97809374 98168361 98179388 97722560 96813220 95717889 94673538
1433.8I4673538j123434j076532p68017p05207p74347q28350r73278j178241j438862
1452.2H5807270j647973j729149j175159l96884m38636p38371J51986K435494M730052
1470.5H6998630O075185M698569K477204J480747J115942R10270O72781M64118L72899
1488.9A05266345L63206K66517P0393j19925j18339J19221K79224K53380K52902K99215
1509.3A06932139K21885J09899K4485J5772L4654M4894Q8179R1660Q4818P0643J2243
1531.7A07731271q130J8906n3084j65176q8155K4163M2844J4758q642L266J0443j7071
1556.2A07505393k5678J56355K03240R2650L2913K5380P1871J00351L5596J1515P7224
1578.6A08286810P7009L4678K0540J4901L731l350o699j7083l4559n2619p3707o8080
$$ plain form
1433.8 94673538 93550104 92473572 91705555 91000348 90226001 89397651 88424373 87246132 85807270
1452.2 85807270 84159297 82430148 81254989 80858105 80419469 79681098 79833084 82268578 86998630
1470.5 86998630 93073815 97772384 100249588 101730335 102846277 103756547 104429328 104893446 105266345
1488.9 105266345 105629551 105896068 105966461 105846536 105728197 105847418 106126642 106380022 106632924 106932139
1509.3 106932139 107154024 107263923 107288408 107304180 107338834 107383728 107471907 107563567 107648385 107719028 107731271
1531.7 107731271 107723141 107742047 107688963 107523787 107435632 107459795 107502639 107517397 107508755 107512021 107522464 107505393
1556.2 107505393 107479715 107636070 107839310 107931960 107964873 107990253 108062124 108162475 108198071 108209586 108286810
1578.6 108286810 108363819 108398497 108419037 108433938 108437669 108434319 108427620 108410537 108375978 108323359 108249652 108181572
1603.1A08181572l4475P808M3285N7065K1899n4765p4398r036l2103j01734q3148m2892
1627.6A07879078N842K3913o6888j92535j39499r3198j71053k62201l51357k29156
1648A06402946m8388j96921l27003l2711K4414q4317j70493j56129j21760j69933n5003
1670.4A05064702K02668L40378L51179K48634R3759r2018k18773j20521j12998k20954
1690.8A05536056k84815m94027o50418p01583q43703o96958p07745q54337p59548o74314
1711.2I8868608p24315r83948j599854j881605j862949k335716k963417l444559m007608
1729.5G9064637m643458o440222p017052n416185n219888m616666k773539q83069J206842
1747.9D3261400L831857O248585P179624P919317Q197218P127029O071120M524768
$$ plain form
1603.1 108181572 108147097 108154905 108198190 108255255 108277154 108222389 108147991 108138955 108106852 108005118 107921970 107879078
1627.6 107879078 107884920 107908833 107841945 107649410 107509911 107416713 107245660 106983459 106632102 106402946
1648 106402946 106354558 106157637 105830634 105797923 105822337 105738020 105567527 105411398 105289638 105119705 105064702
1670.4 105064702 105267370 105607748 105958927 106207561 106301320 106209302 105990529 105870008 105757010 105536056
1690.8 105536056 105251241 104757214 104106796 103405213 102561510 101864552 101156807 100302470 99542922 98868608
1711.2 98868608 98144293 97160345 95560491 93678886 91815937 89480221 86516804 83072245 79064637
1729.5 79064637 74421179 67980957 60963905 55547720 50327832 45711166 42937627 42054558 43261400
1747.9 43261400 47093257 53341842 60521466 68440783 76638001 83765030 89836150 94360918
1764.2I4360918L026807K224988J636875J267266R99129P40313N72992M81748M03106
1782.6A05714142L49737K99859K54619J81496J65045J98960J90092J50406J30486J53494
1803A07788336J54352J33300R6798R6190J16348J16277R0969Q7476Q4102N1164M5979
1825.4A08861291N5373N1844P6080J10769Q0693M8828M8983L1543j2398J8632Q5259
1847.8A09456897P4088M1926K1720K0695K1267K6870K6238J3995j2064k9242J8561
1870.3A09680951O0653M0543R072O354J1814J8489K1339J6129l875K361K9301K1601
1894.8A09914732J6904K4688K0528M375k98k694o593M828J5510J66k1886j1993n48
1921.3A09957719P87J3911J8394L660l457J574O353L922p283j8692p022J6797J6737
$$ plain form
1764.2 94360918 97387725 99612713 101249588 102516854 103515983 104256296 104829288 105311036 105714142
1782.6 105714142 106063879 106363738 106618357 106799853 106964898 107163858 107353950 107504356 107634842 107788336
1803 107788336 107942688 108075988 108172786 108268976 108385324 108501601 108592570 108680046 108764148 108815312 108861291
1825.4 108861291 108916664 108968508 109044588 109155357 109236050 109284878 109333861 109365404 109353006 109371638 109456897
1847.8 109456897 109530985 109572911 109594631 109615326 109636593 109663463 109689701 109703696 109691632 109662390 109680951
1870.3 109680951 109741604 109782147 109791219 109797573 109809387 109827876 109849215 109865344 109861469 109863830 109893131 109914732
1894.8 109914732 109931636 109956324 109976852 109981227 109980929 109978235 109971642 109976470 109991980 109992146 109970260 109958267 109957719
1921.3 109957719 109958506 109972417 109990811 109994471 109991014 109992588 109998941 110002863 109995580 109976888 109969866 109986663 110003400
1947.8A10003400Q619M506L648L111K611K336j049p439j4722l374J1039J729q834l087
1976.3A10002494K622L22q559j3327p535m971j2302j4460n627q487j8192j8167j3650
2002.8A09880161r024n460n471j0562j8287k4033k4521j8370j3507j6844j4603m268
2027.3A09715211m255j3566j2792m708k730j323q11M05R060Q249j132j347K313J454
2055.9A09694028m006n424L34R78j943K730J323p940m971K218R06K324R811J1778R501
2086.5A09711647N865j07J836O079j752l600P880Q177l802p713k981k396l373J430
2115A09717190P355K873l993m315m328m065n233o068k026m423j6701j8573j1492m423
2143.6A09641778l504j0050n519R06p057j7631j4901o044r78L231Q833J3614J2231
$$ plain form
1947.8 110003400 110012019 110016525 110020173 110023284 110025895 110028231 110027182 110019743 110005021 110001647 110012686 110014415 110005581 110002494
1976.3 110002494 110005116 110005438 109996879 109983552 109976017 109971046 109958744 109944284 109938657 109930170 109911978 109893811 109880161
2002.8 109880161 109871137 109865677 109860206 109849644 109831357 109807324 109782803 109764433 109750926 109734082 109719479 109715211
2027.3 109715211 109710956 109697390 109684598 109679890 109677160 109675837 109675026 109675431 109684491 109692740 109691608 109690261 109692574 109694028
2055.9 109694028 109690022 109684598 109684932 109685910 109683967 109686697 109688020 109680080 109675109 109677327 109678233 109680557 109690368 109702146 109711647
2086.5 109711647 109717512 109717405 109719241 109725320 109723568 109719968 109727848 109736025 109732223 109724510 109721529 109719133 109715760 109717190
2115 109717190 109724545 109727418 109723425 109719110 109714782 109710717 109705484 109699416 109697390 109692967 109676266 109657693 109646201 109641778
2143.6 109641778 109638274 109628224 109622705 109623611 109616554 109598923 109584022 109577978 109577000 109580231 109589064 109602678 109614909
2170.1A09614909O425j79n495n544L958J2219J0109K885J347Q810J1682L660p749r882
2198.6A09647155J335O604k313m05R179Q166N794K849j490N00N806Q035N030j895l910
2229.2A09690440m185r322j0419j835M398j728m137M554Q535n12j1635r060M387R096
2257.8A09668577L612K444O663R489L970m8L314N448K897m888p510l886O32J4341K9838
2288.4A09734893K8074K0337K4044K5976J7452K1064M4847N6410N9259P8380Q5378
2310.8A10196114O8485O7473R9659J32966J37353J13940Q9669J00362J23311R7894
2331.2A11227226L9542J4877L8278P4602N7220o5207k37537k33304r358K46668L74078
2353.6A11527085L27778K19345R9147l3176j52588k29562k50589k51496k62439k56896
$$ plain form
2170.1 109614909 109621334 109621155 109615660 109610116 109614074 109626293 109636402 109639287 109640634 109649444 109661126 109664786 109657037 109647155
2198.6 109647155 109648490 109655094 109652781 109652376 109661555 109669721 109675515 109678364 109676874 109677374 109683180 109691215 109696245 109694350 109690440
2229.2 109690440 109686255 109676933 109666514 109664679 109669077 109667349 109663212 109667766 109676301 109675789 109664154 109655094 109659481 109668577
2257.8 109668577 109672189 109674633 109681296 109690785 109694755 109694707 109698021 109703469 109706366 109701478 109693968 109690082 109690714 109705055 109734893
2288.4 109734893 109762967 109783304 109807348 109833324 109850776 109871840 109916687 109973097 110032356 110110736 110196114
2310.8 110196114 110264599 110332072 110431731 110564697 110702050 110815990 110905659 111006021 111129332 111227226
2331.2 111227226 111266768 111281645 111319923 111394525 111451745 111386538 111149001 110915697 110906339 111153007 111527085
2353.6 111527085 111854863 112074208 112173355 112140179 111987591 111758029 111507440 111255944 110993505 110736609
2374A10736609k35057k11406j71125j24836r0003n4622j8763k992k623j597j085j574
2398.5A09820926m780o914l493J943J1146J8227J4460L863p034q261J478O855R382
2425A09857798J2314N615m864p713n948l529K98M852R036J1682Q715O318P438L243
2453.6A09905255m769q022k122L052M148L004l695p070l027r6n686o139j228p177j0252
2484.2A09856176o997j2779j6487q321l135o235k384M959l898j7953j7762p451k074
2510.7A09755659r072k2125k8908k2364r799m53l278j2076j1575p868k527P450R632
2537.2A09642696K945o378r775O68P03j1814j3506r620k838j78q726j4437j7941j6737
2565.8A09535062l934n471k7216l5774k5702j7560j4674j7798k0564j3053j1826k1708
$$ plain form
2374 110736609 110501552 110290146 110119021 109994185 109904182 109849560 109830797 109827805 109825182 109823585 109822500 109820926
2398.5 109820926 109816146 109809232 109805739 109807682 109818828 109837055 109851515 109855378 109848344 109840083 109841561 109848416 109857798
2425 109857798 109870112 109875727 109870863 109863150 109857202 109853673 109853971 109858823 109867859 109879541 109888256 109894574 109902012 109905255
2453.6 109905255 109900486 109892464 109890342 109893394 109897542 109900546 109896851 109889781 109886754 109886658 109880972 109874833 109873605 109866428 109856176
2484.2 109856176 109849179 109836400 109819913 109811592 109808457 109802222 109799838 109804797 109800899 109782946 109765184 109757733 109755659
2510.7 109755659 109746587 109724462 109695554 109673190 109663391 109662938 109659660 109647584 109636009 109628141 109625614 109633064 109642696
2537.2 109642696 109645641 109639263 109629488 109630156 109630859 109619045 109605539 109595919 109593081 109592903 109584177 109569740 109551799 109535062
2565.8 109535062 109531128 109525657 109498441 109462667 109436965 109419405 109404731 109386933 109366369 109353316 109341490 109319782
2590.2A09319782k7048k3568j3590p570j0895j5998j9992k4461k5809k3282k3579k5714
2614.7A09078276k4366k3592l1650m2450l8290k6250k1911k0075j1408n031j6880k5499
2639.2A08790874j4758q881j4353j8239k2602k9194l2496l6157m9424o7973p3278o3753
2663.7A08359766n1081l7623l0100k3591p260K229k790K289K3234L4583K7334K3652
2688.1A08320642M0149N5897N1308M1008L9566L7408K2232Q345K050q464j6272k1863
2712.6A08572006k9087k0969r060k6619n7495o2477l3427P04J4031J8143K0898L2615
2737.1A08419263N0390M1199J2147j1790j7905j561J4007J3601L648j4436k7919k8527
2761.6A08452117l6215m8137n0736n9056r0432j19019j06763r4355j19030j43445j55139
$$ plain form
2590.2 109319782 109292734 109269166 109255576 109248006 109237111 109221113 109201121 109176660 109150851 109127569 109103990 109078276
2614.7 109078276 109053910 109030318 108998668 108956218 108917928 108891678 108869767 108849692 108838284 108833253 108816373 108790874
2639.2 108790874 108776116 108767235 108752882 108734643 108712041 108682847 108650351 108614194 108564770 108496797 108423519 108359766
2663.7 108359766 108308685 108271062 108240962 108217371 108210111 108212340 108209550 108211839 108235073 108269656 108296990 108320642
2688.1 108320642 108360791 108416688 108467996 108509004 108548570 108585978 108608210 108616555 108618605 108610141 108593869 108572006
2712.6 108572006 108542919 108521950 108512890 108486271 108428776 108366299 108332872 108333576 108347607 108365750 108386648 108419263
2737.1 108419263 108469653 108510852 108522999 108511209 108493304 108491743 108505750 108519351 108522999 108508563 108480644 108452117
2761.6 108452117 108415902 108367765 108317029 108257973 108167541 108048522 107941759 107847404 107728374 107584929 107429790
2784A07429790j80089k05636k03085j89257j96147k25019k39050k25366k30622k69246
2804.4A05266273l11291l47948l73256m03309m66192n40900o16730p11190q14820r21720
2824.8I9758917j060367j244455j464260j751959k192932k876264l864289n151146
2841.1H0153245o511367p490986p685912o907040n119183k491469M41948K983224M641337
2859.5E2013797N276835M999637M024947K741915J764995J566165J938725K154040
2875.8G6481056J768321R40657M0859p18171j295477j709711j986236k145088k213060
2894.1F9163150k241183k291149k386534k515519k683353k915138l221226l567284
2910.4D7341764l887919m094117m059870l666916k900428j860943p40415K96849J182374
$$ plain form
2784 107429790 107249701 107044065 106840980 106651723 106455576 106230557 105991507 105766141 105535519 105266273
2804.4 105266273 104954982 104607034 104233778 103830469 103364277 102823377 102206647 101495457 100680637 99758917
2824.8 99758917 98698550 97454095 95989835 94237876 92044944 89168680 85304391 80153245
2841.1 80153245 73641878 66150892 58464980 51557940 46438757 43947288 44389236 47372460 52013797
2859.5 52013797 57290632 62290269 66315216 69057131 70822126 72388291 74327016 76481056
2875.8 76481056 78249377 79190034 79230893 78512722 77217245 75507534 73521298 71376210 69163150
2894.1 69163150 66921967 64630818 62244284 59728765 57045412 54130274 50909048 47341764
2910.4 47341764 43453845 39359728 35299858 31632942 28732514 26871571 26131156 26428005 27610379
2928.8B7610379J906789K581131L260190L821486M139951M172501L880989L238088
2945.1E4611504K318627J333475N93066L28600N74559J188565J933825K648735L251284
2963.5F8782240L664047L819209L697854L366071K931327K488083K092588J758348
2979.8I2599767J481778J252395J052248Q55780O28436L67617P5048k96163p33185
2998.1I7283721j149058j453734j515418j218778n70834K88648J143288J794017K133786
3016.5I6735638K162695J954061J615238J265729R69052P20942N33342M07207L25835
3034.9A06689739K71249K03383J34647J14882J37639J46270J24144J16039J30307J32489
3055.3A08200788J12296Q7106O5207L9065L1793P7093J31452J43588J18518O9141M0114
$$ plain form
2928.8 27610379 29517168 32098299 35358489 39179975 43319926 47492427 51373416 54611504
2945.1 54611504 56930131 58263606 58856672 59185272 59759831 60948396 62882221 65530956 68782240
2963.5 68782240 72446287 76265496 79963350 83329421 86260748 88748831 90841419 92599767
2979.8 92599767 94081545 95333940 96386188 97241968 97870404 98238021 98313069 98016906 97283721
2998.1 97283721 96134663 94680929 93165511 91946733 91375899 91664547 92807835 94601852 96735638
3016.5 96735638 98898333 100852394 102467632 103733361 104702413 105423355 105956697 106363904 106689739
3034.9 106689739 106960988 107164371 107299018 107413900 107551539 107697809 107821953 107937992 108068299 108200788
3055.3 108200788 108313084 108400190 108465397 108504462 108536255 108613348 108744800 108888388 109006906 109076047 109116161
3077.7A09116161O5732R3615Q5211P8821P1466N3096O2239P0441M2545M876o103J3673
3102.2A09751773J2255k2102k3377K4796M2438R072O664M4012P1812Q4948P4923M1604
3126.6A10118818J6487J7202K8586J4806k3150l1198M673L1245K7275J7941k62j7726
3151.1A10204697J0931N4658N6266L6443J9061P999J1671K2173K4259J0597J181J0192
3175.6A10470128K480j5092l696J3483J3530P081J4818L0267K7132J6022N722k051
3200.1A10579824N842J0943M804L529Q857J8907J9335L553j0705j848J9324K3401J5223
3226.6A10700989k396l4953m5120O020N7041L9793k695k0110j9646o652J7667K0170
3251.1A10710108j1217l1674o664K0838J6165J0037K599l2652o7877l9542J5402L1042
$$ plain form
3077.7 109116161 109181893 109275508 109360719 109439540 109511006 109564102 109626341 109696782 109739327 109744203 109738100 109751773
3102.2 109751773 109764028 109741926 109718549 109743345 109785783 109794855 109801519 109845531 109917343 110002291 110077214 110118818
3126.6 110118818 110135305 110152507 110181093 110195899 110172749 110141551 110146224 110177469 110204744 110222685 110222423 110204697
3151.1 110204697 110215628 110270286 110326552 110362995 110382056 110390055 110401726 110423899 110448158 110458755 110459936 110470128
3175.6 110470128 110472608 110457516 110453820 110467303 110480833 110487914 110502732 110532999 110560131 110576153 110581875 110579824
3200.1 110579824 110585666 110596609 110601413 110604942 110613799 110632706 110652041 110655594 110644889 110643041 110662365 110685766 110700989
3226.6 110700989 110698593 110663640 110618520 110624540 110681581 110721374 110718679 110698569 110678923 110672271 110689938 110710108
3251.1 110710108 110698891 110667217 110660553 110681391 110697556 110707593 110710192 110677540 110609663 110570121 110585523 110616565
3275.5A10616565K8217J1968p927n079k348k3651n2083n3787k5618N806L3211L6395
3300A10561669k0886p9953n4193J7464N8866N3835J9812J920J3864J3327k2900n0616
3324.5A10512209j9646K3914K6571R621l0458q0336n6397O294J6916J4817L839m0186
3348.9A10387158l0911L3868M0269j9121n4741l4178k6798o4993o4218J252O1059O2454
3373.4A10291100K0921l231r77l088j4508k2363l9757p9703o7258J3662K9194m7874
3397.9A10076118q3435m351Q2099N4050k2686m4596k0075K2412M1711k039l9422k1780
3422.4A10038006p760l6907p6533o2704m7779p6938m0578N0342O3324R167m1902o0809
3446.8A09708929l3486j0454k0874l9256q3995j26004p4267l2497j33526j91152k2948
$$ plain form
3275.5 110616565 110644782 110656750 110648823 110643744 110641396 110617745 110565662 110511875 110486257 110492063 110525274 110561669
3300 110561669 110540783 110460830 110406637 110424101 110482967 110536802 110556614 110558534 110572398 110585725 110562825 110512209
3324.5 110512209 110492563 110516477 110543048 110552669 110522211 110441875 110385478 110391772 110408688 110423505 110427344 110387158
3348.9 110387158 110356247 110390115 110430384 110411263 110356522 110322344 110295546 110230553 110166335 110167587 110228646 110291100
3373.4 110291100 110312021 110308790 110307813 110304725 110290217 110267854 110228097 110148394 110081136 110094798 110123992 110076118
3397.9 110076118 109992683 109988332 110070431 110124481 110101795 110057199 110037124 110059536 110101247 110099208 110059786 110038006
3422.4 110038006 110030246 109993339 109916806 109854102 109806323 109729385 109688807 109739149 109802473 109811640 109769738 109708929
3446.8 109708929 109675443 109664989 109644115 109604859 109520864 109394860 109320593 109288096 109154570 108963418 108940470
3469.3A08940470J86539J92583N9807o2597o6984Q6964J48391L2461J0574P8094L5572
3491.7A09641874o7997r5344m0209k3115n5861K1672J06025L0160q0145j28197r8110
3514.2A09210753k7549j2672o2823j22404r5022N055L7431J1075q929l2866j9395L6490
3538.6A08919144L2270k2543j8012O4253J16587R2328Q2433R9993R0360N0652K6822
3561.1A09534287M3333M4072M4012R8955J34039J07992P5293O3789M0483j729k8300
3583.5A10156226j7488K7156M3893j1265o2025m7278J0550P2515J08969R9039P8952
3605.9A10459244P3588N4717L2473M6301O2358L4380K5201O9594P2217M864m3464J0610
3630.4A10902083N0187L2723J3220j2j979P2j5676n9760r3460o997R8312P7164J0049
$$ plain form
3469.3 108940470 109127009 109319592 109379399 109316802 109249818 109336782 109485173 109517634 109528208 109606302 109641874
3491.7 109641874 109573877 109478533 109438324 109415209 109359348 109381020 109487045 109517205 109437060 109308863 109210753
3514.2 109210753 109183204 109170532 109107709 108985305 108890283 108895338 108932769 108943844 108934915 108902049 108882654 108919144
3538.6 108919144 108951414 108928871 108910859 108975112 109091699 109184027 109266460 109366453 109456813 109507465 109534287
3561.1 109534287 109577620 109621692 109665704 109764659 109898698 110006690 110081983 110145772 110186255 110184526 110156226
3583.5 110156226 110138738 110165894 110209787 110198522 110136497 110089219 110099769 110172284 110281253 110380292 110459244
3605.9 110459244 110532832 110587549 110620022 110666323 110728681 110763061 110788262 110857856 110930073 110934937 110891473 110902083
3630.4 110902083 110952270 110984993 110998213 110998201 110996222 110996294 110980618 110920858 110827398 110820401 110918713 110995877 111005926
3656.9A11005926J371M2856O4814K6154l7872o7652k2661J0168K134M4191P0500M8721
3681.4A11188650K2710k2126p8642k8646R6965J02734M7994J5986j347N901K0003r000
3705.9A11361182m9377o5136l6990L1709N8973L4344n352k0361Q905L3474K3401j8406
3730.3A11356366q2851r9373l4356K3139L2937M077m0006k7514r382j9371J5783N3668
3754.8A11173117L9363K766l052J1587O926K527j907m17K0623J1826l3844l6657K3043
3781.3A11215901L7492J0907j800j4722r54J9348l421l4082n7817n1856P832K6798
3805.8A11153626J9348K9838Q536l3546l9124k3354l8087k1469K9230M2426L7694J2827
3830.3A11177945k5260m7231m1962n448J9265K2292K7227K3556N078l4344p4375m3130
$$ plain form
3656.9 111005926 111007297 111050153 111114967 111141121 111103249 111035597 111012936 111023104 111025238 111069429 111139929 111188650
3681.4 111188650 111211360 111189234 111110592 111081946 111178911 111281645 111329639 111345625 111344278 111350179 111370182 111361182
3705.9 111361182 111311805 111246669 111209679 111241388 111300361 111334705 111329353 111308992 111317897 111351371 111374772 111356366
3730.3 111356366 111273515 111174142 111139786 111162925 111195862 111199939 111159933 111132419 111123037 111103666 111119449 111173117
3754.8 111173117 111212480 111215246 111212194 111223781 111230707 111233234 111231327 111230910 111251533 111263359 111229515 111192858 111215901
3781.3 111215901 111253393 111264300 111262500 111247778 111246824 111266172 111262751 111228669 111170852 111118996 111126828 111153626
3805.8 111153626 111172974 111202812 111211348 111177802 111138678 111115324 111077237 111055768 111084998 111127424 111165118 111177945
3830.3 111177945 111152685 111105454 111063492 111058044 111077309 111099601 111126828 111150384 111155462 111121118 111046743 111003613
3854.8A11003613K1291L7575J4639j2958o104J514j4245q893J5604K8718J9157j1981
3879.2A11087930j8012j3936j6606J7679J4102k2971o390P034j1075k5570m3905l3319
3903.7A10934961L1185O3288K9457m077j0955j4604k896O473j5700j9229L386l648
3928.2A10997641k0039r477M184P284k253j9205j5247P963R346m100N781J4496k289
3954.7A10974085j0252k992j3530k7931k2006j1051r298k4164k3937J0503K2327L565
3979.2A10865319J299O676n770j5521q488m005j2851k2757j4090
3997.5A10789812
$$ plain form
3854.8 111003613 111024904 111062479 111077118 111064160 111058056 111059570 111045325 111036432 111052036 111080754 111099911 111087930
3879.2 111087930 111069918 111055982 111039376 111057055 111071157 111048186 111041796 111048830 111037755 111012185 110968280 110934961
3903.7 110934961 110966146 111029434 111058891 111054814 111043859 111029255 111026359 111032832 111017132 110997903 111001289 110997641
3928.2 110997641 110977602 110968125 110972309 110979593 110977340 110958135 110942888 110950851 110960197 110956097 110961878 110976374 110974085
3954.7 110974085 110963833 110960841 110947311 110919380 110897374 110886323 110877025 110852861 110828924 110839427 110861754 110865319
3979.2 110865319 110866618 110873294 110867524 110852003 110843515 110839510 110826659 110803902 110789812
3997.5 110789812
##END=$$ End of the data block
