##TITLE=$$ Begin of the data block
##JCAMP-DX=5.00 $$ ACD/SpecManager v 10.08
##SPECTROMETER/DATA SYSTEM=Alpha
##DATE=27 Jun 2014 15:13:00
##DATA TYPE=INFRARED SPECTRUM
##DATA CLASS=XYDATA
##ORIGIN=
##OWNER=
##NPOINTS=1667
##FIRSTX=599.63549805
##LASTX=3997.56909180
##MAXX=3997.56909180
##MINX=599.63549805
##MAXY=1.11923695
##MINY=0.26704162
##XFACTOR=1.0000000000
##YFACTOR=0.000000010000000
##FIRSTY=1.05410159
##DELTAX=2.03957605
##XUNITS=1/CM
##YUNITS=ARBITRARY UNITS
##XYDATA=(X++(Y..Y))
599.6 105410159 105364394 105455124 105602169 105742002 105878258 106007552 106126547 106258380 106373203 106422305
620 106422305 106436026 106470335 106532061 106591487 106610799 106584275 106535959 106488001 106449759 106408799 106378663 106362522
644.5 106362522 106331670 106295991 106259596 106197071 106098223 105976200 105841815 105664361 105441654 105315447 105324066
666.9 105324066 105163920 104816759 104517031 104248929 103996551 103752410 103505242 103276157 103062510 102830482
687.3 102830482 102592552 102358186 102107930 101842165 101548421 101168299 100635123 99871653 98791271 97430050
707.7 97430050 96051991 94950432 94135523 93439394 92842150 92524159 92697287 93410188 94473100
726.1 94473100 95607668 96641594 97574800 98476219 99345398 100151658 100892961 101564109 102159452 102670729
746.5 102670729 103084195 103438807 103775787 104062867 104272258 104409885 104511285 104660094 104870594 105052388
766.9 105052388 105166423 105264449 105387032 105530810 105680931 105822492 105952251 106086731 106241977 106398070
787.3 106398070 106518626 106606662 106673360 106708884 106715190 106693494 106631994 106533813 106409895 106290996 106206477
809.7 106206477 106121206 106009769 105909932 105833757 105761349 105729127 105771971 105828393 105818939 105710912 105521405
832.1 105521405 105326664 105196643 105130267 105079770 105014265 104953921 104931927 104969239 105062544 105172253 105255401
854.6 105255401 105285203 105270529 105233634 105169511 105062485 104908943 104722929 104521418 104323721 104185379
875 104185379 104165399 104232168 104307365 104383564 104493165 104624009 104722881 104742110 104634964 104330266 103925347
897.4 103925347 103701937 103704393 103762376 103804672 103804505 103750825 103681684 103628051 103595519 103555250 103455210 103256154
921.9 103256154 102991796 102792215 102779889 102971399 103238153 103385115 103360903 103301322 103326046 103401864 103447354
944.3 103447354 103438354 103372502 103233075 103024566 102800250 102618837 102504480 102454925 102457964 102471972 102446592
966.8 102446592 102377975 102274561 102117968 101908207 101723421 101666713 101720047 101786256 101858354 101982832 102141750
989.2 102141750 102261889 102294469 102261317 102209926 102142012 102015615 101812410 101560080 101275599 101013386
1009.6 101013386 100921381 100998783 101011777 100831378 100571430 100365961 100225401 100116134 100036252 100014424
1030 100014424 100047743 100041270 99856722 99356931 98497486 97562861 97054619 97097433 97377604 97691447 98029131
1052.4 98029131 98330283 98515683 98593611 98634005 98693001 98753369 98749280 98665571 98526675 98296708 97902465
1074.9 97902465 97306556 96511632 95574749 94599819 93650633 92720306 91792840 90870982 89985847 89207989
1095.2 89207989 88628876 88323462 88303643 88510042 88835496 89132816 89235187 89062566 88695687 88315588
1115.6 88315588 88125491 88271976 88753998 89379340 89808238 89742488 89157969 88187653 86818367 85014844
1136 85014844 82982856 81046450 79399675 78057897 76932603 75906277 74883366 73820376 72745359
1154.4 72745359 71753973 70955139 70405644 70100063 70005453 70090699 70319289 70680118 71247303 72101825
1174.8 72101825 73199713 74450833 75822353 77253568 78634799 79891723 81001884 81970870 82824135
1193.1 82824135 83600658 84355038 85123283 85869724 86520475 87026924 87378567 87597483 87736517 87844157
1213.5 87844157 87938046 88008034 88005149 87880439 87638789 87324226 86997461 86708272 86453748 86202651
1233.9 86202651 85965955 85821867 85848212 86056781 86428392 86934173 87503129 88044232 88508850 88893288
1254.3 88893288 89215457 89508682 89792132 90046495 90249097 90418279 90602970 90826571 91056830 91258228
1274.7 91258228 91418672 91550481 91726458 92046070 92512369 93005317 93409586 93697679 93903309 94060558
1295.1 94060558 94172460 94236726 94306481 94466430 94719458 94985360 95217872 95439553 95650631 95800108
1315.5 95800108 95880926 95970625 96130735 96343637 96572304 96786129 96936172 96973163 96876693 96653879
1335.9 96653879 96345484 96044022 95841604 95706481 95559561 95384741 95205218 95041996 94892883 94766140
1356.3 94766140 94682664 94641012 94626629 94618344 94571841 94486314 94346565 93944091 93125355 92339617 92285341
1378.7 92285341 93109947 94352072 95551604 96621132 97506672 98091573 98398435 98548585 98743784
1397.1 98743784 99140608 99720681 100335968 100851882 101062751 100788116 100014591 98977393 98051155 97529203
1417.5 97529203 97618443 98076349 98424542 98428142 97974384 97065973 95969778 94928521 93810159 92740059
1437.9 92740059 91978371 91276854 90503371 89672631 88697982 87526858 86103368 84470105 82744837
1456.2 82744837 81571972 81185961 80754548 80017364 80165333 82584673 87283194 93321192 97995371
1474.6 97995371 100467765 101959240 103079832 103978086 104636300 105086148 105439782 105787754 106054962
1493 106054962 106130672 106006861 105884683 106007338 106288540 106528008 106752396 107046866 107281435 107404208
1513.4 107404208 107435036 107448089 107469475 107489920 107563877 107657993 107751667 107834637 107850862 107833636 107848763
1535.8 107848763 107797515 107621515 107521725 107553923 107613599 107637954 107625997 107625723 107641017 107627583 107577908 107710385
1560.3 107710385 107932353 108041942 108077681 108101571 108176088 108285499 108318293 108320117 108410037 108506167 108546329
1582.7 108546329 108562255 108573663 108581662 108586276 108581448 108561587 108527124 108479142 108408332 108337748 108304060 108320117
1607.2 108320117 108371508 108433282 108457792 108401406 108326602 108324516 108295810 108191216 108110237 108077133 108097494
1629.6 108097494 108131874 108057165 107853603 107733369 107660210 107493269 107230031 106869650 106633234 106593168
1650 106593168 106402230 106071877 106046712 106083357 106005716 105836141 105681503 105568659 105408144 105352843 105553353
1672.4 105553353 105892253 106238127 106479383 106564844 106461108 106237185 106129241 106027305 105811739 105527592
1692.8 105527592 105024171 104361439 103651369 102805567 102113068 101402724 100541222 99782228 99114484 98391926
1713.2 98391926 97396857 95779252 93895751 92046887 89722657 86763728 83327210 79335678 74716508
1731.6 74716508 68321776 61363262 55991268 50804889 46214443 43464577 42600027 43803811 47606528
1749.9 47606528 53816521 60955334 68827420 76985717 84084529 90126169 94634223 97656101
1766.3 97656101 99871248 101496947 102766085 103776789 104523909 105093575 105563116 105954123 106298602
1784.6 106298602 106597483 106847346 107018197 107175231 107374370 107566833 107716930 107842255 107984364 108126616
1805 108126616 108251464 108340812 108430493 108539832 108648694 108738136 108824992 108903956 108945405 108973074 109011149
1827.4 109011149 109059191 109135103 109234583 109301734 109343588 109383225 109401000 109381795 109403074 109486568 109552038
1849.9 109552038 109585083 109599793 109612334 109624159 109644473 109665930 109671760 109647775 109611702 109627938 109680033 109708536
1874.4 109708536 109710741 109714413 109719372 109728968 109745264 109757400 109748459 109746313 109772432 109793401 109805191 109813702 109820688
1900.9 109820688 109823811 109821975 109810829 109798169 109801674 109812737 109802020 109770203 109759450 109765720 109765804 109770107 109781599
1927.4 109781599 109791386 109795904 109791434 109789574 109792721 109779561 109748769 109737766 109762013 109785521 109792423 109792006 109796298
1953.9 109796298 109803796 109805357 109802210 109797800 109791386 109779918 109775674 109782636 109782279 109774077 109775734 109782743 109781373 109771311
1982.5 109771311 109756029 109739375 109730113 109726453 109722626 109724057 109721208 109708500 109698939 109697175 109694290 109683204 109666336
2009 109666336 109649360 109635925 109622371 109604716 109587848 109573090 109558153 109549189 109548235 109547627 109541726 109536874 109541476
2035.5 109541476 109551346 109557927 109557807 109558046 109564626 109573221 109581602 109584928 109583747 109588635 109594965 109598386 109602916 109603119 109601235
2066.1 109601235 109609139 109620059 109623992 109627533 109634101 109639382 109643447 109652042 109665954 109681702 109694159 109701407 109708941
2092.6 109708941 109714746 109712541 109711707 109722674 109733808 109732628 109726906 109725511 109726560 109729719 109739637 109755266 109760725 109753525
2121.1 109753525 109750295 109751582 109748530 109745681 109752131 109761512 109759080 109742248 109724975 109718335 109719396 109715283 109703696
2147.7 109703696 109696400 109691203 109682763 109674346 109666479 109658110 109657598 109666002 109671426 109673619 109679115 109686291 109687650 109681714
2176.2 109681714 109676540 109680951 109691882 109702027 109710610 109720075 109730637 109738266 109737122 109727669 109724653 109731853 109735227
2202.7 109735227 109731674 109733331 109744906 109753382 109748840 109739220 109734547 109732139 109729600 109731090 109733403 109728742 109722602 109720528
2231.3 109720528 109714162 109701848 109697723 109701645 109695148 109682870 109684396 109694958 109695530 109682512 109668446 109663689 109664154
2257.8 109664154 109665322 109667885 109670532 109673119 109671032 109665346 109660101 109660506 109671831 109679437 109670186 109653509 109646475 109657288
2286.3 109657288 109680009 109699011 109709334 109720540 109737504 109758484 109786618 109827590 109872985 109924161 109998250
2308.8 109998250 110085475 110154915 110210121 110303628 110443640 110571897 110667181 110755396 110858023 110974336 111059058
2331.2 111059058 111079061 111091316 111145306 111210775 111237502 111167502 110954571 110738683 110727227 110958362 111305153
2353.6 111305153 111605787 111819315 111923695 111894166 111765742 111559093 111299217 111040008 110781205 110520077
2374 110520077 110288453 110092986 109928036 109799123 109708643 109656441 109634006 109624708 109619343 109615684 109615088 109613168
2398.5 109613168 109604490 109597862 109597921 109599471 109600675 109605742 109619200 109634531 109639001 109633899 109633338 109640646 109647751 109649694
2427.1 109649694 109647727 109646058 109646106 109648252 109651148 109647298 109641445 109647334 109660792 109669495 109674466 109678459 109679401 109679902 109678757
2457.7 109678757 109671235 109662044 109664440 109676313 109681630 109675515 109665060 109657502 109651208 109648073 109651327 109653270 109647024 109634197
2486.2 109634197 109618258 109604013 109596944 109591317 109577274 109563661 109563649 109563363 109547615 109530175 109525752 109524834 109513259
2512.7 109513259 109488356 109454823 109426630 109415746 109415507 109410715 109400785 109387684 109369016 109355760 109357977 109372091
2537.2 109372091 109387863 109394348 109395075 109398556 109395325 109380817 109365237 109353077 109345520 109338701 109330118 109322727 109309316
2563.7 109309316 109289145 109272814 109255898 109233105 109208059 109182894 109166241 109156609 109137380 109108269 109080195 109053910
2588.2 109053910 109030914 109015059 109003353 108993816 108980191 108959818 108943391 108930755 108915043 108896029 108870459 108839786
2612.7 108839786 108811045 108786547 108765900 108742547 108710051 108674157 108645284 108626080 108606780 108588409 108575356
2635.1 108575356 108556104 108537173 108532107 108531320 108520067 108495808 108468699 108445430 108422267 108388710 108332157 108261621
2659.6 108261621 108199441 108149981 108107984 108073282 108044803 108019769 108001781 107994962 107995558 108008516 108043468 108084261
2684.1 108084261 108110416 108136988 108186626 108245933 108295226 108340633 108389306 108434117 108464563 108482504 108487749 108477592
2708.5 108477592 108467174 108458114 108438873 108420467 108406305 108378160 108333230 108281982 108246446 108245707 108271098 108307159
2733 108307159 108341014 108376014 108421719 108461928 108482027 108485270 108481514 108486509 108505046 108522558 108526623 108517933 108501506
2759.5 108501506 108481550 108456123 108417130 108368623 108316731 108238935 108131456 108038652 107957935 107840931 107694423
2782 107694423 107545722 107376933 107183754 107001388 106834745 106654966 106439126 106194186 105958474 105731320
2802.4 105731320 105470324 105166137 104831409 104469275 104070866 103612161 103079975 102475965 101787257 100993991
2822.7 100993991 100079274 99014187 97771007 96318263 94573909 92382479 89509183 85652888
2839.1 85652888 80521947 74045318 66597205 58957452 52088034 46986657 44494969 44920281 47874403
2857.4 47874403 52482891 57725585 62698644 66714281 69450861 71205384 72766525 74700803
2873.7 74700803 76843154 78608745 79562497 79616719 78904915 77610087 75898212 73916674 71783054
2892.1 71783054 69580966 67354625 65087605 62723958 60219920 57544160 54641396 51432908
2908.4 51432908 47872970 43995401 39916301 35863674 32197914 29300180 27441502 26704162 27003476
2926.8 27003476 28177726 30070952 32647571 35908833 39722216 43841803 47984630 51829326
2943.1 51829326 55041236 57353771 58692282 59293985 59631747 60206985 61375546 63275683 65900570
2961.4 65900570 69141287 72788489 76579404 80250919 83604068 86539948 89039326 91131377
2977.8 91131377 92881465 94365120 95627511 96688622 97553617 98194212 98569906 98643321 98344302
2996.1 98344302 97613704 96466100 95011878 93502998 92292708 91717207 91989166 93120086 94915849
3014.5 94915849 97059816 99224925 101169825 102778518 104041898 105008256 105730820 106265903 106668031
3032.8 106668031 106991899 107271755 107485139 107624209 107736731 107868433 108011186 108128965 108234560 108358109
3053.2 108358109 108486497 108602905 108700025 108762634 108792555 108820844 108889520 109010661 109152043 109267783
3073.6 109267783 109335434 109377110 109435964 109518957 109595835 109665906 109735286 109793627 109853578 109911644 109947777
3096 109947777 109957397 109946334 109943509 109952128 109933841 109904909 109923363 109965980 109973490 109969616 109995520 110052061 110131896
3122.6 110131896 110208297 110246909 110250282 110259330 110289431 110307181 110289800 110260999 110260940 110285544 110305393 110312688 110299814
3149.1 110299814 110274398 110281706 110337067 110398018 110436213 110457909 110466480 110466313 110471189 110490596 110509300 110513425 110513520
3175.6 110513520 110502732 110486984 110492110 110507762 110513496 110506439 110504186 110515857 110530555 110552645 110577166 110586417
3200.1 110586417 110589623 110595286 110597599 110598671 110601962 110613859 110633862 110644209 110638988 110635757 110643113 110655606 110670519
3226.6 110670519 110668659 110628831 110587084 110604775 110662651 110697460 110700536 110686541 110658085 110640037 110654843 110672617
3251.1 110672617 110659909 110633814 110629249 110641921 110648537 110648215 110643137 110614264 110553360 110511446 110521770 110555041
3275.5 110555041 110584307 110596132 110596478 110602021 110601938 110570669 110506594 110449731 110432339 110437465 110457551 110481584 110451448
3302 110451448 110364771 110308671 110333431 110400152 110448861 110464048 110475957 110494864 110497177 110468662 110428548 110420883
3326.5 110420883 110447335 110470998 110471034 110423124 110330498 110269523 110275733 110301661 110327089 110333812 110290146 110253656
3351 110253656 110284066 110326695 110317838 110270202 110229552 110194540 110127306 110054195 110038710 110090399 110151160 110173678
3375.5 110173678 110176253 110178554 110179591 110175097 110160220 110115576 110017800 109936237 109950376 109991121 109952939 109867573
3399.9 109867573 109858525 109935546 109983492 109960568 109920788 109903669 109919631 109955919 109965992 109940672 109914935 109888136
3424.4 109888136 109829724 109743476 109682405 109641254 109579480 109554780 109606683 109666336 109675503 109628892 109563363 109528458
3448.9 109528458 109512687 109484589 109442043 109363174 109245598 109165776 109121716 108996415 108821797 108802199 108982277
3471.3 108982277 109169245 109230328 109168088 109093988 109174025 109319186 109354150 109372115 109449899 109477341 109416938
3493.8 109416938 109346628 109317827 109282935 109207952 109220433 109326041 109351146 109263718 109134424 109045708 109030664
3516.2 109030664 109023499 108958983 108838713 108754492 108753157 108764493 108767533 108771944 108748746 108731186 108773422 108816421
3540.7 108816421 108794010 108768725 108832753 108949244 109043002 109131265 109232461 109323704 109379971 109406912 109442937
3563.1 109442937 109479928 109516895 109607160 109736466 109847283 109925044 109983361 110017431 110022616 110005188 109983242
3585.5 109983242 110010707 110076225 110079849 110016286 109958744 109954679 110022187 110136354 110235608 110309315 110375929 110427797
3610 110427797 110464895 110512674 110573483 110621655 110674798 110758066 110825193 110816324 110755646 110762537 110820234 110856950
3634.5 110856950 110880613 110901344 110911381 110901248 110862625 110779214 110667062 110672879 110804069 110890317 110891557
3656.9 110891557 110898387 110953581 111023247 111052787 111015260 110941958 110921896 110942781 110949755 110987401 111058640 111116588
3681.4 111116588 111129487 111085641 111002576 110983133 111082208 111174905 111215878 111243355 111254406 111256480 111275089 111274636
3705.9 111274636 111229742 111162639 111128008 111165035 111225402 111253142 111242926 111228168 111223149 111233652 111264980 111264861
3730.3 111264861 111179471 111063004 111030281 111065793 111099100 111105347 111073923 111040461 111017680 111000788 111046541
3752.8 111046541 111121523 111145282 111129320 111135590 111162865 111177933 111185408 111188042 111190915 111214972 111230826 111193991
3777.3 111193991 111143291 111153412 111192584 111218917 111235464 111223567 111199450 111187291 111167371 111139798 111104393
3799.7 111104393 111069381 111082017 111117232 111142695 111169791 111177933 111136019 111076367 111041808 111002803 110992289 111033022
3824.2 111033022 111073864 111104369 111105585 111072683 111030126 110991716 110985756 111015892 111059999 111107612 111138630 111138237
3848.6 111138237 111093915 110997856 110937488 110975623 111029291 111039269 111016774 111004019 111004674 111004519 111015713 111043465
3873.1 111043465 111076188 111085784 111052573 111016691 110988510 110966051 111002171 111042273 111029863 111023188 111026466 110992694
3897.6 110992694 110939491 110908604 110908580 110954964 111018944 111042500 111036408 111026597 111008203 110993946 110993111 110994661 111001396
3924.1 111001396 111010730 110998452 110967219 110957086 110979056 110993552 110977221 110950291 110938227 110943782 110950267 110949659
3948.6 110949659 110958397 110974228 110976875 110977209 110985720 110984099 110965407 110947740 110948110 110955644 110941863 110917091 110919762
3975.1 110919762 110936439 110929322 110910618 110903275 110900152 110906959 110919797 110910988 110886955 110869908 110868657
3997.5 110868657
##END=$$ End of the data block
