##TITLE=$$ Begin of the data block
##JCAMP-DX=5.00 $$ ACD/SpecManager v 10.08
##SPECTROMETER/DATA SYSTEM=Alpha
##DATE=27 Jun 2014 15:13:00
##DATA TYPE=INFRARED SPECTRUM
##DATA CLASS=XYDATA
##ORIGIN=
##OWNER=
##NPOINTS=1667
##FIRSTX=599.63549805
##LASTX=3997.56909180
##MAXX=3997.56909180
##MINX=599.63549805
##MAXY=1.12303424
##MINY=0.27471644
##XFACTOR=1.0000000000
##YFACTOR=0.000000010000000
##FIRSTY=1.05596471
##DELTAX=2.03957605
##XUNITS=1/CM
##YUNITS=ARBITRARY UNITS
##XYDATA=(X++(Y..Y))
599.6A05596471n1701R2554J58441J39022J15061J09982J17672J33514R6428K51l8398
$$ 105596471 105544770 105637324 105795765 105934787 106049848 106159830 106277502 106411016 106507444 106507695 106469297
622.1A06469297P737N6744O3216K2757l0434n2273l9303l1853n4443o0594m5776m2057
$$ 106469297 106477034 106533778 106596994 106619751 106589317 106537044 106497741 106465888 106411445 106350851 106305075 106263018
646.5A06263018l9578m9853o6734q0406j10734j43122j95289k48313j36971M6384j21844
$$ 106263018 106223440 106173587 106106853 106026447 105915713 105772591 105577302 105328989 105192018 105238402 105116558
669A05116558l70550l30305k91884k62344k33269k32982k26880k27153k38550k22027
$$ 105116558 104746008 104415703 104123819 103861475 103628206 103395224 103168344 102941191 102702641 102480614
689.4A02480614k18928k39753k56098l01015l82900n14150p62457j105177j370889
$$ 102480614 102261686 102021933 101765835 101464820 101081920 100567770 99805313 98700136 97329247
707.7I7329247j356548j072359q01736o88726n91803l31002J59389P14785J066231
$$ 97329247 95972699 94900340 94098604 93409878 92818075 92487073 92646462 93361247 94427478
726.1I4427478J135391J035130R24391Q69709Q35067P89988P21550O52659O07741N29754
$$ 94427478 95562869 96597999 97522390 98392099 99227166 100017154 100738704 101391363 101999104 102528858
746.5A02528858M05765L39961L38554K98870K15971J50204J19710J43468J89901J73533
$$ 102528858 102934623 103274584 103613138 103912008 104127979 104278183 104397893 104541361 104731262 104904795
766.9A04904795J25622J11366J23620J46079J58226J52195J41096J37258J41155J42145
$$ 104904795 105030417 105141783 105265403 105411482 105569708 105721903 105862999 106000257 106141412 106283557
787.3A06283557J28019J06073Q0979M0221l314l2163n7518r2078j27446j17410p3921
$$ 106283557 106411576 106517649 106598628 106638849 106635535 106603372 106545854 106453776 106326330 106208920 106134999
809.7A06134999q2851j16717j08850q9515q0907l9959M2391P0095q118j16372j80948
$$ 106134999 106052148 105935431 105826581 105737066 105656159 105616200 105658591 105728686 105720568 105604196 105423248
832.1A05423248j86324j41561p5508m6718o6471o3836j8549M2784R7334J07479Q1027
$$ 105423248 105236924 105095363 105019855 104973137 104906666 104842830 104824281 104867065 104964399 105071878 105152905
854.6A05152905M2844l70l8957o8736j02973j46795j86050k09522k09892j52349j8573
$$ 105152905 105195749 105195379 105156422 105087686 104984713 104837918 104651868 104442346 104232454 104080105 104061532
877A04061532Q4972Q5640O6877R6762J31118R9969J3626j11628l01254l96609k23040
$$ 104061532 104146504 104232144 104299021 104395783 104526901 104626870 104640496 104528868 104227614 103831005 103607965
899.4A03607965p403M3583L1828l397n9450p8177n9378l8362m6658j02485j98876k68138
$$ 103607965 103600562 103644145 103675973 103672576 103613126 103534949 103475571 103437209 103390551 103288066 103089190 102821052
923.9A02821052k10237j9300J92260K59698J27840l9017o3241K5511P6771M6694p868
$$ 102821052 102610815 102591515 102783775 103043473 103171313 103132296 103069055 103094566 103171337 103218031 103210163
946.4A03210163o1977j32417k09642k36833j94144j19305n0628n96J4174k1482p0762
$$ 103210163 103148186 103015769 102806127 102569294 102375150 102255845 102205217 102204621 102218795 102197313 102126551
968.8A02126551j01734j47676k13063j96218n9080N6362O6674P1895J29461J62363
$$ 102126551 102024817 101877141 101664078 101467860 101408780 101465142 101531816 101603711 101733172 101895535
989.2A01895535J15526L3211k2113m6706p9572j35637j90019k34854k83885k68400
$$ 101895535 102011061 102044272 102022159 101975453 101895881 101760244 101570225 101335371 101051486 100783086
1009.6A00783086r6071P5984J9109j72543k58005k03752j35827j02544p2581j9342
$$ 100783086 100687015 100762999 100782108 100609565 100351560 100147808 100011981 99909437 99836856 99817514
1030I9817514L5370O55j80399n00369q57586r28598n04935M1157K85137L26818L43990
$$ 99817514 99852884 99853539 99673140 99172771 98315185 97386587 96881652 96922809 97207946 97534764 97878754
1052.4I7878754K97767J83696Q2212N3460P6198P2187O831q1307j47616k28006l75223
$$ 97878754 98176521 98360217 98442429 98495889 98572087 98644274 98651105 98569798 98422182 98194176 97818953
1074.9I7818953n72008p73776r19372r62293r42772r21876r14186r13018q73780p58737
$$ 97818953 97246945 96473169 95553797 94591504 93648732 92726856 91812670 90899652 90025872 89267135
1095.2H9267135n67985l08108k7001K02393L26318K99293J07890j59621l55959l76248
$$ 89267135 88699150 88391042 88364041 88566434 88892752 89192045 89299935 89140314 88784355 88408107
1115.6H8408107j90378J46669M83788O24579M33159n3084n69612r50724j343054j777982
$$ 88408107 88217729 88364398 88848186 89472765 89905924 89852840 89283228 88332504 86989450 85211468
1136H5211468k016956j931345j634461j317209j108867j022810j019561j057655j066154
$$ 85211468 83194512 81263167 79628706 78311497 77202630 76179820 75160259 74102604 73036450
1154.4G3036450r81390p98101n49787k91365p8392Q0478K14535L59178N65558Q38113
$$ 73036450 72055060 71256959 70707172 70415807 70337415 70417893 70632428 70991606 71557164 72395277
1174.8G2395277J072615J233423J368904J426471J367199J246351J103848R57918Q36873
$$ 72395277 73467892 74701315 76070219 77496690 78863889 80110240 81214088 82172006 83008879
1193.1H3008879P66641P59060P78442P52884O54054N08499L51012K17020J40757J11758
$$ 83008879 83775520 84534580 85313022 86065906 86719960 87228459 87579471 87796491 87937248 88049006
1213.5H8049006R6715P1895J097j19990k41131l13133l17627k79212k51103k49540
$$ 88049006 88145721 88217616 88218713 88098723 87857592 87544459 87226832 86947620 86696517 86446977
1233.9H6446977k29913j35392L1876K11060L64489M92614N67931N51802M71330L80331
$$ 86446977 86217064 86081672 86113548 86324608 86689097 87181711 87749642 88301444 88772774 89153105
1254.3H9153105L17675K95168K80821K47705K03592J78438J95331K27123K26325J97083
$$ 89153105 89470780 89765948 90046769 90294474 90498066 90676504 90871835 91098958 91325283 91522366
1274.7I1522366J57594J31661J79404L20983M63808M92543M09132K92832K04825J54340
$$ 91522366 91679960 91811621 91991025 92312008 92775816 93268359 93677491 93970323 94175148 94329488
1295.1I4329488J09583O3229P0280J60450K54941K69067K38860K30437K15536J52779
$$ 94329488 94439071 94502300 94572580 94733030 94987971 95257038 95495898 95726335 95941871 96094650
1315.5I6094650Q2815Q2135J48612K12324K40892K22850J48398L3319r8438k22629
$$ 96094650 96177465 96259600 96408212 96620536 96861428 97084278 97232676 97265995 97167557 96944928
1335.9I6944928l04538k93684j93995j31965j47199j72657j75214j59293j49095j32275
$$ 96944928 96640390 96346706 96152711 96020746 95873547 95700890 95525676 95366383 95217288 95085013
1356.3I5085013q1438k7847j0306j5980m4203p3087j32054m01622q14909p79599n6779
$$ 95085013 95003575 94975728 94965422 94949442 94905239 94832152 94700098 94298476 93483567 92703968 92647189
1378.7I2647189Q09842J227910J197272J070106Q84068N89085L22068J73366K07275
$$ 92647189 93457031 94684941 95882213 96952319 97836387 98425472 98747540 98920906 99128181
1397.1I9128181L89462N67389O07097N09274K11144k59090p51889j027029r25947n26589
$$ 99128181 99517643 100085032 100692129 101201403 101412547 101153457 100401568 99374539 98448592 97922003
1417.5I7922003P6825M58187L59958J2052m42350q98856j093775j032311j105552j069254
$$ 97922003 97998828 98457015 98816973 98829025 98386675 97487819 96394044 95361733 94256181 93186927
1437.9I3186927p62022o93333p63494q24761r74804j173258j418608j618398j715880
$$ 93186927 92424905 91731572 90968078 90143317 89168513 87995255 86576647 84958249 83242369
1456.2H3242369j188255l99083m28497p35414J33556K398759M685372O036353M681599
$$ 83242369 82054114 81655031 81226534 80491120 80624676 83023435 87708807 93745160 98426759
1474.6I8426759K480090J497936J131523R14562O76226M68719L69120L55339K76339
$$ 98426759 100906849 102404785 103536308 104450870 105127096 105595815 105964935 106320274 106596613
1493A06596613Q6510j23870j24550J32835L05879K63500K17497K87819K46704J35136
$$ 106596613 106683123 106559253 106434703 106567538 106873417 107136917 107354414 107642233 107888937 108024073
1513.4A08024073L6668J4413L4082M1473Q9395R9766Q4913P5519J8024j4615L2759
$$ 108024073 108060741 108075154 108109236 108150709 108240104 108339870 108424783 108500302 108518326 108503711 108536470
1535.8A08536470k3830j85704j27793L5108O5136K5665n650J5247L4058N281n6327
$$ 108536470 108512640 108326936 108199143 108234251 108299387 108325052 108319402 108334649 108368707 108373988 108317661
1558.2A08317661Q3018K05803J22094M9901L0124P2348J14357L6002k0743P2706J03784
$$ 108317661 108400679 108606482 108728576 108778477 108808601 108880949 108995306 109031308 109010565 109083271 109187055
1580.7A09187055N0068J8823J1456N281j729j2576k6119l8493n6350q1074p3958l2711
$$ 109187055 109237123 109255946 109267402 109272683 109270954 109258378 109232259 109193766 109137416 109056342 108982384 108949673
1605.1A08949673J3757L8373M3810J8012n8198q2028L243k2495j15156r3150m4847
$$ 108949673 108963430 109001803 109045613 109063625 109005427 108923399 108926642 108904147 108788991 108695841 108650994
1627.6A08650994N389L1399p2336k24304j50120q5354j68538k56777l61145k54345
$$ 108650994 108656383 108687782 108615446 108391142 108241022 108155668 107987130 107730353 107369208 107114863
1648A07114863m7314k00045l66962m5001L5917p8225j78134j65284j18899j72353o8939
$$ 107114863 107067549 106867504 106500542 106455541 106491458 106413233 106235099 106069815 105950916 105778563 105709624
1670.4A05709624J95515L27969L34191K44487Q9967j12081k50077j30463j12557k28965
$$ 105709624 105905139 106233108 106567299 106811786 106901753 106789672 106539595 106409132 106296575 106067610
1690.8A06067610k95758n12600o72853p19762q76057p23601p20358q66925p70402o79893
$$ 106067610 105771852 105259252 104586399 103866637 102990580 102266979 101546621 100679696 99909294 99229401
1711.2I9229401p30651r98318j616800j887346j855605k320731k940816l410631l960514
$$ 99229401 98498750 97500432 95883632 93996286 92140681 89819950 86879134 83468503 79507989
1729.5G9507989m571671o303912o859380n305630n110311m514713k715656q59123J201451
$$ 79507989 74936318 68632406 61773026 56467396 51357085 46842372 44126716 43267593 44469044
1747.9D4469044L784749O162685P080030P814694Q104175P055396O008523M482186
$$ 44469044 48253793 54416478 61496508 69311202 77415377 84470773 90479296 94961482
1764.2I4961482K997023K190375J601077J236224R79233P25507N51844M55117L78859
$$ 94961482 97958505 100148880 101749957 102986181 103965414 104690921 105242765 105697882 106076741
1782.6A06076741L31319K84719K32148J44363J28328J84477J87766J43600J14608J28686
$$ 106076741 106408060 106692779 106924927 107069290 107197618 107382095 107569861 107713461 107828069 107956755
1803A07956755J29390J14441Q0108Q1003J00792R7990P5102P4684P0954L6084K6989
$$ 107956755 108086145 108200586 108280694 108361697 108462489 108560479 108635581 108710265 108781219 108817303 108844292
1825.4A08844292L5870L6884O1869R3293O6102L7086K9647P856k4187J3601P1729O1357
$$ 108844292 108880162 108917046 108978915 109072208 109138310 109175396 109205043 109212899 109188712 109202313 109274042 109335399
1849.9A09335399L4368J1301M112K349Q237R620K504k2650m1830M065M2677K4545K837
$$ 109335399 109369767 109381068 109385180 109387529 109395766 109405386 109407890 109385240 109343410 109347475 109390152 109414697 109417534
1876.4A09417534L934L087P427J0335K170j3363m77K2113J2553J0514J2779L398p081
$$ 109417534 109421468 109424555 109431982 109442317 109444487 109431124 109430647 109452760 109465313 109475827 109488606 109492004 109484923
1902.9A09484923o306j0491j3327p51N495j3447l3748k0003m923l34Q869R131R18j466
$$ 109484923 109478617 109468126 109454799 109454048 109459543 109446096 109412348 109392345 109387422 109387088 109395957 109405088 109406006 109404540
1931.5A09404540n054o068l374j2874k5833j1420J7035J9192O438k230k50J753k265
$$ 109404540 109399486 109393418 109390044 109377170 109351337 109339917 109356952 109376144 109382582 109380352 109380102 109381855 109379590
1958A09379590m149O91K87j2482p879R489Q809R66J049j574o902j4841j9467j6320
$$ 109379590 109375441 109376132 109376419 109363937 109356058 109365547 109374356 109375322 109376371 109374797 109367895 109353054 109333587 109317267
1986.5A09317267j4460j0646J026R310m077j6785r906r54j502r727j5152j3625j4294
$$ 109317267 109302807 109292161 109293187 109302497 109298420 109281635 109271729 109270775 109269273 109259546 109244394 109230769 109216475
2013A09216475j8036j6832j2624j5378k1601j3292L993O450k718m638K110J0348J1587
$$ 109216475 109198439 109181607 109168983 109153605 109132004 109118712 109122705 109129155 109126437 109121799 109123909 109134257 109145844
2039.6A09145844L636L052J0430J0050O985L231l10P153J0931P999J0121Q106M125
$$ 109145844 109149480 109152532 109162962 109173012 109179997 109183228 109182918 109190071 109201002 109209001 109219122 109227228 109231353
2066.1A09231353O664J1301J3363J2290Q488K396J419J1051J9669J7512J1897J1206
$$ 109231353 109238017 109249318 109262681 109274971 109283459 109285855 109287274 109298325 109317994 109335506 109347403 109358609
2090.5A09358609J4806J4770N483K158J3769J5974L898K229Q905R131P630Q726J2028
$$ 109358609 109373415 109388185 109393668 109395826 109409595 109425569 109429467 109431696 109440601 109449732 109457362 109466088 109478116
2117.1A09478116J1218O508M328N233L648o44M447R429k14j1004p164K646M340l708
$$ 109478116 109489334 109495842 109500170 109505403 109509051 109508407 109512854 109522283 109522069 109511065 109503901 109506547 109510887 109507179
2145.6A09507179r560l076K194p51n305p642l492Q380J7583J6773J3793J5032J3530
$$ 109507179 109497619 109494543 109496737 109495986 109490681 109483039 109479547 109487927 109505510 109522283 109536076 109551108 109564638
2172.1A09564638P439L195M911J1408J1218R656J0037P272J0681J8680J3233j049J752
$$ 109564638 109572077 109575272 109580183 109591591 109602809 109612465 109622502 109629774 109640455 109659135 109672368 109671319 109673071
2198.6A09673071J4675J1611j610L82J0240R537M243L541N960N734N329N579P331P344
$$ 109673071 109687746 109699357 109697747 109698129 109708369 109717906 109722149 109725690 109731650 109737384 109742713 109748292 109755623 109762967
2227.2A09762967o32r012r478k431Q201Q297j371J002P712N973K706l529n626P689
$$ 109762967 109762335 109753323 109743845 109741414 109749615 109757912 109756541 109757543 109765255 109771228 109773934 109770405 109764779 109772468
2255.8A09772468J4460L373m470j252M554Q261J3089J1468K325k337j239n710j4234
$$ 109772468 109786928 109790301 109785831 109784579 109789133 109797394 109810483 109821951 109824276 109821939 109820700 109814990 109800756
2282.3A09800756k694K2411L0124J9110J5270K6059K9779K5129L2234M7005N2058N9736
$$ 109800756 109798062 109820473 109850597 109869707 109884977 109911036 109940815 109965944 109998178 110045183 110097241 110156977
2306.7A10156977P8619Q5425P2074O4325R1482J35147J46032J16646R0503J03355J24431
$$ 110156977 110235596 110321021 110393095 110457420 110548902 110684049 110830081 110946727 111037230 111140585 111265016
2329.2A11265016R3281K8062J4758N2571P2992N3334n2619k43079k56598k1899K45213
$$ 111265016 111358297 111386359 111401117 111453688 111526680 111580014 111527395 111284316 111027718 111005819 111251032
2351.6A11251032L71731L28636K34103J17922k6953j54209k30170k65002k69425k70259
$$ 111251032 111622763 111951399 112185502 112303424 112276471 112122262 111892092 111627090 111357665 111087406
2372A11087406k76077k59829k22790j75893j27733r0218n7566k8729j1373k634j967
$$ 111087406 110811329 110551500 110328710 110152817 110025084 109934866 109877300 109848571 109837198 109834564 109832597
2394.4A09832597n448r108j3315r776k229j43K945Q380P451J573k718j228L815J013
$$ 109832597 109827149 109818041 109804726 109794950 109792721 109792578 109795523 109803903 109811354 109812927 109810209 109808981 109812796 109813809
2423A09813809k265N043P868r54n853j919k683r191n757N960J0204L076r54K742TJ514
$$ 109813809 109811544 109816587 109824455 109823501 109817648 109815729 109813046 109803855 109798098 109804058 109814262 109817338 109816384 109819126 109821868 109823382
2455.6A09823382j347n531l446j90J78L589L802m601j1349j4913r775j037k134o878
$$ 109823382 109822035 109816504 109813058 109812868 109813046 109816635 109820437 109815836 109804487 109789574 109779799 109778762 109776628 109769750
2484.2A09769750r323j2445j3161n805n698j2160n126O08j1945k1445j2732l898o044
$$ 109769750 109760427 109747982 109734821 109729016 109723318 109711158 109706032 109706640 109694695 109673250 109660518 109656620 109650576
2510.7A09650576r942j4007k4009k8586j6391k099j66l636r644j7107j2982L70Q476
$$ 109650576 109640634 109626627 109602618 109574032 109557641 109555542 109555376 109551740 109542096 109524989 109512007 109512377 109520853
2537.2A09520853R930O449L087R18q320j5212j4472j2111Q34Q285n507j6058j6474
$$ 109520853 109530783 109537232 109540319 109541237 109532917 109517705 109503233 109491122 109491956 109500241 109494734 109478676 109462202
2563.7A09462202j0741N9m422k1339k8681k6906k1052j2863j1325j6141k1779k4629
$$ 109462202 109451461 109451520 109447098 109425759 109397078 109370172 109349120 109336257 109324932 109308791 109287012 109262383
2588.2A09262383k1553j5974j1814j0454j2887j4257j1981j5283k5200k7240j6153
$$ 109262383 109240830 109224856 109213042 109202588 109189701 109175444 109163463 109148180 109122980 109095740 109079587
2610.6A09079587r620j8680k4938k0302k3031l6395m0340l1424k0575j4603j2398q833
$$ 109079587 109069967 109051287 109026349 109006047 108983016 108946621 108906281 108874857 108854282 108839679 108827281 108818448
2635.1A08818448j2792j6403o127Q22m685j0466j7548k8610l3712m0126n2297n9426
$$ 108818448 108805656 108789253 108783126 108783948 108779263 108768797 108751249 108722639 108688927 108648801 108596504 108537078
2659.6A08537078o3145n8341m3237l0482k8122l0005j7035M208J4961K2078L3331L8075
$$ 108537078 108473933 108415592 108372355 108341873 108313751 108283746 108266711 108270919 108285880 108307958 108341289 108379364
2684.1A08379364L0482L0577M7231N5289M5073L7766M2724M9269M3476K4307M148j2862
$$ 108379364 108409846 108440423 108487654 108542943 108588016 108625782 108668506 108717775 108761251 108785558 108789706 108776844
2708.5A08776844j9944j4806j3888j7166j5354j9384l8719n3191l3200L434K1481K8896
$$ 108776844 108756900 108742094 108728206 108711040 108695686 108676302 108637583 108584392 108551192 108554626 108576107 108605003
2733A08605003L4452L9422M9866M8363K4593p487j9371L779K9158K6703O461j4627
$$ 108605003 108639455 108678877 108728743 108777106 108801699 108794212 108774841 108778620 108807778 108834481 108840942 108826315
2757.5A08826315k6738k5845k4724l5012m5812n4335q7202j18637r5761p8153j13321
$$ 108826315 108799577 108773732 108749008 108713996 108668184 108613849 108526647 108408010 108312249 108234096 108120775
2779.9A08120775j39904j47271j78111k03442j88387j74582j91807k23220k39241k25234
$$ 108120775 107980871 107833600 107655489 107452047 107263660 107089078 106897271 106674051 106434810 106209576
2800.3A06209576k21121k61104l14284l47435l66199m00698m66955n41508o10757o96731
$$ 106209576 105988455 105727351 105413067 105065632 104699433 104298735 103831780 103290272 102679515 101982784
2820.7A01982784q06737r25541j066821j244134j457346j748961k195006k871514l836053
$$ 101982784 101176047 100250506 99183685 97939551 96482205 94733244 92538238 89666724 85830671
2839.1H5830671n087960o417149p373459p552898o783884n034322k457151M23676K926412
$$ 85830671 80742711 74325562 66952103 59399205 52615321 47580999 45123848 45547524 48473936
2857.4D8473936M563850N189658M926425L981835K716797J744777J540130J897204
$$ 48473936 53037786 58227444 63153869 67135704 69852501 71597278 73137408 75034612
2873.7G5034612K111650J745027R33892M0561p15161j289653j695335j955575k109045
$$ 75034612 77146262 78891289 79825181 79865742 79150581 77860928 76165593 74210018 72100973
2892.1G2100973k185911k214920k251298k335256k468705k646595k875257l166652
$$ 72100973 69915062 67700142 65448844 63113588 60644883 57998288 55123031 51956379
2908.4E1956379l505069l829339m039049m012611l634456k882043j851704p30464L04362
$$ 51956379 48451310 44621971 40582922 36570311 32935855 30053812 28202108 27471644 27776006
2926.8B7776006J175913J891825K562853L228143L770852M079345M107535L817350
$$ 27776006 28951919 30843744 33406597 36634740 40405592 44484937 48592472 52409822
2943.1E2409822L189099K288854J319450N90366L26085N62203J157606J883936K596575
$$ 52409822 55598921 57887775 59207225 59797591 60123676 60685879 61843485 63727421 66323996
2961.4F6323996L206199L619695L770649L650612L327966K906262K473122K073831
$$ 66323996 69530195 73149890 76920539 80571151 83899117 86805379 89278501 91352332
2977.8I1352332J735949J468927J248920J056677Q65602O30361L56597O0517l06345
$$ 91352332 93088281 94557208 95806128 96862805 97728407 98358768 98715365 98775882 98469537
2996.1I8469537p36331j146311j443934j497084j207573n80835K66361J123518J781130
$$ 98469537 97733206 96586895 95142961 93645877 92438304 91857469 92123830 93247348 95028478
3014.5I5028478K124888K152854J938516J601290J263166R72474P16972N14471L81375
$$ 95028478 97153366 99306220 101244736 102846026 104109192 105081666 105798638 106313109 106694484
3032.8A06694484L08251K67029K05421J30427J01853J27804J45531J24550J13391J25122
$$ 106694484 107002735 107269764 107475185 107605612 107707465 107835269 107980800 108105350 108218741 108343863
3053.2A08343863J16790R0682P3052N5849L4070K6107N9509J14465J36650J09434N7626
$$ 108343863 108460653 108551335 108624387 108680236 108714306 108740413 108799922 108914387 109051037 109160471 109218097
3075.7A09218097L4320O0678Q2862O4290N2022N9736N9843O4504O0082K7299j1599
$$ 109218097 109252417 109313095 109395957 109460247 109512269 109572005 109631848 109696352 109756434 109783733 109772134
3098.1A09772134k2197J586O771k6095k7573K4211M0519p272k2280K3103O6924Q1766
$$ 109772134 109749937 109751523 109758294 109732199 109704626 109728837 109769356 109762084 109739804 109762907 109829831 109911597
3122.6A09911597O3300K6417J740R179K7442J3554k8538m3762N24L9840K7073L254
$$ 109911597 109974897 110001314 110003054 110012233 110039675 110053229 110024691 109980929 109981453 110021293 110048366 110051620
3147A10051620k0814l9673r382M4191N5909L8636K8002J7870K325k385Q655J2708K62
$$ 110051620 110030806 109991133 109981751 110025942 110081851 110120487 110148489 110166359 110168684 110166299 110174954 110187662 110187924
3173.5A10187924n746p653r215P999K0170J3208J312n222M375J3316J2183J0395M721
$$ 110187924 110182178 110174525 110165310 110173309 110193479 110206687 110207999 110202777 110207152 110220468 110232651 110243046 110247767
3200.1A10247767k360p654l922J3853K3424J5283M232m840p153L636J4389J8143J5629
$$ 110247767 110245407 110237753 110233831 110247684 110271108 110286391 110290623 110285783 110278630 110282266 110296655 110314798 110330427
3226.6A10330427q762m9854n2368J5747O9404M3607K730j6105l3379k2531K1756K8741
$$ 110330427 110321665 110271811 110219443 110235190 110304594 110348201 110350931 110334826 110301447 110278916 110300672 110329413
3251.1A10329413j5258l6276j263K6083J2517J263n996l4595o1738l5286J3876K9802
$$ 110329413 110314155 110277879 110276616 110302699 110315216 110316479 110310483 110275888 110214150 110178864 110192740 110222542
3275.5A10222542K9457J7607M315J455m757k1267n2440n9855k2852R918K8563L1435
$$ 110222542 110251999 110269606 110273921 110275376 110270619 110249352 110196912 110137057 110114205 110124123 110152686 110184121
3300A10184121k2209q7642o8379J5390P2098O5935L0124J3840J4675J538l0852m3452
$$ 110184121 110161912 110074270 110005891 110021281 110093379 110159314 110189438 110203278 110217953 110219491 110188639 110145187
3324.5A10145187m732L0601K7275R358m0364r0254n3310J7440K6727J4186J585l6800
$$ 110145187 110140455 110171056 110198331 110207689 110167325 110077071 110023761 110041201 110067928 110082114 110083699 110046899
3348.9A10046899l5047K3448M0376l612l6060k5297k1267n6791o7961j0514N8889O2633
$$ 110046899 110011852 110035300 110075676 110072064 110036004 110010707 109989440 109932649 109864688 109854174 109913063 109975696
3373.4A09975696K1898M328P15m459k753o569l8647q8609o7603K3794M2176l8826q4794
$$ 109975696 109997594 110001922 110002637 109998178 109995425 109988856 109950209 109861600 109793997 109817791 109859967 109821141 109736347
3399.9A09736347j0323P6449M9400j7095k8193n221K6417L7813L81l2675k7501k2042
$$ 109736347 109726024 109802473 109851873 109834778 109806585 109801364 109827781 109865594 109865975 109833300 109805799 109783757
3424.4A09783757m5347p9668o3145l6979n7852k8360N2881O5708J2505m4596o5267
$$ 109783757 109738410 109658742 109595597 109558618 109500766 109472406 109525287 109590995 109603500 109558904 109493637
3446.8A09493637m1246k6036k8431l3522p4959j06072n0545k5022j32262j91749k7298
$$ 109493637 109452391 109426355 109397924 109364402 109289443 109183371 109132826 109107804 108975542 108783793 108756495
3469.3A08756495J91938K01714O1632o1727o2466R1005J42824L0017K3532P9847J9955
$$ 108756495 108948433 109150147 109211779 109150052 109087586 109178591 109321415 109351432 109374964 109454811 109474766
3491.7A09474766o6721p4244k9599k8992o4099K2304J12581M1473n8400j14251j01411
$$ 109474766 109408045 109333801 109304202 109275210 109211111 109233415 109345996 109387469 109329069 109214818 109113407
3514.2A09113407l7908k5797p2062j12391o5267K3842L4118O938j109j9217j6117L1197
$$ 109113407 109075499 109049702 108977640 108865249 108799982 108823824 108857942 108864880 108863771 108844554 108828437 108859634
3538.6A08859634L7241j0645j4198N3907R8621Q8454R0050J00029R2089O4170M1819
$$ 108859634 108896875 108886230 108872032 108925939 109024560 109113014 109203064 109303093 109395182 109459352 109501171
3561.1A09501171N1355M3643L1221Q0836J28388J13106Q4233P4017M1831k241k1816
$$ 109501171 109552526 109596169 109627390 109708226 109836614 109949720 110033953 110107970 110149801 110147560 110125744
3583.5A10125744j4519K8503M7957p450n2822m1449P99N5241R5559J03533R2804P1800
$$ 110125744 110111225 110139728 110187685 110180235 110127413 110085964 110086763 110142004 110237563 110341096 110433900 110505700
3608A10505700M3774K7621N0747P8559N7089L5751N9640O2788L028m8339R179N7637
$$ 110505700 110549474 110577095 110627842 110706401 110763490 110799241 110858881 110921669 110924697 110876358 110885537 110943174
3632.4A10943174M2701J9932m971j3030N37k408o1286j26314j6951J23012Q5139Q917
$$ 110943174 110985875 111005807 111000836 110987806 110988343 110985935 110924649 110798335 110781384 110904396 110989535 110998452
3656.9A10998452J5652M9007O2716L4964l1340p4625k8312Q714o521L7992Q7726O9261
$$ 110998452 111014104 111063111 111125827 111160791 111129451 111054826 111026514 111035228 111028707 111066699 111154425 111223686
3681.4A11223686J7822l1364p6724m1973P5436R8800N4646K3925J0860J1897J2791
$$ 111223686 111241508 111210144 111133420 111091447 111166883 111265683 111320329 111344254 111355114 111367011 111379802
3703.8A11379802p450l7372n8067l5060K5606M1247J3935k539J1361K7430K9063K1947
$$ 111379802 111372352 111334980 111276913 111241853 111267459 111308706 111322641 111320102 111331463 111358893 111387956 111409903
3728.3A11409903k4593j10758j32405m1676L9780N2786J5855l5083k0671j7464m5276
$$ 111409903 111385310 111274552 111142147 111100471 111140251 111193037 111208892 111173809 111153138 111135674 111090398
3750.7A11090398K8026Q8024M4966p177O44K0230O235M065O723Q202K7096J2720l6943
$$ 111090398 111118424 111206448 111251414 111244237 111244881 111265111 111271346 111275411 111282134 111290336 111317432 111330152 111293209
3777.3A11293209m2177J2529L4178K4139R120j7202o759N591l1281m3690m0710l9911
$$ 111293209 111251032 111263561 111297739 111321878 111330998 111313796 111307037 111312628 111281347 111237657 111196947 111157036
3801.7A11157036K2220M4370J8859K3234J2195l7420n8007k3556k5296j2946L7813
$$ 111157036 111179256 111223626 111242485 111265719 111277914 111240494 111182487 111158931 111133635 111120689 111158502
3824.2A11158502L9303K7061J1599k0254n1701o3038k8216K1708M9173O0809N1868
$$ 111158502 111197805 111224866 111236465 111216211 111164510 111101472 111073256 111094964 111144137 111204946 111256814
3846.6A11256814J7321m4262j11568o7354M4644N4741N698j9669N376J3483k1637j8501
$$ 111256814 111274135 111229873 111118305 111050951 111095595 111150336 111156034 111136365 111141741 111155224 111133587 111115086
3871.1A11115086J9050K7442J5664m161j239p511k9420Q905K0205k0587L827L2794
$$ 111115086 111134136 111161578 111177242 111173081 111171842 111164331 111134911 111143816 111164021 111143434 111147261 111180055
3895.5A11180055q225m3536l8790k6119J3363N2989M2617Q059q834n531J967N817L112
$$ 111180055 111171830 111128294 111089504 111063385 111076748 111129737 111172354 111180413 111171579 111166048 111168015 111173832 111176944
3922.1A11176944o139j1981j4007k2030k3186L22K4318J5355j2827j7369J669M780
$$ 111176944 111170805 111158824 111144817 111122787 111099601 111099923 111124241 111139596 111126769 111109400 111111069 111115849
3946.5A11115849N531K0993J5307j991J204L469j1266k4783k0385q58O747q583j3816
$$ 111115849 111121380 111142373 111157680 111155689 111156893 111160362 111149096 111124313 111103928 111103070 111109817 111101234 111087418
3973.1A11087418R930J7571p057r465L803l577j728J0979N066j7881l6037j6558
$$ 111087418 111097348 111114919 111107862 111098397 111102200 111098623 111096895 111107874 111112940 111095059 111059022 111042464
3997.5A11042464
$$ 111042464
##END=$$ End of the data block
