##TITLE=A1 Cristal $$ Begin of the data block
##JCAMP-DX=5.00 $$ ACD/SpecManager v 10.08
##SPECTROMETER/DATA SYSTEM=Alpha
##DATE=22 Jul 2015 08:20:50
##DATA TYPE=INFRARED SPECTRUM
##DATA CLASS=XYDATA
##ORIGIN=
##OWNER=
##NPOINTS=1765
##FIRSTX=399.76428223
##LASTX=3997.64306641
##MAXX=3997.64306641
##MINX=399.76428223
##MAXY=0.85223925
##MINY=0.21810147
##XFACTOR=1.0000000000
##YFACTOR=1.000000000000000e-9
##FIRSTY=0.78859091
##DELTAX=2.03961372
##XUNITS=1/CM
##YUNITS=ARBITRARY UNITS
##XYDATA=(X++(Y..Y))
399.8G88590908M453301L867925J243293J876771L649176J865029L99351K354920K899051
$$ 788590908 793044209 796912134 798155427 800032198 803681374 805546403 805945754 808300674 811199725
418.1H11199725M21941J124024L686071K348780M9353J871586L304064N54443m07756
$$ 811199725 811621666 812745690 816431761 818780541 818829894 820701480 824005544 824559987 824152231
436.5H24152231K422154K268136m97878M62711K631366Q27551o47545J910210K669096
$$ 824152231 826574385 828842521 828344643 828807354 831438720 832266271 831618726 833528936 836198032
454.8H36198032n63979q50678J970887R48310j468360L27051K112448p11978k153277
$$ 836198032 835634053 834783375 836754262 837702572 836234212 836561263 838673711 837961733 835808456
473.2H35808456J017570J470626j578808j145005J375139j99080k490163m72307J005411
$$ 835808456 836826026 838296652 836717844 835572839 836947978 836748898 834258735 833786428 834791839
491.5H34791839j665771k581060J19209Q1540k834320k211631J50264j532376l603220
$$ 834791839 833126068 830545008 830664217 830745757 827911437 825699806 825850070 824317694 820714474
509.9H20714474j554787l20912l058493l884315j057327j033008l877521l368378r82940
$$ 820714474 819159687 818838775 815780282 811895967 810838640 809805632 805928111 802559733 801576793
528.3H01576793k558470m820704l094733j794040m139066m936993k726912l053487
$$ 801576793 799018323 794197619 791102886 789308846 785169780 780232787 777505875 774452388
544.6G74452388n812525n272091k911687m204333o491184n252302m097819o176770
$$ 774452388 768639863 763367772 760456085 756251752 749760568 744508266 740410447 734233677
560.9G34233677p055044n086243n287051p951915p822276n994439p342398r504199
$$ 734233677 727178633 722092390 716805339 708853424 701031148 695036709 687694311 678190112
577.2F78190112q479774p686615r957790j1468768j0416747j0816216j3524353j4494062
$$ 678190112 669710338 662023723 652065933 640597165 630180418 619364202 605839849 591345787
593.5E91345787j4089644j6089022j9231081k0422340k1881371k5651813k8741419
$$ 591345787 577256143 561167121 541936040 521513700 499632329 473980516 445239097
607.8D45239097k8694451k6846945k3147643j4860600j230210J3434827K3568005K8452605
$$ 445239097 416544646 389697701 366550058 351689458 350459248 363894075 387462080 415914685
624.1D15914685K8479486K2668302J2207240J637697n473286n938619K078474J4160990
$$ 415914685 444394171 467062473 479269713 480907410 475434124 469495505 471573979 485734969
640.4D85734969K1900863K2525012K1465540K1913529K0546198J6609430J4559150
$$ 485734969 507635832 530160844 551626384 573539913 594086111 610695541 625254691
654.7F25254691J4094114J1795759R513378J0022343R809255Q025408Q479595R434342
$$ 625254691 639348805 651144564 660657942 670680285 680489540 688514948 696994543 706428885
671G06428885Q242369O351769O599844Q401036P341504N071819N823791P066548N298137
$$ 706428885 714671254 721023023 727622867 736023903 743365407 748437226 754261017 761327565 766625702
689.4G66625702M025162N690038O081164L744006L381789N326449M871369K627909
$$ 766625702 770650864 776340902 782422066 786166072 789547861 794874310 799745679 802373588
705.7H02373588L184021M910290L520131J633644K809882L796280J968383J357139
$$ 802373588 805557609 810467899 813988030 815621674 818431556 822227836 824196219 825553358
722H25553358L498673L823459J573444J426458L210545K348184K19166J046300K546668
$$ 825553358 829052031 832875490 834448934 835875392 839085937 841434121 841653287 842699587 845246255
740.4H45246255R65119n08368J150369K101064J45972m13358J560449J504481o69837
$$ 845246255 846211374 845703006 846853375 848954439 849100411 848687053 850247502 851751983 851082146
758.7H51082146m27842J331151K53796j581848k97307J115381n23746j519084L96252
$$ 851082146 850654304 851985455 852239251 850657403 850360096 851475477 850951731 849432647 849828899
777.1H49828899J031995r59516j203418P26223M03464j565039r63688O78957m46916
$$ 849828899 850860894 849901378 848697960 849424183 849827647 848262608 847298920 847977877 847530961
795.4H47530961j903176m84586O18339j026690j721263M7147J91629j813293j835525
$$ 847530961 845627785 845143199 845761538 844734848 843013585 843060732 843252361 841439068 839603543
813.8H39603543k00867q17955k433538j443923J9372j270175k535582j138091m08769
$$ 839603543 839402676 838584721 836151183 834707260 834726632 833456457 830920875 829782784 829374015
832.2H29374015k182722k755105j129747j131952k835452k523482j033187j823485
$$ 829374015 827191293 824436188 823306441 822174489 819339037 816815555 815782368 813958883
848.5H13958883l281414k323687j205683k453089l294349j890063j433790l007710
$$ 813958883 810677469 808353782 807148099 804695010 801400661 799510598 798076808 795069098
864.8G95069098l214180j753390k039015l650427l214419j778543k430200l493011
$$ 795069098 791854918 790101528 788062513 784412086 781197667 779419124 776988924 773495913
881.1G73495913k375901j382053k625704l396749k190233j927256l314495l305138
$$ 773495913 771120012 769737959 767112255 763715506 761525273 759598017 756283522 752978384
897.4G52978384j924097k162278l373265k846897j864135k789199l769875k819538
$$ 752978384 751054287 748892009 745518744 742671847 740807712 738018513 734248638 731429100
913.7G31429100k187133l355562l792763k618253k507151l733515l617108k438426
$$ 731429100 729241967 725886405 722093642 719475389 716968238 713234723 709617615 707179189
930.1G07179189k793551l894746l398538k553045l331483m112780l292441k756119
$$ 707179189 704385638 700490892 697092354 694539309 691207826 687095046 683802605 681046486
946.4F81046486l694773m035771l098488l104627m192769m105568l166795l483593
$$ 681046486 677351713 673315942 670217454 667112827 662920058 658814490 655647695 652164102
962.7F52164102m328609l873765l260970m050017m743755l847003l055036l834545
$$ 652164102 647835493 643961728 640700758 636650741 631906986 628059983 625004947 621170402
979F21170402m493416m099548m439830n802036o182849n047798l721774k768636j951277
$$ 621170402 616676986 612577438 608137608 602335572 596152723 591104925 587383151 584614515 582663238
997.4E82663238j953185l188669m126847l832638l727973m495144m751086m187405
$$ 582663238 580710053 577521384 573394537 569561899 565833926 561338782 556587696 552400291
1013.7E52400291m217386m861057m784405m252196m507005n056262m853427m626274
$$ 552400291 548182905 543321848 538537443 534285247 529778242 524721980 519868553 515242279
1030E15242279n142093n482197n093217m973411n499125n692571n383104n481363n903244
$$ 515242279 510100186 504617989 499524772 494551361 489052236 483359665 477976561 472495198 466591954
1048.4D66591954n777985n392670n588115n998104n942136n952359o509482o941468
$$ 466591954 460813969 455421299 449833184 443835080 437892944 431940585 425431103 418489635
1064.7D18489635o910890p159502p898241q395493q568138q952409r436190r594351
$$ 418489635 411578745 404419243 396521002 388125509 379557371 370604962 361168772 351574421
1081C51574421r725332j0372371j1348635j2082726j2286216j1716097j0365188q960486
$$ 351574421 341849089 331476718 320128083 308045357 295759141 284043044 273677856 264717370
1097.3B64717370p975042o932154n615711m701123m534185m578948m184186l316060
$$ 264717370 256742328 249810174 244194463 239493340 234959155 230380207 226196021 222879961
1113.6B22879961k413988j625523p38978J42395O80715J041174J797423L240376M857466
$$ 222879961 220465973 218840450 218101472 218243867 218924582 219965756 221763179 225003555 229861021
1132B29861021O095305P023141P653505P891804P870703P665754P154107O438732N851626
$$ 229861021 235956326 242979467 250632972 258524776 266395479 274061233 281215340 287654072 293505698
1150.3B93505698N450756N048871M725724M722238M925728N079657N274027N721599
$$ 293505698 298956454 304005325 308731049 313453287 318379015 323458672 328732699 334454298
1166.7C34454298O247401O631822P025242P451415P515162P122695O700963O273091
$$ 334454298 340701699 347333521 354358763 361810178 369325340 376448035 383148998 389422089
1183C89422089N455762M403114L590882L010988K549827K533675L136545L892541M348755
$$ 389422089 394877851 399280965 402871847 405882835 408432662 410966337 414102882 417995423 422344178
1201.3D22344178M634321M957139N144298N101621N159527N370051N301744M986644
$$ 422344178 426978499 431935638 437079936 442181557 447341084 452711135 458012879 462999523
1217.7D62999523M894107M918516M623175M208386M081130L934919L367722K819151
$$ 462999523 467893630 472812146 477435321 481643707 485724837 489659756 493027478 495846629
1234D95846629K686024K540469K165377K025664K208293K186655J940489J957417K134025
$$ 495846629 498532653 501073122 503238499 505264163 507472456 509659111 511599600 513557017 515691042
1252.3E15691042J965940J660228J722753J858055J645267J479149J666904J703441
$$ 515691042 517656982 519317210 521039963 522898018 524543285 526022434 527689338 529392779
1268.6E29392779J425385J391352J658558J673818J453281J515686J723409J560688
$$ 529392779 530818164 532209516 533868074 535541892 536995173 538510859 540234268 541794956
1285E41794956J299619J443446J594126J337052J148224J354873J423657J121640J030445
$$ 541794956 543094575 544538021 546132147 547469199 548617423 549972296 551395953 552517593 553548038
1303.3E53548038J239479J182079R29773J022875J243889J095474Q91924J104891J317144
$$ 553548038 554787517 555969596 556899369 557922244 559166133 560261607 561153531 562258422 563575566
1321.7E63575566J102865R62555J172304J190901Q97646Q83221J081169R33051P17998
$$ 563575566 564678431 565640986 566813290 568004191 568901837 569785058 570866227 571799278 572517276
1340E72517276R68039J228750R87768O72579P83145R61244Q14438P57337R61423Q99970
$$ 572517276 573485315 574714065 575701833 576374412 577157557 578118801 578933239 579690576 580651999 581551969
1360.4E81551969N89430O80447R46522P85947M78804M79877O72221N89371L05533J61588
$$ 581551969 582141399 582821846 583768368 584554315 585033119 585512996 586185217 586774588 587080121 587241709
1380.8E87241709K00570O07669J375437J863658J503885P40051M67718P66397Q27014
$$ 587241709 587442279 588049948 589425385 591289043 592792928 593532979 594000697 594767094 595594108
1399.2E95594108P00712P58350R00686Q19385O10650P06792Q49902N97417K70188M86076
$$ 595594108 596294820 597053170 597953856 598773241 599383891 600090683 600940585 601538002 601808190 602294266
1419.6F02294266P80463N70596N55277P64787O51836M95434N34356N61118O70612P86900
$$ 602294266 603074729 603645325 604200602 604965389 605617225 606112659 606647015 607208133 607878745 608665645
1440F08665645Q19326P60972M55439L30210O52432O99401K04265k62439L08693J040458
$$ 608665645 609484971 610245943 610701382 611031592 611684024 612383425 612587690 612325251 612633944 613674402
1460.4F13674402Q32319O41287Q96454Q94367M81368M09364P75218Q00729P26104Q42154
$$ 613674402 614506721 615148008 616044462 616938829 617420197 617829561 618604779 619405508 620131612 620973766
1480.8F20973766Q20994N04613K65241L72886O44446O95825N11646L97205M23193N10216
$$ 620973766 621794760 622299373 622564614 622937500 623581946 624277771 624789417 625186622 625609815 626120031
1501.2F26120031N35905P7963k47598O10471J103163Q17537K76745J41143L18051K67207
$$ 626120031 626655936 626733899 626486301 627096772 628199935 629017472 629294217 629435360 629753411 630020618
1521.6F30020618L68894O16848P45475N75424J22010J35958N77093K12073m73678Q8513
$$ 630020618 630389512 631006360 631751835 632327259 632449269 632585227 633162320 633374393 632900715 632989228
1542F32989228O58750M60923K58982K45750J59741r9123k66969n46157j99020N33878
$$ 632989228 633647978 634108901 634367883 634613633 634773374 634674251 634407282 633861125 633662105 634195983
1562.4F34195983N34535L31640j06871k60472J61409o8307o65068l14951M5955k58804
$$ 634195983 634730518 635062158 634955287 634694815 634856224 634787917 634122849 633807898 633853853 633595049
1582.8F33595049o22987o26266n33998p89404j114548j090169j015007j303852j649558
$$ 633595049 632972062 632345796 631811798 631022394 629907846 628817677 627802670 626498818 624849260
1601.1F24849260j702964j773417k033592k050757j697242j607180k189457k335132
$$ 624849260 623146296 621372879 619339287 617288530 615591288 613984108 611794651 609459519
1617.4F09459519j295149j025319j295805q54492m59016m33623k48790j32382m1902
$$ 609459519 608164370 607139051 605843246 604988754 604529738 604096115 603847325 603714943 603673041
1635.8F03673041N29349J118242J508058J591086J611888K207518K286017J775324
$$ 603673041 604202390 605320632 606828690 608419776 610031664 612239182 614525199 616300523
1652.1F16300523K179742K673924K337396J886547J746535K023041J898885J445532
$$ 616300523 618480265 621154189 623491585 625378132 627124667 629147708 631046593 632492125
1668.4F32492125J527727J752257J533270J372278J381635J232386Q35657R25899J565814
$$ 632492125 634019852 635772109 637305379 638677657 640059292 641291678 642127335 643053234 644619048
1686.8F44619048J540601J202524Q23497O01888O77943N20170O59049J094400Q65281
$$ 644619048 646159649 647362173 648185670 648787558 649465501 649985671 650644720 651739120 652604401
1705.1F52604401O16193O93977O88076L62933m0234J37091P61986P39515M02152M02749
$$ 652604401 653220594 653914571 654602647 654965580 654925346 655062437 655824423 656563938 656966090 657368839
1725.5F57368839L63230R7633j05977J728N24462N41985L00884L70383L19839J23143
$$ 657368839 657732069 657829702 657723725 657725453 658249915 658791900 659092784 659463167 659783006 659906149
1745.9F59906149J08004K19106L79741M14730L52859L56436J99795J39296L90827L18229
$$ 659906149 660014153 660233259 660613000 661027730 661380589 661737025 661936820 662076116 662466943 662785172
1766.3F62785172M1366J4424K16127M19438L51131K51889K80499K18749J29998K63691
$$ 662785172 662826538 662840962 663057089 663476527 663827658 664079547 664360046 664578795 664708793 664972484
1786.7F64972484K45810r9063o4731L73662L81052P4506M5836L02553K89023L1471
$$ 664972484 665218294 665119231 665054500 665428162 665809214 665883720 665929556 666232109 666521132 666552603
1807.1F66552603R120J99795K20835J00791J31309J94252M0173q7380J00255K14279
$$ 666552603 666561723 666761518 666982353 667083144 667214453 667408705 667448878 667361498 667461753 667676032
1827.5F67676032N6862J59443L46184J86264J3232R5845J03175m2975Q3626L25501
$$ 667676032 667732894 667892337 668238521 668424785 668438017 668533862 668637037 668594062 668677688 669003189
1847.9F69003189L03506P9394j4901J48832K05458N8233K3485J04725k4855j84059
$$ 669003189 669306695 669386089 669371188 669520020 669725478 669783711 669807196 669911921 669887066 669703007
1868.3F69703007R2089L79860K18749L696O9439J33038j6868p4804N8889P9155K5928
$$ 669703007 669795096 670174956 670393705 670397401 670466840 670599878 670583010 670508206 670567095 670646250 670672178
1890.7F70672178Q5473J48952P0870n8174N782J41680P1228m9115L9935J32025n484
$$ 670672178 670757651 670906603 670977473 670919299 670925081 671066761 671137989 671088874 671128809 671260834 671255350
1913.2F71255350j27375q34J38342L1233q94J36673O9261p9215K2352J63317P1346
$$ 671255350 671127975 671127141 671265483 671296716 671295822 671432495 671501756 671422541 671444893 671608210 671679556
1935.6F71679556l9398j5259k9564q4579j8179J23798J35065P867k0921N2750R597
$$ 671679556 671640158 671624899 671595335 671510756 671492577 671616375 671751440 671759307 671738386 671791136 671800733
1958.1F71800733q3447j0967Q3089j788m9353O5803P6712o3837p3671O8545R0301o556
$$ 671800733 671717286 671706319 671789408 671787620 671738267 671804070 671880782 671816945 671743274 671811819 671902120 671895564
1982.5F71895564j0789L1948m0710j11699J3650J54733P9811j2040L4630M3690l2782
$$ 671895564 671884775 671916723 671876013 671764314 671777964 671932697 672012508 672000468 672035098 672078788 672046006
2005F72046006k3961P4148P3850j1921l1292O020n4777k68519n81622n30720K50578
$$ 672046006 672022045 672096193 672170043 672158122 672126830 672132850 672078073 671809554 671227932 670697212 670947790
2027.4F70947790P87616N26845J98603O3181K9623Q8335J17600P1287N4121J05500
$$ 670947790 671735406 672262251 672460854 672524035 672553658 672641993 672759593 672830880 672885001 672990501
2047.8F72990501J03235L8088N7280J26242Q6904K384p15L2425J7583K0206R3102J09613
$$ 672990501 673093736 673131824 673189104 673315346 673402250 673404634 673403919 673436344 673453927 673474133 673567235 673676848
2072.3F73676848P928p9394j49726m28796r92954j678467k442777l444970m436612
$$ 673676848 673684776 673605382 673455656 673026860 672033906 670355439 667912662 664467692 660031080
2090.6F60031080m492283l120124j254618k04444j12474l37720n70416q32260r86874
$$ 660031080 655538797 652418673 651164055 650959611 650847137 650509417 649939001 649106741 648119867
2109F48119867p62344k8014R54747J650572J797140J617849J451850J321017J084686
$$ 648119867 647357523 647329509 648284256 649934828 651731968 653349817 654801667 656122684 657207370
2127.3F57207370Q58664P54953N80549K47598k4021o4671k4915l0279N8234K21610
$$ 657207370 658066034 658820987 659401536 659649134 659625113 659560442 659535527 659505248 659563482 659785092
2147.7F59785092K43306J63376K14577L47555L67284L62932M44114L94106O0678k77400
$$ 659785092 660028398 660191774 660406351 660753906 661121190 661484122 661928236 662322342 662383020 662105620
2168.1F62105620l74377m40419o14881o66440n66601n29051n13852l37064l0995K67089
$$ 662105620 661731243 661290824 660675943 660009503 659442902 658913851 658399999 658062935 658031940 658299029
2188.5F58299029O55472J216412J591146J481354J140118Q50319N28574J33753j27494
$$ 658299029 658954501 660170913 661762059 663243413 664383531 665233850 665762424 665896177 665768683
2206.9F65768683k75493n29349p46607o58751m38511m23134n30004m70936l21091k72989
$$ 665768683 665493190 664963841 664217234 663558483 663119972 662696838 662166834 661695898 661374807 661101818
2227.3F61101818k23875j26421j44482k26021j54674k1219r0182k68996k77161j96517
$$ 661101818 660877943 660751522 660607040 660381019 660226345 660205126 660114944 659845948 659568787 659372270
2247.7F59372270k14040j83940J6570J57773Q7440L7790J27077J51634O6042O6280
$$ 659372270 659158230 658974290 658990860 659148633 659236073 659273863 659400940 659552574 659618616 659684896
2268.1F59684896J64152J64508J06156J57595K10166J01388o5685j55210k35617l57986
$$ 659684896 659849048 660013556 660119712 660277307 660487473 660588861 660523176 660367966 660132349 659774363
2288.5F59774363m01795l47614l53217l73006k17497J6510R6083O9856J07944J37031
$$ 659774363 659372568 659024954 658671737 658298731 658081234 658097744 658193827 658263683 658371627 658508658
2308.9F58508658N4419p569L0160k6465j95920j81079M8518J49488L7373M4345K17259
$$ 658508658 658563077 658555508 658585668 658559203 658363283 658182204 658230722 658380210 658417583 658461928 658679187
2331.3F58679187J76966m6789j17481q2433n5552J95623O50823N10275k13921o29902
$$ 658679187 658856153 658809364 658691883 658609450 658553898 658749521 659400344 659910619 659696698 659066796
2351.7F59066796m44233k05279j78992J5735L34621M08411L51071M51744N57065N18203
$$ 659066796 658622563 658417284 658238292 658254027 658588648 658997059 659348130 659799874 660356939 660875142
2372.1F60875142M84347N50389N57482M23730L11434K67744J56880J2338q643K4378
$$ 660875142 661359489 661909878 662467360 662891090 663202524 663470268 663627148 663639486 663630843 663655221
2392.5F63655221l8981j04308m1127K4736m8578j12593l8088M709o2287p4029j1146
$$ 663655221 663616240 663511932 663470805 663495541 663446963 663334370 663296282 663300991 663238704 663164675 663153529
2414.9F63153529l3498j18672q9765o974l6418r6441o2644j8478o9975j21534o2466
$$ 663153529 663120031 663001359 662911594 662904620 662868202 662771761 662709117 662690639 662620664 662499130 662436664
2437.4F62436664n066m7624p8261m2737o0081j28329j11938m5836n6624r8348p4684
$$ 662436664 662431598 662383974 662305713 662262976 662202895 662074566 661962628 661916792 661860168 661761820 661687136
2459.8F61687136n2750r4116j06931n6088m2021q1420p8380k1935k6941j13308j34468
$$ 661687136 661634386 661540270 661433339 661377251 661335230 661253810 661175430 661153495 661126554 661013246 660878778
2482.2F60878778p7427q3089j18196o9797k7299q5652j32978p8201l8087j01269j32143
$$ 660878778 660801351 660718262 660600066 660530269 660502970 660417318 660284340 660206139 660168052 660066783 659934640
2504.7F59934640o0678l9398j04726j28209j00196q3625q4042q2195q1539j13070j33276
$$ 659934640 659873962 659834564 659729838 659601629 659501433 659417808 659333766 659251571 659170032 659056962 658923686
2527.1F58923686p5996l7194q8155j16706q1718p6830j23322j32203q8036p6831r8347
$$ 658923686 658847690 658810496 658722341 658605635 658523917 658447087 658323765 658191562 658103526 658026695 657928348
2549.5F57928348r4414q3447r5844j13308j20759j10150j00195r7513p3553o2584j04249
$$ 657928348 657833934 657750487 657654643 657541335 657420576 657310426 657210231 657112718 657039165 656976581 656872332
2572F56872332j35541j12831r9719j02162q9765q2016q8871j19686j31130j11878j14560
$$ 656872332 656736791 656623960 656524241 656422079 656332314 656250298 656161427 656041741 655910611 655798733 655684173
2594.4F55684173j22905r6917o8366r0480j32561j28031j06811j29342j49608j16527
$$ 655684173 655561268 655464351 655395985 655305505 655172944 655044913 654938102 654808760 654659152 654542625
2614.8F54542625q6069j03176j11043q5533q9765j28209j41442j29998j43230j55449
$$ 654542625 654456556 654353380 654242337 654156804 654067039 653938830 653797388 653667390 653524160 653368711
2635.2F53368711j16288o1393p3671j23501j17064j04010j51753j74523j13546q2553
$$ 653368711 653252423 653191030 653117359 652993858 652876794 652772784 652621031 652446508 652332962 652250409
2655.6F52250409j29104j34646j02878j31846j77264j41799o3956n4657j06812j34230
$$ 652250409 652121305 651986659 651883781 651751935 651574671 651432872 651368916 651314259 651207447 651073217
2676F51073217j27673j43587j68622j30951q5891j13785j45674j33693j38104j67727
$$ 651073217 650945544 650801957 650633335 650502384 650416493 650302708 650157034 650023341 649885237 649717510
2696.4F49717510j63913j23858j15753j36435j00672p5638j58668k03550j16348o6102
$$ 649717510 649553597 649429739 649313986 649177551 649076879 649001241 648842573 648639023 648522675 648456573
2716.8F48456573j43647j90973j34706j18316j80363j73450q5354p2360j31905j36316
$$ 648456573 648312926 648121953 647987247 647868931 647688568 647515118 647429764 647357404 647225499 647089183
2737.2F47089183j20759j70886j97232j11043n6148j33872j68920j04844j19507k06590
$$ 647089183 646968424 646797538 646600306 646489263 646433115 646299243 646130323 646025479 645905972 645699382
2757.6F45699382j74642p9691j17541j97708j58370r0122j19805j65582j40369j23858
$$ 645699382 645524740 645445049 645327508 645129800 644971430 644881308 644761503 644595921 644455552 644331694
2778F44331694j62542j70171j21296j20699j72258j59859j08481j46210k12133j84119
$$ 644331694 644169152 643998981 643877685 643756986 643584728 643424869 643316388 643170178 642958045 642773926
2798.4F42773926j68800k25008k11417j28985j26600k13683k53021j91868j58906k05755
$$ 642773926 642605126 642380118 642168701 642039716 641913116 641699433 641446412 641254544 641095638 640889883
2818.8F40889883k04980j58966j79171k16485j95205j85787k32041k29419j75535k41339
$$ 640889883 640684903 640525937 640346766 640130281 639935076 639749289 639517248 639287829 639112294 638870955
2839.1F38870955m06921m71533m47273m91202n56826m87984l19361j85311r9361l3796
$$ 638870955 638464034 637992501 637545228 637054026 636497200 636009216 635689855 635504544 635405183 635371387
2859.5F35371387l3140j05500j62363j55330j24812j18614j61647k39849k86937k66016
$$ 635371387 635338247 635232747 635070384 634915054 634790242 634671628 634509981 634270132 633983195 633717179
2879.9F33717179k01881j57773j95503k56479k49028k35141k58624k68519k71559k69651
$$ 633717179 633515298 633357525 633162022 632905543 632656515 632421374 632162750 631894231 631622672 631353021
2900.3F31353021k61367k44140k35677k64466k52962k26021l15964m79817n68212n19692
$$ 631353021 631091654 630847514 630611837 630347371 630094409 629868388 629552424 629072607 628504395 627984703
2920.7F27984703l97325k69771j04546O6638J08778O7950R6321J63972J79172J78516
$$ 627984703 627587378 627317607 627213061 627279699 627388477 627456427 627552748 627716720 627895892 628074408
2941.1F28074408J82986J31190p689j25647j07288j15931k38657k61307j61469j18256
$$ 628074408 628257394 628388584 628380895 628255248 628147960 628032029 627793372 627532065 627370596 627252340
2961.5F27252340j78694k54929k67506k37346k00689j69694j50859p0930M4525N0962
$$ 627252340 627073646 626818717 626551211 626313865 626113176 625943482 625792623 625721693 625766218 625817180
2981.9F25817180J9014O0141J07288J38223J02401l4809j13368j39952k07245j98365
$$ 625817180 625836194 625896335 626003623 626141846 626244247 626209438 626096070 625956118 625748873 625550508
3002.3F25550508j45792j42992r3639k2590o4015j87338k85923l28660l11971k51710
$$ 625550508 625404716 625261724 625168085 625145495 625081480 624894142 624608219 624279559 623967588 623715878
3022.7F23715878k47896l10183k85208j69873j33336k20179k90633k30193j53899k03311
$$ 623715878 623467982 623157799 622872591 622702718 622569382 622349203 622058570 621828377 621674478 621471167
3043.1F21471167l30210l86179l09169k64048l22700l52860l56435l62397l56614l30985
$$ 621471167 621140957 620754778 620445609 620181561 619858861 619506001 619149566 618787169 618430555 618099570
3063.5F18099570k65896k43187l02792l80694l98100k97487k02953k58387l54230l91066
$$ 618099570 617833674 617590487 617287695 616907001 616508901 616211414 616008461 615750074 615395844 615004778
3083.9F15004778m23193m24266m05192m47452m46856l53098l13223l61561m28260m35114
$$ 615004778 614581585 614157319 613752127 613304675 612857819 612504721 612191498 611829937 611401677 610966563
3104.3F10966563l35634k92897m14431m64260l26753k43068l47972n44488o80208o41108
$$ 610966563 610630929 610338032 609923601 609459341 609132588 608889520 608541548 607997060 607316852 606675744
3124.7F06675744m97937m23193m68493n24103m98176m32551m51743n91517o74963o24120
$$ 606675744 606177807 605754614 605286121 604762018 604263842 603831291 603379548 602788031 602113068 601488948
3145.1F01488948n45323m54903m14192n68509p63774p57695o61432o38545o57141o83725
$$ 601488948 600943625 600488722 600074530 599506021 598742247 597984552 597323120 596684575 596027434 595343709
3165.5E95343709p11620p15494p13229p29323p33852p05600p22647q01980q23140p95722
$$ 595343709 594632089 593916595 593203366 592474043 591740191 591034591 590311944 589509964 588686824 587891102
3185.9E87891102p95007q16941q52764q78930q99196r11355q82804q72970q98361q92699
$$ 587891102 587096095 586279154 585426390 584547460 583648264 582736909 581854105 580981135 580082774 579190075
3206.3E79190075q79705q73327q64208q80599r05573r06765q94189q77917q75533q98421
$$ 579190075 578310370 577437043 576572835 575692236 574786663 573879898 572985709 572107792 571232259 570333838
3226.7E70333838q88049p98047p63476r00924r89377r23157q83162q26597p16508p45773
$$ 570333838 569445789 568647742 567884266 566983342 565993965 565070808 564187646 563361049 562644541 561898768
3247.1E61898768q82268q78036p24971o64294p77900q33690p52509p18296p36594o54817
$$ 561898768 561016500 560138464 559413493 558749199 557971299 557137609 556385100 555666804 554930210 554275393
3267.5E54275393n51521o65665q57711q74519q23558q25703q50260q55863q73804q98421
$$ 554275393 553723872 553058207 552200496 551325977 550502419 549676716 548826456 547970593 547096789 546198368
3287.8E46198368q25465p47740q63075j043618j087785j055777r93490r03606r55165
$$ 546198368 545372903 544625163 543762088 542718470 541630685 540574908 539581418 538677812 537722647
3306.2E37722647j211822j441538j456142j340150j313210j394212j417101j362383
$$ 537722647 536510825 535069287 533613145 532272995 530959785 529565573 528148472 526786089
3322.5E26786089j369536j494944j577973j574874j617790j590967j447856j496136
$$ 526786089 525416553 523921609 522343636 520768762 519150972 517560005 516112149 514616013
3338.8E14616013j730085j832723j801372j731873j663506j760900j943409j954734
$$ 514616013 512885928 511053205 509251833 507519960 505856454 504095554 502152145 500197411
3355.2E00197411j823068j704604j729488j813441j700670j523256j640052j965821
$$ 500197411 498374343 496669739 494940251 493126810 491426140 489902884 488262832 486297011
3371.5D86297011k027154j761823j590401j612753j608670j522153j430303j304329
$$ 486297011 484269857 482508034 480917633 479304880 477696210 476174057 474743754 473439425
3387.8D73439425j121729j157523j434773j450896j112968r34243j194626j453072
$$ 473439425 472317696 471160173 469725400 468274504 467161536 466227293 465032667 463579595
3404.1D63579595j301289j063138j015365j033097j073540j079827r21160p47085p28190
$$ 463579595 462278306 461215168 460199803 459166706 458093166 457013339 456092179 455345094 454616904
3422.5D54616904p19785n86421m40329m40449m41968l36319l64065n36025n23120l03894
$$ 454616904 453897119 453310698 452870369 452429920 451987952 451651633 451287568 450751543 450228423 449924529
3442.9D49924529j00375M948m381j908Q4728J67698K65270L26097K63423K90394N50866
$$ 449924529 449824154 449829102 449824721 449822813 449907541 450075239 450340509 450666606 450930029 451220423 451771289
3465.3D51771289P26879N13732K15233K53498M65006N85347O28442O24507O32883O82383
$$ 451771289 452498168 453011900 453227133 453480631 453945637 454530984 455159426 455783933 456416816 457099199
3485.7D57099199O77884O55770O95855P89821Q92579Q60781P91907Q87841Q99851P09385
$$ 457099199 457777083 458432853 459128708 459918529 460811108 461671889 462463796 463351637 464251488 464960873
3506.1D64960873P33167J015663J166016J049668Q99613Q81850R42588J084179J156419
$$ 464960873 465694040 466709703 467875719 468925387 469825000 470706850 471649438 472733617 473890036
3524.4D73890036J093924J110107J148015J138062J220852J274824J163363J071573
$$ 473890036 474983960 476094067 477242082 478380144 479600996 480875820 482039183 483110756
3540.8D83110756J147151J350760J395911J175165J153022J352817J304180J198977
$$ 483110756 484257907 485608667 487004578 488179743 489332765 490685582 491989762 493188739
3557.1D93188739J313567J285076R47356J096636K016038K141178J365244J174450
$$ 493188739 494502306 495787382 496734738 497831374 499847412 501988590 503353834 504528284
3573.4E04528284J446545J566649J610160J507759J221001J396358K148509K076030
$$ 504528284 505974829 507541478 509151638 510659397 511880398 513276756 515425265 517501295
3589.7E17501295J306235J345098J789630J800358J739681J686215J311779J208067
$$ 517501295 518807530 520152628 521942258 523742616 525482297 527168512 528480291 529688358
3606E29688358J777888K012133J731634J508654J217186J734078K435148J520395K18511
$$ 529688358 531466246 533478379 535210013 536718667 537935853 539669931 542105079 543625474 543843985
3624.4E43843985K77400K388537L226041J366437P68244J053155J038670R86338N96940
$$ 543843985 544121385 546509922 549735963 551102400 551870644 552923799 553962469 554948807 555545747
3642.7E55545747m4942L75033K379179K770424N45680l993J195728J048029K53022
$$ 555545747 555500805 555875838 558255017 561025441 561571121 561567128 562762856 563810885 564063907
3661.1E64063907J4543l55005m13001P66278J003384j33216J043200J649976Q106m70936
$$ 564063907 564078450 563723445 563310444 564076722 565080106 564946890 565990090 567640066 567648172 567177236
3681.5E67177236n68628p43449L53217J747132J025915j79887m12345l71575q1480
$$ 567177236 566608608 565865159 566218376 567965508 568991423 568811536 568399191 568027616 567946136
3699.8E67946136N89371L64840o71923q18611K89023J477301O10173q17895q79943
$$ 567946136 568535507 568900347 568228424 567409813 567698836 569176137 569786310 568968415 568088472
3718.2E68088472l95477j62840o9499k2054o39975j119613l71218Q64208J281857l3378
$$ 568088472 567692995 567530155 567460656 567438602 566798627 565679014 565307796 566172004 567453861 567420483
3738.6E67420483j803339j025617J603365O64949p21454J177728J462340n30123r35734
$$ 567420483 565617144 564591527 566194892 566859841 566138387 567316115 568778455 568248332 567312598
3756.9E67312598Q4579K54333m68015m17114j06096K49028M86851j57952o49512k85387
$$ 567312598 567397177 567651510 567183495 566766381 566660285 566909313 567396164 567238212 566588700 566303313
3777.3E66303313L39091J17421l42787j16586m2022k38657m38153n76675l31044m74096
$$ 566303313 566642404 566759825 566417038 566300452 566258430 566019773 565581620 565004945 564673901 564199805
3797.7E64199805k62558R70602K04265m33981N44548j96636j456440r82999M05609
$$ 564199805 563937247 564907849 565112114 564678133 565222681 565026045 563569605 562586606 562992215
3816.1E62992215O6102P629J047135n5194q74281o18935m92811l03567m28915q762
$$ 562992215 563058317 563065946 564113081 564057887 563183606 562564671 562071860 561768293 561339378 561330616
3836.5E61330616R10402M82380j69813k59161q94487j875818j731813J439750L381670
$$ 561330616 562241018 562723398 562553585 562294424 561399937 559524119 557792306 559232056 562613726
3854.8E62613726l7492j845419j115620n6625J79708n37455j06275P26819J03832m21167
$$ 562613726 562576234 560730815 559615195 559558570 559738278 559200823 559094548 559821367 559925199 559504032
3875.2E59504032q45551n27323J32859j70767K49684R7751o22391J86503K09808r86099
$$ 559504032 558658481 558131158 558264017 558093250 558342934 558440685 557818294 558004797 558214605 557228506
3895.6E57228506r66669r0003M14491P07627M30226m07100o40154m48704m70578k03073
$$ 557228506 556261837 556171834 556586325 557293952 557724178 557317078 556676924 556228220 555757642 555554569
3916E55554569L05891J52230l37899l16560j78516l38137k24233J67072J26124k41340
$$ 555554569 555860460 556012690 555674791 555358231 555179715 554841578 554617345 554784417 554910541 554669201
3936.4E54669201m09901k91884R54l4452k74002j39952l9875j79291k35617k04504
$$ 554669201 554259300 553967416 553968370 553933918 553659916 553519964 553480089 553300798 553065181 552860677
3956.8E52860677j72615r4831n9426j84357k57015j72436j14620j25110j11401j25170
$$ 552860677 552688062 552593231 552533805 552349448 552092433 551919997 551805377 551680267 551568866 551443696
3977.2E51443696j85251k06351j58489j23263j47104j53720j67668j88112j98424k22862
$$ 551443696 551258445 551052094 550893605 550770342 550623238 550469518 550301850 550113738 549915314 549692452
3997.6E49692452
$$ 549692452
##END=$$ End of the data block
