##TITLE=$$ Begin of the data block
##JCAMP-DX=5.00 $$ ACD/SpecManager v 10.08
##SPECTROMETER/DATA SYSTEM=Alpha
##DATE=27 Jun 2014 15:13:00
##DATA TYPE=INFRARED SPECTRUM
##DATA CLASS=XYDATA
##ORIGIN=
##OWNER=
##NPOINTS=1667
##FIRSTX=599.63549805
##LASTX=3997.56909180
##MAXX=3997.56909180
##MINX=599.63549805
##MAXY=1.23604512
##MINY=0.19636306
##XFACTOR=1.0000000000
##YFACTOR=0.000000010000000
##FIRSTY=1.04476953
##DELTAX=2.03957605
##XUNITS=1/CM
##YUNITS=ARBITRARY UNITS
##XYDATA=(X++(Y..Y))
599.6A04476953o8605P0643J06895J41764J92129K01381K30133K64430J42467l8004
620A05720186k7931O8534Q8990N8233L8779K8265J1921K2363M1676L9816N2488J08122
644.5A06251442J57166R7668k9838o1250n5813j20914k10345l03674l45623P3516R61447
666.9A06413782L99482j155949q96835l38352k12002k70164l22413l41189l46255l44456
687.3A02585649l53598l71111l63636l75771m46737n48661o98346r50962j304966j608008
707.7I5563853j591218j244175r18412q00306o73062l51607J50394P61169J230771
726.1I2127407J342493J221836J114732J058858R87595R16201Q45033P54786O68108
744.4A01037049N84114N03468M68922M39775L36349K02501J39654J63769K24686K47991
$$ plain form
599.6 104476953 104408348 104478991 104585886 104727650 104919779 105121160 105351293 105615723 105758190 105720186
620 105720186 105692255 105760789 105849779 105908012 105946791 105975056 105986977 106009340 106051016 106090832 106143320 106251442
644.5 106251442 106408608 106506276 106476438 106415188 106359375 106238461 106028116 105724442 105378819 105452335 106413782
666.9 106413782 106813264 105657315 104760480 104422128 104210126 103939962 103617549 103276360 102930105 102585649
687.3 102585649 102232051 101860940 101497304 101121533 100674796 100126135 99427789 98476827 97171861 95563853
707.7 95563853 93972635 92728460 91810048 91009742 90336680 89985073 90135467 90896636 92127407
726.1 92127407 93469900 94691736 95806468 96865326 97852921 98769122 99614155 100368941 101037049
744.4 101037049 101621163 102124631 102593553 103033328 103369677 103572178 103711832 103875601 104100287 104348278
764.8A04348278J92392J37651J36495J61659J76001J56808J53649J81293J84274J51384
785.2A05979884J18649J13260J16957Q1849K0945o819o401l8112j20914j74188j33419
807.7A05951691p4149r7298j52409j40918r8729q7952m9138M7409Q2147n233j32430
830.1A05242991k13503k16842j57178q4161n6875p9668q4793l6323L5155R5141J12998
852.5A04556942Q2910L4261m864m3225r2244j35780j73914k17033k49970k34484j44911
875A03377688j3518P3480Q5819Q7774J15216J31022J02628K6500j19960l49486m59361
897.4A03057802k58565r835N1701M3571J6284n2965j06907r5009m1032k1970r0898
919.8A02492177k27236l23618k57742k8539K20418L00789J58048l3093p2300K5689
$$ plain form
764.8 104348278 104540670 104678321 104814816 104976475 105152476 105309284 105462933 105644226 105828500 105979884
785.2 105979884 106098533 106211793 106328750 106410599 106431544 106424725 106418324 106380212 106259298 106085110 105951691
807.7 105951691 105877542 105780244 105627835 105486917 105388188 105300236 105251098 105298507 105380654 105375421 105242991
830.1 105242991 105029488 104812646 104655468 104571307 104514432 104434764 104349971 104313648 104348803 104443944 104556942
852.5 104556942 104639852 104674113 104669249 104626024 104533780 104398000 104224086 104007053 103757083 103522599 103377688
875 103377688 103364170 103437650 103523469 103611243 103726459 103857481 103960109 103986609 103866649 103517163 103057802
897.4 103057802 102799237 102789402 102841103 102884674 102900958 102847993 102741086 102646077 102605045 102583075 102492177
919.8 102492177 102264941 101941323 101683581 101655042 101875460 102176249 102334297 102301204 102228904 102254593
940.2A02254593R6357P1335M733o3432j40917k26450k64156k21407j38641o1059l290
962.7A01307666J9634q428o6781j20926j82724k49255k20883o4849O4730P1943P1001
985.1A00621128J41704J97375J55938M9960k6226m5502p8189j60539k44582k90704
1005.5A00320363l23063k96652j11098P1818J1051j93912k94387k33281j55902j45531
1025.9I8649406j09255j2702M0168k8664k34318n80388r70942j059931n94741L4260
1046.3I5132893L31951L83722L89260L22521K00367J18566R6571R1112P1287K4462
1066.7I7162712m4781j31250k50625m16744o23644q44907j016152j082027j058996
1085I1693586j013493j000566j003915r67169q54915o37948l29066j4669K34330L76165
$$ plain form
940.2 102254593 102350950 102422285 102427018 102363586 102222669 101996219 101732063 101510656 101372015 101310956 101307666
962.7 101307666 101327300 101318872 101252091 101131165 100948441 100699186 100478303 100413454 100478184 100550127 100621128
985.1 100621128 100762832 100960207 101116145 101166105 101139879 101094377 101016188 100855649 100611067 100320363
1005.5 100320363 99997300 99700648 99589550 99661368 99672419 99478507 99184120 98950839 98794937 98649406
1025.9 98649406 98540151 98527449 98567617 98538953 98304635 97724247 96753305 95693374 95098633 95132893
1046.3 95132893 95464844 95848566 96237826 96560347 96760714 96879280 96975851 97066963 97138250 97162712
1066.7 97162712 97117931 96986681 96736056 96319312 95695668 94850761 93834609 92752582 91693586
1085 91693586 90680093 89679527 88675612 87708443 86853528 86215580 85886514 85871845 86106175 86482340
1105.4H6482340L50303J35594j69015l93617m16648j99539J93882N78904P39020N29409
1125.8H7830633o098n82081j021844j474178j967632k240473k148229j825691j485210
1144.2G5079197j250220j148754j147896j185179j190948j101351r00799o27691l47417
1162.6F6178942j10847P3838K20543L71784N98836R03625J170963J353520J493513
1180.9G2254717J552999J496524J373702J229108J075065R38892Q64673Q69143Q99887
1199.3H2554710Q71247P53707N83344M05056K59030J72275J28543J04416P3289l469
1219.7H5902148j26969k57045l46756l63040l21585k85900k82037k62308j65242J1533
1240.1H3502799K23124M24010N72300O41423O19555N26809M23509L63064L42566L17973
$$ plain form
1105.4 86482340 86832643 86968237 86799222 86405605 85988957 85789418 85983300 86562204 87301224 87830633
1125.8 87830633 87824535 87242454 86220610 84746432 82778800 80538327 78390098 76564407 75079197
1144.2 75079197 73828977 72680223 71532327 70347148 69156200 68054849 67154050 66526359 66178942
1162.6 66178942 66068095 66141933 66362476 66734260 67333096 68236721 69407684 70761204 72254717
1180.9 72254717 73807716 75304240 76677942 77907050 78982115 79921007 80785680 81654823 82554710
1199.3 82554710 83425957 84179664 84763008 85168064 85427094 85599369 85727912 85832328 85905617 85902148
1219.7 85902148 85775179 85518134 85171378 84808338 84486753 84200853 83918816 83656508 83491266 83502799
1240.1 83502799 83725923 84149933 84722233 85363656 85983211 86510020 86933529 87296593 87639159 87957132
1260.4H7957132K67851K18660K09409K44558K78806K67136K31100J94370J60152J95199
1280.8I0224373L55220N36806N79583M71920L19487K16031J74367J32752P4339P8523
1301.2I3163401J83266K96802L15171K76041K63107K44296J86365J25915R7418J35106
1321.6I5286888K16150K59179K40696J69616M3172r2906j83624k53880l41344l46696
1342I4997251k50316j91849j99783k10965j99407j83099j62685p6235N6196M1580j26416
1364.5I3494272j82616j40781j51562l85160r02325r91135j66065Q83925J415968J463681
1384.9I4338202J325828R70304O09619M60124L49355K82442L49492M80121O30600N74189
1405.3A00370276J50371l81267r02010j173192r06044l07930J91886L62152K74586
$$ plain form
1260.4 87957132 88224983 88443643 88653052 88897610 89176416 89443552 89674652 89869022 90029174 90224373
1280.8 90224373 90579593 91116399 91695982 92167902 92487389 92703420 92877787 93010539 93084878 93163401
1301.2 93163401 93346667 93643469 93958640 94234681 94497788 94742084 94928449 95054364 95151782 95286888
1321.6 95286888 95503038 95762217 96002913 96172529 96215701 96122795 95939171 95685291 95343947 94997251
1342 94997251 94746935 94555086 94355303 94144338 93944931 93761832 93599147 93522912 93579108 93620688 93494272
1364.5 93494272 93311656 93170875 93019313 92634153 91731828 90740693 90574628 91458553 92874521 94338202
1384.9 94338202 95664030 96634334 97243953 97704077 98053432 98335874 98685366 99165487 99796087 100370276
1405.3 100370276 100520647 100139380 99237370 98064178 97158134 96850204 97042090 97404242 97678828
1423.6I7678828q1444n38736r97156j263016j124365j118445j305902j104164q89701
1442H9255899q30996q25727j036119j366467j590061j578009j505828j328462q42589
1460.3G8351641o74743q21113P8827K670222N572838P258302N367947K569013J473308
1478.7A01846242J182485J020729Q78108Q39555O69646K25008K2900J38509L9208k49267
1499.1A06613123n7387M84490J000238P73632j81829k93231N018K41637K68245K15686
1519.5A09069622J12247j38926j96577j71792r7847R6762P2134q905L02660M51827
1539.9A09491205k00403n77127m75395k30122k5689Q6748K60329N30148N70345l30210
1560.3A09099829o08325k10190N6041J84631N6779l6168J43647P2098k36010j99175
$$ plain form
1423.6 97678828 97597384 97058648 96061492 94798476 93674111 92555666 91249764 90145600 89255899
1442 89255899 88424903 87599176 86563057 85196590 83606529 82028520 80522692 79194230 78351641
1460.3 78351641 77676898 76855785 76934612 79604834 85177672 92435974 97803921 100372934 101846242
1478.7 101846242 103028727 104049456 104927564 105767119 106436765 106661773 106684673 106823182 106862390 106613123
1499.1 106613123 106555736 107040226 108040464 108814096 108632267 108339036 108344054 108585691 108853936 109069622
1519.5 109069622 109181869 109042943 108846366 108674574 108576727 108673489 108745623 108736718 109039378 109491205
1539.9 109491205 109290802 108713675 108238280 108008158 107982469 108069217 108329546 108859694 109430039 109099829
1560.3 109099829 108491504 108281314 108337355 108521986 108578765 108542597 108686244 108758342 108522332 108323157
1580.7A08323157o3813m458K6083L5762J8990L970k3877p9895j01530r3687q5997m1747
1605.1A07912958L1697K9362o819P6830J81985j8513k09796o5184m9520j76465j88601
1627.6A07517934j61815L22K78366J53923m26007n29241l18718n8949N6827j63424
1648A06349218j28269J37222l59869p58374m07100q8334l7396j77634o3073J83415
1668.4A04649806J93346J57928K85816K09475R1684K19237L18897j56116o76739n97299
1688.8A04696035n18846l50952k31850l45970o18183j112747j146877j015032j175332
1707.1I8180246j109343q47358o66201q06290j697600k487838k472556k723390l242319
1725.5H2127351l639859m105974m657489o500435p263952n565745n155256m472342
$$ plain form
1580.7 108323157 108259344 108254886 108280969 108316731 108335721 108339691 108315814 108235919 108134389 108040702 107954705 107912958
1605.1 107912958 107944655 107974017 107967198 108044028 108226013 108207500 107997704 107932520 107883000 107706535 107517934
1627.6 107517934 107356119 107356441 107634807 107788730 107362723 106833482 106514764 106455815 106512642 106349218
1648 106349218 106220949 106358171 105998302 105239928 104832828 104744494 104707098 104529464 104466391 104649806
1668.4 104649806 104843152 105001080 105286896 105496371 105588055 105807292 106126189 105970073 105293334 104696035
1688.8 104696035 104177189 103826237 103594387 103248417 102630234 101517487 100370610 99355578 98180246
1707.1 98180246 97070903 96223545 95557344 94751054 93053454 90565616 88093060 85369670 82127351
1725.5 82127351 78487492 74381518 69724029 63223594 55959642 50393897 45238641 40766299
1741.8D0766299k616912o92305J410773L986684O338223P345599Q279211Q684325P657695
1760.1H1159592O558442M819113L290844K596617K036637J484608Q63040N40840N38326
1778.5A03888059N15866L89910L22163K82669L36742M23575K89118M5073O8450J90413
1798.9A06752038J56689M1568K8598J13619J58262J19126L7598M1867Q0156Q8906J19472
1821.3A07737899J73998J63972J22655Q6689n9760r0432J3303N3645O4599J58203J76191
1843.8A08600962j1468j09219o4767j5676M542J7679K5654K5487K1255O8712J57094
1866.2A08720255J23274p0095j49655o8474p844J0085J0848J2112K2554O0308Q4269
1888.6A08747637J9670k9409j2303j3744j7906N985J4615J9657L7456K8133k2792l1055
$$ plain form
1741.8 40766299 38149387 37457082 38867855 42854539 49192762 56538361 64817572 73501897 81159592
1760.1 81159592 87718034 92537147 95827991 98424608 100461245 101945853 102808893 103349733 103888059
1778.5 103888059 104403925 104793835 105115998 105398667 105735409 106158984 106448102 106493175 106561625 106752038
1798.9 106752038 106908727 106950295 106978893 107092512 107250774 107369900 107407498 107449365 107529521 107618427 107737899
1821.3 107737899 107911897 108075869 108198524 108285213 108225453 108135021 108148324 108201969 108266568 108424771 108600962
1843.8 108600962 108589494 108480275 108415508 108399832 108404374 108422053 108447707 108473194 108494449 108563161 108720255
1866.2 108720255 108843529 108773434 108623779 108555305 108547461 108557546 108568394 108580506 108603060 108663368 108747637
1888.6 108747637 108767307 108737898 108725595 108711851 108693945 108699930 108714545 108734202 108771658 108799791 108776999 108745944
1913.1A08745944M2320Q0108J8132k0087k9826o4945m9436j1432N376P558K444J3041
1937.6A08739197N4646P3254M244n4884m3845r716J3995J2803J514M626J2683J1397
1962.1A08819914K6882L7193k813l8064k1625L58N913M279R42m446m804N114K2006
1988.6A08850849L7276M995m3285l6680j0991q11M435K813j335m494j2196j1158L708
2015.1A08783126j741l5774l9089j0312l421q488q58Q154R799O759N138J1325J2350
2041.6A08736968M125O425J0800J2863J8811J4174M638N888J1051J6201J8191J1361
2066.1A08871496O413K527J693Q118J0693J1850J0586P903J5140K7561K9159J7571
2090.5A09020710L731P39O736J0276Q189O402J0383J3482J2160J1384J6201J7834R226
$$ plain form
1913.1 108745944 108788264 108868372 108886504 108866417 108836591 108771646 108722210 108710778 108716154 108723712 108726156 108739197
1937.6 108739197 108793843 108867097 108871341 108816457 108772612 108762896 108776891 108789694 108791208 108795834 108808517 108819914
1962.1 108819914 108846796 108883989 108881176 108843112 108821487 108821845 108827758 108832037 108832979 108828533 108823729 108828843 108850849
1988.6 108850849 108888125 108893120 108849835 108813155 108802164 108801353 108805788 108808601 108807266 108802772 108790576 108779418 108783126
2015.1 108783126 108781385 108745611 108706522 108696210 108692789 108684301 108683443 108691597 108701396 108708155 108713293 108724618 108736968
2041.6 108736968 108741093 108747518 108758318 108771181 108789992 108804166 108808804 108814692 108825743 108841944 108860135 108871496
2066.1 108871496 108877909 108880436 108882129 108890247 108900940 108912790 108923376 108931279 108946419 108973980 109003139 109020710
2090.5 109020710 109024441 109025180 109031916 109042192 109050381 109056783 109067166 109080648 109092808 109104192 109120393 109138227 109147453
2117.1A09147453J026K872P558Q464R024K671m566m470j646n00m363q655p582o806
2145.6A09140480o664l767l243m267q083m935M494M399M017J1027J6236J5855J2434
2172.1A09177983J1134J0502O998Q941J1444N281j073M112J2160P760n9N460J8250
2198.6A09278893J4163K610M077R585Q237L445L874N794P75j717K635K527J764K659
2227.2A09339321K789O342P415r78q630l457O330J3089J6057J2052Q750J1230J5366
2253.7A09425676K4497L2175L3772L1531K1636J4723J3160Q428R06o830j2779k8325
2278.2A09558570m9436l3068L3962J02330J32048J34492J42193J63602J80340J92511
2298.6A10557544K14470K55835L27861M12428M71509M68254M01211L90947N53429P70914
$$ plain form
2117.1 109147453 109148479 109151351 109158909 109167373 109176397 109179068 109174502 109170032 109168386 109167886 109163523 109154868 109147286 109140480
2145.6 109140480 109133816 109130049 109126806 109122539 109114456 109109521 109114015 109118414 109122431 109133458 109149694 109165549 109177983
2172.1 109177983 109189117 109199619 109206617 109215558 109227002 109232283 109231210 109235322 109247482 109255242 109255183 109260643 109278893
2198.6 109278893 109293056 109295666 109299743 109309328 109317565 109321010 109324884 109330678 109331453 109329736 109332371 109334898 109336662 109339321
2227.2 109339321 109342110 109348452 109355867 109354889 109346259 109342802 109349132 109362221 109378278 109390330 109399080 109410310 109425676
2253.7 109425676 109450173 109482348 109516120 109547651 109569287 109584010 109597170 109605598 109606504 109599674 109586895 109558570
2278.2 109558570 109509134 109476066 109510028 109612358 109744406 109878898 110021091 110184693 110365033 110557544
2298.6 110557544 110772014 111027849 111355710 111768138 112239647 112707901 113109112 113500059 114053488 114824402
2319A14824402Q19099O62470N09870N26083N79691M53889K44939K08247K80428K77328
2339.4A19386446J06276l95108j213896j254046j00338J292932K048754J890779J287997
2357.7A23049796N54716j35314p36380j206124j478219j600110j611591j510679j372326
2376.1A13953769j240384j098454r03285o38246l75569j83094p1633k6118r048l22
2396.5A09407616j359o020n567J359R131R394K777m65J133J967L314M816M625N186
2425A09437907K682n48k444o604k349N305N01j335L755l6N72J1408J3268K146o842
2455.6A09457386r275j1170q082r78M161M458K098P51l159q166p510l254m244j3018
2484.2A09399998j9407j4734q297q357q726n126n960j3829j2207k682j0335k7526k5391
$$ plain form
2319 114824402 115643501 116305971 116815841 117341924 117921615 118375504 118620443 118828690 119109118 119386446
2339.4 119386446 119492722 119097614 117883718 116629672 116529334 117822266 119871020 121761799 123049796
2357.7 123049796 123604512 123469198 122732818 121526694 120048475 118448365 116836774 115326095 113953769
2376.1 113953769 112713385 111614931 110711646 110073400 109697831 109514737 109443104 109416986 109407938 109407616
2396.5 109407616 109406257 109400237 109394670 109396029 109405160 109414554 109417331 109416866 109417999 109419966 109423280 109428096 109432721 109437907
2425 109437907 109440589 109440041 109437597 109430993 109428644 109433949 109434450 109433115 109436870 109436834 109437406 109448814 109462082 109464228 109457386
2455.6 109457386 109448111 109436941 109428859 109427881 109432042 109436500 109438598 109439349 109436190 109428024 109420514 109417260 109413016 109399998
2484.2 109399998 109380591 109365857 109357560 109349203 109340477 109335351 109329391 109315562 109303355 109300673 109290338 109262812 109237421
2510.7A09237421j0574r275k2733k9600k1445j2112p546o449j2172j3566p391n137
2535.2A09079421k671j895q524j0705l302L565P63p117j4830j3971k110o783k4557
2561.7A08987284k4760j3924j3637k7263l3284k0623j4543k5273l2210k8432k3221
2584.1A08730114k4331k6369k0898j2683r633j4114k0921l0160l4797k7275k1339k0468
2608.6A08467126j9670k1708k5296k9230l6311l8958l5333m3190n3096l7121j5808
2631A08111405j8143k5618k0564j1325j0931j7393k3556k8562k7895l4452n1045n7507
2655.5A07784414o0844p0715p4518o3598m4274l1305k8646k3222j4686j3662j5676
2677.9A07343268m458K4664M7541N0211M8530N0402N0366N0354N0604M4286L6359L2675
$$ plain form
2510.7 109237421 109226847 109217572 109194839 109165239 109143794 109131682 109124136 109117687 109105515 109091949 109084558 109079421
2535.2 109079421 109076750 109074855 109066331 109055626 109052324 109055889 109056652 109049535 109034705 109020734 109018624 109011841 108987284
2561.7 108987284 108962524 108948600 108934963 108907700 108874416 108853793 108839250 108813977 108781767 108753335 108730114
2584.1 108730114 108705783 108679414 108658516 108645833 108636200 108622086 108601165 108571005 108536208 108508933 108487594 108467126
2608.6 108467126 108447456 108425748 108400452 108371222 108334911 108295953 108260620 108217430 108164334 108127213 108111405
2631 108111405 108093262 108067644 108047080 108035755 108024824 108007431 107983875 107955313 107927418 107892966 107841921 107784414
2655.5 107784414 107723570 107652855 107578337 107514739 107470465 107439160 107410514 107387292 107372606 107358944 107343268
2677.9 107343268 107338810 107363474 107411015 107461226 107509756 107560158 107610524 107660878 107711482 107755768 107792127 107824802
2702.4A07824802K4629L088k0814l0816k5451j4341j7798l7777m8435n4157o9284n2631
2726.9A07481015m208K1863K9027L0911L0172L9565L9042J6880n472r394Q559K2650
2751.4A07700610P487j7965k6572k7323l6204m7838n0140n3549p5411j06168j26493
2773.8A07140434j23871j23345j53888j84297j96028k19417k43413k28632k07686k31838
2794.2A05228019k79606k97963k85483k91979l28314l69275m10783m51636m96543n57065
2814.6A01459372o35612p32136q41707r60868j092702j257134j464820j713574k042216
2832.9I0718603k539855l306145m393255n769331p178205q101177q105594p079244
2849.3D4245797n080291k337101O10369L136256M804650N468733N208140M206735K860576
$$ plain form
2702.4 107824802 107849431 107852519 107831705 107800889 107775438 107761097 107743299 107705522 107657087 107602930 107533646 107481015
2726.9 107481015 107476807 107498670 107527697 107558608 107588780 107628345 107667387 107684267 107678795 107669401 107677960 107700610
2751.4 107700610 107708097 107690132 107663560 107636237 107600033 107552195 107502055 107448506 107373095 107266927 107140434
2773.8 107140434 107016563 106893218 106739330 106555033 106359005 106139588 105896175 105667543 105459857 105228019
2794.2 105228019 104948413 104650450 104364967 104072988 103744674 103375399 102964616 102512980 102016437 101459372
2814.6 101459372 100823760 100091624 99249917 98289049 97196347 95939213 94474393 92760819 90718603
2832.9 90718603 88178748 84872603 80479348 74710017 67531812 59430635 51325041 44245797
2849.3 44245797 39165506 36828405 37438774 40575030 45379680 50848413 56056553 60263288 63123864
2867.6F3123864J846391J670098K073950K292883J878029R83531J722q29494j456636
2886G1584338j898307k178961k326309k381230k391183k420819k501458k619702k786064
2904.3E0080305l018772l308329l623829l906530m067829l978646l521156k714528
2920.6B1940686j687753o16627L64193J200520J883173K530844L209961L788143M129202
2939C6742342M187789L916851L282854K349785J340401N94115L37988O07568J268006
2957.4E4627699K064520K827352L486788L956724M140079M016989L679991L240418
2973.7H2040560K778089K351749J976776J659280J406074J184964R63783P19041M28492
2992I5508808P3832l70395q66985j332814j666796j713860j356679o14012L59768J327634
$$ plain form
2867.6 63123864 64970255 66640353 68714303 71007186 72885215 73868746 73870468 73040974 71584338
2886 71584338 69686031 67507070 65180761 62799531 60408348 57987529 55486071 52866369 50080305
2904.3 50080305 47061533 43753204 40129375 36222845 32155016 28176370 24655214 21940686
2920.6 21940686 20252933 19636306 20000499 21201019 23084192 25615036 28824997 32613140 36742342
2939 36742342 40930131 44846982 48129836 50479621 51820022 52414137 52752125 53359693 54627699
2957.4 54627699 56692219 59519571 63006359 66963083 71103162 75120151 78800142 82040560
2973.7 82040560 84818649 87170398 89147174 90806454 92212528 93397492 94361275 95080316 95508808
2992 95508808 95582640 95212245 94345260 93012446 91345650 89631790 88275111 87661099 88020867 89348501
3012.4H9348501K068162K456623K481562K240569J858341J448465J110363Q50808O39248
3030.8A04502642M70567L58236K92861K16186J39833J24097J52003J66273J47665J32155
3051.2A06702518J37413J31953J12343R0980O8116N2238M6682O9988J22488J51431
3071.6A07686150J23942P0131M8470O6936P7820P0155P5543P7498N9676N9771O2788
3094A08478880L4666J311l898P367o795m0614l1400K9898N2011J1921M05L5846P5650
3120.5A08645248R7156P6520K4403m18K6262M2629M471m6194m1532K0074N3192L7741
3145A08939552J8013j1039l0231Q94M8816N4729K7203R787J9098L1721J8585r54M18
3171.5A09126592J6844K6035O819j3053k63J3972P665O67P236J5128J2350R918J1301
$$ plain form
3012.4 89348501 91416663 93873286 96354848 98595417 100453758 101902223 103012586 103863394 104502642
3030.8 104502642 104973209 105331445 105624306 105840492 105980325 106104422 106256425 106422698 106570363 106702518
3051.2 106702518 106839931 106971884 107084227 107175207 107243323 107295561 107342243 107412231 107534719 107686150
3071.6 107686150 107810092 107880223 107928693 107995629 108073449 108143604 108219147 108296645 108356321 108416092 108478880
3094 108478880 108513546 108514857 108510959 108518326 108511531 108470917 108439517 108469415 108521426 108533347 108533752 108569598 108645248
3120.5 108645248 108742404 108818924 108843327 108842909 108869171 108911800 108916271 108870077 108828545 108848619 108901811 108939552
3145 108939552 108957565 108946526 108916295 108917189 108966005 109020734 109047937 109057724 109076822 109108543 109127128 109126174 109126592
3171.5 109126592 109143436 109169471 109176290 109163237 109162974 109176946 109184611 109185278 109192514 109207642 109219992 109229910 109241211
3198A09241211J0634J3769J7798J6450J7238J2755K647J2278K6966J7249Q106J5951
3222.5A09413052J8119O545j1301l5250m1592L552N3609M9185J4651k0182n1212l2056
3247A09367120L4225M8638K384k0182L826K2090R119j5008l6192m3380m1092j8716
3271.4A09312832J5390K9290L2341J6916j0240j1110P15j0884m4465n4931k4271J2195
3295.9A09263778L1566J9575l3153p8892n1809K4855P4924O5100K5749J2648J4663
3318.4A09369004j526k5487l7408j7536J4270J9061O223k1636o5983n8532n102J3042
3342.8A09188390J1134l088l1459q178L7754L2842l58l3271l8671j7453l8588p4887
3367.3A09024167l8910L9244O4587L6729L2329M6814L9661K2781J561m3320p7713m1604
$$ plain form
3198 109241211 109251845 109265614 109283412 109299862 109317100 109329855 109332502 109344780 109371746 109388995 109397101 109413052
3222.5 109413052 109431171 109437716 109426415 109391165 109349573 109353125 109406734 109455919 109470570 109450388 109399176 109367120
3247 109367120 109401345 109449983 109452367 109432185 109436011 109458101 109467220 109452212 109416020 109372640 109331548 109312832
3271.4 109312832 109328222 109357512 109389853 109406769 109396529 109385419 109386134 109375250 109330785 109275854 109251583 109263778
3295.9 109263778 109295344 109314919 109281766 109202874 109151065 109175920 109250844 109315944 109341693 109354341 109369004
3318.4 109369004 109367478 109341991 109304583 109287047 109301317 109320378 109326601 109304965 109238982 109180450 109175348 109188390
3342.8 109188390 109199524 109196436 109164977 109156799 109194553 109227395 109227037 109193766 109155095 109137642 109099054 109024167
3367.3 109024167 108985257 109024501 109089088 109125817 109158146 109204960 109244621 109267402 109268963 109225643 109147930 109106326
3391.8A09106326J7572J5151m8280p7724Q82Q6355N7590k2447m7505k2423J6117L8064
3416.3A09119678J8596n662j9932n4646q7499q7571o4648o2298p6008k3616P2742Q9407
3440.7A08818543K6011k3663n0556p2813o7079n5027o3086q6021r3103m7529n6457
3463.2A08229220j75774k02692k1326J80769J97279P5317m7696k9707J29008J44589
3483.6A08478987J9813J6010O1369K0575l3355n1939k6059J084k2184J5759Q9741N1284
3508A08621085p7164j79625j32024j2827J4865k8455o7270m3023K7752K8336k6929
3530.5A08124721m4835l9589j8477K3233N3943Q4424J11115R6523P1109Q7023R9444
3552.9A08648634P5507P6759J00970J31750K16854K97439J63472j07694j24526K5213
$$ plain form
3391.8 109106326 109123898 109139049 109090769 109013045 109013927 109100282 109157872 109135425 109087920 109065497 109081614 109119678
3416.3 109119678 109138274 109132612 109112680 109058034 108970535 108882964 108818316 108756018 108680010 108656394 108729136 108818543
3440.7 108818543 108844554 108820891 108770335 108697522 108630443 108575416 108512330 108426309 108333206 108285677 108229220
3463.2 108229220 108053446 107850754 107829428 108010197 108207476 108282793 108235097 108205390 108334398 108478987
3483.6 108478987 108498800 108514810 108576179 108596754 108563399 108511460 108485401 108486485 108464301 108480060 108569801 108621085
3508 108621085 108543921 108364296 108232272 108219445 108234310 108205855 108138585 108095562 108123314 108151650 108124721
3530.5 108124721 108079886 108040297 108021820 108045053 108098996 108183420 108294535 108391058 108462167 108549190 108648634
3552.9 108648634 108724141 108800900 108901870 109033620 109250474 109547913 109711385 109603691 109479165 109504378
3573.3A09504378R2065Q1241O3932N9664J24789K34353J77265m7517r2268p677o557
3595.7A10183668j4329L3426N0796Q9430J82653J70195O3324N5540R0217J34575J46199
3618.2A11185694j9002j06442O7818L06821K85601j49679l39579k18535j16443p1431
3638.6A10824823l8313M6551K27725M11141K46632k58362l35014j10745q5938j72508
3659A10755992r3067L6550J44768K88677L17430J22941J04630J19972j97363l19230
3679.4A11281300j86956k7442J60777L05605K15566p6806k00641j09125M9401J67489
3699.8A11579168J17194n1140k1136J78504K19071j06228l65674j81246J07026K37036
3720.1A11712575K16234J28126N972l5512J07229K59876J23751k62606l78943r9551
$$ plain form
3573.3 109504378 109596443 109677684 109741616 109801280 109926069 110160422 110337687 110290170 110197902 110190225 110183668
3595.7 110183668 110169339 110202765 110253561 110342991 110525644 110695839 110759163 110814703 110904920 111039495 111185694
3618.2 111185694 111166692 111060250 111128068 111434889 111720490 111570811 111231232 111012697 110896254 110824823
3638.6 110824823 110786510 110833061 111060786 111471927 111718559 111460197 111125183 111014438 110928500 110755992
3659 110755992 110662925 110699475 110844243 111132920 111450350 111573291 111677921 111797893 111600530 111281300
3679.4 111281300 111094344 111066902 111227679 111533284 111748850 111672044 111471403 111362278 111411679 111579168
3699.8 111579168 111696362 111645222 111624086 111802590 112021661 111915433 111549759 111368513 111475539 111712575
3720.1 111712575 111928809 112056935 112062907 112027395 112134624 112394500 112518251 112255645 111876702 111777151
3740.5A11777151K17616J87957n4132N400l0685l21567k97046p5626j6880j06358p7713
3763A11208117L0720N9152R775j08647j47212k5499R9910P6079m0352n4181m4250q2779
3787.5A10980833n7853K7514J22475J78397J76299J91509P2968j34396j18935j34337
3807.8A11304474j79410k5332J81711K28417J53553R9778j16956k48635j30844l3402
3828.2A11233354M8303J10686J17111J44327Q2791j13428k29287k35641j14083J53708
3848.6A11197841M33505M00007j95516m41968j92595N9295J54758O5982J3912N0997
3869A11546218m1282j54912j49644k7966J16849N9438m6993n8424p4280o234J9610
3891.5A11182380p7439l0648J56986K32840J06382j03330k63143k60150j42229j8060
$$ plain form
3740.5 111777151 111994767 112182724 112128592 112133992 112103307 111781740 111484694 111409068 111392188 111285830 111208117
3763 111208117 111238837 111297989 111307764 111199117 111051905 111026406 111126316 111202395 111162043 111107862 111063612 110980833
3787.5 110980833 110922980 110950494 111072969 111251366 111427665 111619174 111692142 111557746 111438811 111304474
3807.8 111304474 111125064 111099732 111281443 111509860 111663413 111763191 111646235 111397600 111266756 111233354
3828.2 111233354 111281657 111392343 111509454 111653781 111736572 111623144 111393857 111158216 111044133 111197841
3848.6 111197841 111631346 112031353 111835837 111393869 111201274 111260569 111415327 111481309 111495221 111546218
3869 111546218 111504936 111350024 111200380 111172414 111289263 111348701 111301708 111243284 111169004 111162770 111182380
3891.5 111182380 111104941 111074293 111231279 111464119 111570501 111467171 111204028 110943878 110801649 110783589
3911.9A10783589Q2016J16372M8912j9753j6439j3912l1984n853K9349k1720j00076
3934.3A10850501q1909j287N6302M3965o628p451O223j9121m1425l4595j7500j0633
3958.8A10736442p201L70J538j7178l1889k1374p474K729O760L171J263m160j3554
3985.3A10649443N018K9338k51l3378l1388k9993
3997.5A10588789
$$ plain form
3911.9 110783589 110865605 110981977 111030889 111011136 110994697 110980785 110948801 110942948 110972297 110950577 110850501
3934.3 110850501 110768592 110767305 110823607 110867572 110860944 110853493 110859716 110840595 110799170 110764575 110747075 110736442
3958.8 110736442 110729241 110729611 110731149 110713971 110682082 110660708 110653234 110655963 110662723 110665894 110667157 110662997 110649443
3985.3 110649443 110654461 110683799 110683548 110650170 110618782 110588789
3997.5 110588789
##END=$$ End of the data block
