##TITLE=$$ Begin of the data block
##JCAMP-DX=5.00 $$ ACD/SpecManager v 10.08
##SPECTROMETER/DATA SYSTEM=Alpha
##DATE=27 Jun 2014 15:13:00
##DATA TYPE=INFRARED SPECTRUM
##DATA CLASS=XYDATA
##ORIGIN=
##OWNER=
##NPOINTS=1667
##FIRSTX=599.63549805
##LASTX=3997.56909180
##MAXX=3997.56909180
##MINX=599.63549805
##MAXY=1.23244476
##MINY=0.19959249
##XFACTOR=1.0000000000
##YFACTOR=0.000000010000000
##FIRSTY=1.04544151
##DELTAX=2.03957605
##XUNITS=1/CM
##YUNITS=ARBITRARY UNITS
##XYDATA=(X++(Y..Y))
599.6 104544151 104498029 104563999 104673195 104838037 105027092 105205882 105418968 105672538 105826902 105809951
620 105809951 105772269 105808175 105873954 105920815 105954015 105996192 106024086 106024826 106042397 106092787 106164408 106280148
644.5 106280148 106431937 106523955 106501281 106446767 106386387 106267452 106066906 105767858 105419362 105486870 106447172
666.9 106447172 106836772 105662370 104755580 104423690 104230940 103985715 103696895 103372097 103007257 102637708
687.3 102637708 102279258 101916718 101558352 101185906 100752342 100221121 99530894 98578691 97272247 95664072
707.7 95664072 94056982 92790288 91880035 91115475 90465170 90105796 90241021 91000074 92225742
726.1 92225742 93555862 94776803 95884037 96929908 97938812 98883361 99716312 100441539 101098990
744.4 101098990 101697481 102216733 102679491 103110778 103451848 103661096 103797257 103948283 104165280 104415870
764.8 104415870 104616606 104756057 104882503 105032003 105209315 105388236 105554581 105706799 105855858 106017470
785.2 106017470 106166089 106281066 106386173 106469393 106500411 106502223 106489301 106438959 106321359 106149375 106010890
807.7 106010890 105934703 105825770 105665529 105541062 105457640 105379748 105349171 105399311 105459976 105438817 105305994
830.1 105305994 105093205 104875779 104711258 104605711 104537010 104475653 104410648 104373825 104407132 104502523 104611373
852.5 104611373 104694641 104739332 104747152 104709005 104613280 104475367 104300380 104079783 103831577 103596926 103446937
875 103446937 103429842 103499985 103588295 103685248 103803253 103932643 104035330 104051030 103917372 103563976 103103447
897.4 103103447 102846241 102841485 102901721 102954412 102969337 102908468 102802086 102707398 102650011 102607000 102516067
919.8 102516067 102305937 101992524 101734531 101701319 101914132 102214611 102388525 102374363 102301395 102304637 102386785
942.3 102386785 102469563 102485037 102412617 102259552 102037108 101786518 101571202 101434815 101378345 101375008 101390159
964.7 101390159 101376987 101305854 101185846 101009035 100761068 100535476 100465763 100524962 100596082 100680518 100836980
987.2 100836980 101030231 101173127 101221478 101199961 101151192 101065016 100907075 100678706 100400555 100075543
1007.5 100075543 99775904 99666113 99729514 99725002 99522531 99230635 99008608 98869050 98735261 98619217
1027.9 98619217 98592782 98633254 98613220 98384947 97807783 96841538 95786786 95195436 95235890 95570940
1048.3 95570940 95949847 96341681 96675670 96881801 96997941 97082692 97156942 97221887 97253919 97219872 97097617
1070.8 97097617 96852469 96435988 95811802 94964987 93945187 92864788 91812950 90803957 89804649
1089.1 89804649 88803810 87836468 86973363 86330342 86010414 86011767 86257356 86639571 86991894 87125212
1109.5 87125212 86955786 86560947 86132318 85916543 86104751 86689311 87432283 87961566 87959665 87388849
1129.9 87388849 86381704 84920716 82957381 80708605 78554785 76737189 75262803 74019176
1146.2 74019176 72878438 71737957 70555151 69369572 68279368 67384708 66751003 66393220 66275477
1164.6 66275477 66346109 66566795 66939276 67539060 68445373 69612980 70953482 72435528 73981565
1182.9 73981565 75468236 76830870 78056002 79135281 80081630 80950850 81812549 82697815 83562768
1201.3 83562768 84318119 84902287 85309327 85571796 85738480 85857886 85963774 86042732 86040068 85911328
1221.7 85911328 85654062 85312730 84958994 84644085 84360898 84079057 83816189 83649242 83659643 83882934
1242.1 83882934 84300047 84860474 85495937 86117661 86649418 87069386 87421423 87757230 88073331 88342017
1262.5 88342017 88561857 88768810 89011526 89287400 89545882 89770204 89962381 90122026 90319377 90675479
1282.9 90675479 91209781 91787750 92258495 92576092 92791766 92966825 93098325 93171549 93252289 93436348
1303.3 93436348 93730628 94044322 94321483 94585943 94829792 95013183 95134568 95227170 95357889 95573360
1323.7 95573360 95832282 96068561 96233308 96273744 96182281 96000916 95741248 95395285 95056295 94813442
1344.1 94813442 94621676 94421923 94214761 94018060 93830794 93659925 93579012 93635827 93679261 93553990
1364.5 93553990 93372303 93232799 93085879 92711902 91818374 90822375 90647823 91525435 92934448 94396251
1384.9 94396251 95720661 96679217 97276515 97730428 98075897 98355466 98700184 99175954 99803948 100372374
1405.3 100372374 100519538 100144231 99251962 98088884 97194511 96896303 97090733 97445536 97710961
1423.6 97710961 97628254 97092646 96099979 94846803 93732738 92619747 91318101 90221864 89341336
1442 89341336 88515979 87693542 86663264 85306430 83726144 82153809 80651867 79333133 78502297
1460.3 78502297 77834606 77014160 77086121 79741985 85294199 92526120 97864777 100411189 101873517
1478.7 101873517 103052616 104074728 104956245 105797040 106463349 106679809 106691933 106825149 106867397 106620085
1499.1 106620085 106562197 107047868 108049297 108817804 108628786 108333564 108339405 108582711 108848917 109060740
1519.5 109060740 109174240 109036589 108838892 108670294 108576691 108674109 108746696 108735955 109032083 109481788
1539.9 109481788 109289598 108714974 108237779 108010936 107991087 108079004 108333659 108856380 109426928 109105134
1560.3 109105134 108500397 108294845 108359194 108546305 108599436 108565676 108716762 108787632 108543408 108342493
1580.7 108342493 108281112 108277917 108306050 108347046 108369946 108371019 108341169 108261347 108162069 108067286 107982183 107941878
1605.1 107941878 107975125 108009565 108006179 108083272 108266544 108250988 108043158 107981670 107937777 107763004 107576799
1627.6 107576799 107417285 107412589 107685924 107840657 107414997 106886673 106572783 106523132 106593204 106435311
1648 106435311 106302893 106440759 106083763 105322492 104913330 104824257 104792142 104621637 104558802 104740691
1668.4 104740691 104929209 105080998 105366099 105573761 105664229 105891049 106223726 106075358 105396509 104801011
1688.8 104801011 104283309 103925717 103691959 103355289 102743936 101629102 100483835 99474460 98298174
1707.1 98298174 97188532 96348673 95690870 94885373 93184847 90705770 88248557 85535574 82299989
1725.5 82299989 78673005 74587470 69950378 63471526 56233686 50694537 45564690 41111436
1741.8 41111436 38505512 37816641 39225534 43198353 49499598 56803769 65049040 73703909 81337059
1760.1 81337059 87867063 92656559 95932001 98525304 100562954 102052402 102917910 103455234 103987992
1778.5 103987992 104499388 104887152 105211508 105499542 105836594 106252122 106531894 106577873 106650448 106834984
1798.9 106834984 106986749 107038224 107077253 107192874 107350814 107466745 107498598 107539487 107620239 107706177 107828391
1821.3 107828391 108011103 108176243 108293664 108377993 108320177 108231068 108239710 108286059 108347511 108509326 108694172
1843.8 108694172 108686161 108572245 108500183 108479190 108485377 108509076 108534896 108553290 108570099 108640170 108800662
1866.2 108800662 108926404 108853626 108694923 108618760 108614886 108635688 108652139 108664632 108686590 108746159 108827102
1888.6 108827102 108841503 108813691 108808446 108796525 108775330 108776796 108785057 108797300 108831739 108866715 108853853 108824742
1913.1 108824742 108862448 108936667 108949614 108929932 108906698 108847165 108799958 108791113 108799338 108807349 108805060 108809888
1937.6 108809888 108858871 108931637 108937669 108884168 108841264 108829057 108837104 108849990 108857954 108865416 108879077 108894539
1962.1 108894539 108923030 108956444 108951855 108917296 108895802 108887494 108886409 108894575 108903706 108905268 108900511 108900440 108915007
1988.6 108915007 108942842 108945787 108908832 108874238 108859420 108853924 108854997 108857143 108854520 108844030 108826661 108815444
2013 108815444 108822334 108826745 108798051 108759630 108740258 108730853 108730793 108737195 108740008 108746290 108757925 108768463 108780992 108794796
2041.6 108794796 108804703 108816040 108826172 108832693 108844364 108853269 108854449 108862162 108879006 108901000 108921087 108924389 108919930
2068.1 108919930 108918762 108917511 108924639 108942163 108960640 108972847 108977199 108986127 109008360 109034562 109053516 109056723 109052157
2094.6 109052157 109054816 109063900 109078467 109093249 109101021 109109676 109123456 109137213 109152520 109163618 109163463 109161937 109169137
2121.1 109169137 109179187 109186149 109197223 109205556 109198809 109186625 109184086 109188902 109189498 109182847 109175634 109168100 109156728
2147.7 109156728 109148359 109144008 109136438 109130025 109137404 109150791 109154379 109153843 109159184 109167624 109176779 109187102 109194243 109198713
2176.2 109198713 109205043 109215128 109227335 109233367 109228766 109225142 109231567 109243155 109252453 109260321 109274936 109288967 109292495
2202.7 109292495 109292424 109297836 109309459 109319472 109322774 109326291 109330046 109329939 109333181 109339893 109343553 109341371 109338748 109344101
2231.3 109344101 109349632 109342623 109329093 109326327 109334123 109343958 109360385 109376585 109384680 109395540 109411037 109432256 109460890
2257.8 109460890 109489751 109511960 109526074 109542656 109564304 109580326 109582925 109570277 109549761 109522712 109479737 109443843
2282.3 109443843 109465647 109553981 109680617 109824240 109973776 110131717 110306382 110496950 110705805 110955894
2302.7 110955894 111282754 111695862 112162602 112622643 113019145 113404095 113941824 114687085 115482676 116135335
2323.1 116135335 116643214 117159164 117717731 118155587 118394983 118597651 118875527 119157219 119264162 118879497
2343.5 118879497 117690039 116443276 116324580 117589593 119621754 121491432 122728944 123244476 123121822
2361.8 123121822 122436035 121281135 119828725 118244505 116667140 115192926 113837838 112599874
2378.1 112599874 111508417 110622501 109997940 109631312 109453416 109383094 109365451 109368634 109370887 109361947 109346104
2400.6 109346104 109335184 109337485 109353232 109372687 109380996 109377408 109374428 109375739 109378374 109383810 109390974 109396374 109401250
2427.1 109401250 109409332 109419179 109422469 109417057 109412658 109415936 109421468 109420788 109416759 109420836 109432113 109440947 109443355 109437633
2455.6 109437633 109427214 109420419 109421027 109423745 109420872 109416080 109415293 109416974 109418070 109413671 109401882 109392715 109392381 109384751
2484.2 109384751 109365785 109354782 109354031 109352183 109345186 109338093 109332764 109316409 109292364 109281683 109274256 109252608 109229422
2510.7 109229422 109217560 109211159 109193659 109166217 109147203 109135437 109123349 109113455 109102428 109090507 109085250 109086668
2535.2 109086668 109087873 109083915 109075832 109068155 109066427 109073126 109077907 109069169 109050548 109032297 109023416 109018743 109004247
2561.7 109004247 108982861 108964860 108951461 108935404 108911347 108884346 108859003 108835781 108812201 108780742 108747458
2584.1 108747458 108724296 108707619 108691299 108675456 108660603 108642852 108621299 108600509 108583164 108565629 108540726
2606.6 108540726 108509183 108478606 108455908 108435822 108408511 108376026 108341622 108302963 108254802 108205795 108175004
2629 108175004 108156884 108135617 108110213 108091784 108088183 108083665 108067358 108045006 108018470 107989252 107952988 107907760
2653.5 107907760 107856846 107795787 107723773 107647574 107577240 107522321 107482922 107453752 107437909 107436597 107432413 107419086
2677.9 107419086 107419372 107443500 107479858 107524681 107575309 107622778 107668042 107714808 107760727 107807827 107855260 107889628
2702.4 107889628 107901883 107898843 107887912 107866395 107838643 107818127 107799447 107767868 107724500 107666421 107594013 107542443
2726.9 107542443 107535481 107555842 107587349 107616782 107643557 107686269 107728827 107742727 107732999 107722950 107734263 107756412
2751.4 107756412 107760191 107740152 107708669 107674432 107638800 107595038 107540357 107482147 107412469 107309878 107179546
2773.8 107179546 107051682 106928790 106785107 106612635 106414831 106185305 105938208 105712569 105503142 105263388
2794.2 105263388 104980278 104686904 104405999 104109991 103771472 103393269 102981603 102544808 102066469 101511610
2814.6 101511610 100870705 100138140 99298000 98342848 97255832 95996302 94532692 92828441 90793574
2832.9 90793574 88262713 84971851 80595374 74846369 67697245 59633112 51567805 44522285
2849.3 44522285 39463511 37143037 37764806 40897340 45683330 51120788 56291866 60470390 63319272
2867.6 63319272 65160400 66823012 68895870 71184283 73043442 74013239 74018317 73200619 71754080
2886 71754080 69864696 67699075 65388709 63020289 60637259 58222699 55726832 53114647 50340825
2904.3 50340825 47333762 44029957 40409926 36515960 32465416 28500688 24987072 22271883
2920.6 22271883 20578282 19959249 20327452 21533579 23420241 25952911 29158911 32930481 37033769
2939 37033769 41202140 45116600 48402986 50746959 52071100 52655041 52999645 53610450 54866755
2957.4 54866755 56922185 59746754 63216287 67140245 71254987 75259525 78928906 82154208
2973.7 82154208 84919488 87268144 89241576 90887958 92277241 93450755 94408536 95121115 95543748
2992 95543748 95621401 95263159 94401133 93067026 91405898 89703494 88356590 87746996 88106078 89429498
3012.4 89429498 91485435 93921721 96388143 98619282 100465012 101907849 103021216 103864896 104490578
3030.8 104490578 104960775 105331504 105632889 105841780 105971181 106091869 106236005 106393242 106543183 106687820
3051.2 106687820 106835306 106963062 107064474 107153213 107229447 107290339 107334578 107393861 107508922 107656407
3071.6 107656407 107778549 107848477 107896161 107963681 108042848 108114839 108190465 108262360 108314657 108371031 108434677
3094 108434677 108470356 108473384 108475304 108487213 108482015 108441985 108407617 108435893 108486223 108493829 108494949 108532989 108611989
3120.5 108611989 108718073 108798289 108816040 108808112 108828378 108867514 108879793 108848786 108811533 108821881 108872974
3143 108872974 108921397 108940065 108918381 108884048 108889902 108940852 108993161 109022629 109035003 109050584 109078074 109097111
3167.4 109097111 109101057 109104276 109117877 109142375 109153605 109141076 109135687 109149599 109158671 109158421 109167171 109177840 109183037
3193.9 109183037 109199560 109227180 109243941 109244359 109245229 109258664 109283543 109303522 109312427 109332693 109366059 109385622
3218.4 109385622 109389889 109395111 109403539 109410381 109406126 109378159 109340715 109341908 109389222 109433794 109444118 109424651 109385872
3244.9 109385872 109359956 109387100 109438121 109455740 109439516 109427512 109439671 109459400 109457862 109431076 109391820 109342396
3269.4 109342396 109312582 109326291 109362578 109399104 109415102 109404922 109386230 109374559 109365535 109335184 109287775 109261024
3293.9 109261024 109269488 109298575 109319520 109292662 109215760 109160185 109180224 109243822 109299862 109329605 109339893 109343684
3318.4 109343684 109346163 109330761 109298396 109290981 109311390 109328341 109334517 109309602 109236693 109176886 109170628 109181643
3342.8 109181643 109201312 109210539 109175563 109152448 109185302 109217072 109208107 109172404 109140193 109126878 109086764 109008896
3367.3 109008896 108968782 109008288 109074056 109107268 109126318 109159398 109200144 109232903 109236681 109191144 109110653 109061170
3391.8 109061170 109071016 109088373 109047401 108969665 108970106 109057212 109104836 109074843 109033871 109019494 109042156 109086657
3416.3 109086657 109108925 109105122 109077203 109010303 108923578 108845437 108785009 108715916 108627248 108596992 108672118 108762109
3440.7 108762109 108781683 108757401 108726871 108682513 108620286 108544064 108460176 108361840 108259296 108208370 108155000
3463.2 108155000 107987356 107789743 107767427 107952964 108148539 108212638 108167887 108141220 108255470 108388221
3483.6 108388221 108411241 108437300 108508575 108528674 108485496 108428490 108400464 108400238 108379161 108391213 108474636 108526671
3508 108526671 108458412 108286357 108152580 108135414 108154929 108137703 108073866 108027577 108057427 108087027 108056533
3530.5 108056533 108011639 107971287 107947063 107968497 108023071 108100653 108205760 108312964 108408535 108512163 108604705
3552.9 108604705 108663833 108737814 108846068 108974755 109181452 109474349 109628499 109512699 109395075 109431100
3573.3 109431100 109530747 109610701 109665835 109727991 109866691 110110152 110284495 110224688 110122442 110115528 110119617
3595.7 110119617 110112691 110144103 110199690 110299051 110495687 110698950 110781527 110811067 110860705 110979426 111141348
3618.2 111141348 111141884 111029685 111077547 111380792 111682618 111537838 111195397 110979152 110858619 110778737
3638.6 110778737 110738289 110787416 111022460 111449254 111714506 111461198 111112654 110981369 110884118 110713613
3659 110713613 110624671 110657465 110788059 111067235 111398840 111547554 111668551 111794341 111580396 111241400
3679.4 111241400 111055815 111040807 111209691 111513352 111717951 111636901 111451530 111362505 111419201 111585081
3699.8 111585081 111700249 111648822 111621583 111781478 111979210 111871266 111528289 111365163 111468828 111693859
3720.1 111693859 111905169 112029600 112023675 111975026 112077010 112343204 112475908 112216413 111840010 111734056
3740.5 111734056 111936975 112115037 112051940 112055552 112049997 111764848 111488330 111416268 111385667 111267364 111201048
3763 111201048 111243176 111293459 111291194 111179888 111032522 111002862 111103332 111190391 111153162 111089373 111042440
3785.4 111042440 110968792 110918224 110944211 111057651 111217940 111368072 111544526 111633539 111525893 111412024
3805.8 111412024 111270046 111093295 111082470 111286020 111530614 111675227 111751056 111629093 111389947 111254787
3826.2 111254787 111220014 111278379 111390090 111498654 111636460 111736536 111652005 111418283 111159718 111038280
3846.6 111038280 111197364 111634779 112022150 111817825 111397707 111219215 111272776 111425519 111493683 111505473
3867 111505473 111554408 111515832 111369073 111221278 111182821 111287165 111348617 111316490 111268222 111192524 111180544
3889.4 111180544 111195922 111108553 111060929 111209834 111457610 111586070 111480904 111203063 110952699 110835361
3909.8 110835361 110821414 110894740 111012161 111055517 111013770 110989654 110994983 110974312 110957277 110977161 110958517
3932.3 110958517 110868418 110795987 110796940 110846066 110881996 110876799 110871649 110866261 110827756 110776997 110737979 110712731
3956.7 110712731 110706711 110711932 110706425 110697246 110687363 110663068 110646594 110655534 110661435 110653019 110650516 110645998 110625041
3983.3 110625041 110600901 110600173 110624611 110632706 110609055 110577214 110551953
3997.5 110551953
##END=$$ End of the data block
