##TITLE=$$ Begin of the data block
##JCAMP-DX=5.00 $$ ACD/SpecManager v 10.08
##SPECTROMETER/DATA SYSTEM=Alpha
##DATE=27 Jun 2014 15:13:00
##DATA TYPE=INFRARED SPECTRUM
##DATA CLASS=XYDATA
##ORIGIN=
##OWNER=
##NPOINTS=1667
##FIRSTX=599.63549805
##LASTX=3997.56909180
##MAXX=3997.56909180
##MINX=599.63549805
##MAXY=1.22852206
##MINY=0.20390110
##XFACTOR=1.0000000000
##YFACTOR=0.000000010000000
##FIRSTY=1.04574716
##DELTAX=2.03957605
##XUNITS=1/CM
##YUNITS=ARBITRARY UNITS
##XYDATA=(X++(Y..Y))
599.6A04574716m2283J28161J59145J56057J50335J28400J78492K66910J86657p140
620A05879450l5429L7670L8850J8168M6527O9010L0172n221K0444M6301M6265Q6356
644.5A06278563J50024J11044j8358o7699o7926j18065k08032l10111l31926R3400
664.9A05510914R39191L53360j137686q55541l30007k39313k72155k74408l07822l60763
685.3A03025770l62444l30972l37005l64733l81374m28093n36239o94620r46695j306969
705.7I7336626j600409j587665j262909r24045p76249o55550l65674J27828P62677
724I1054630J250774J362097J225621J082670J018703R82130R24468Q40640P51078
742.4A00492811O71315N93615N15389M66609M29249L28303J95729J33288J60229K30229
$$ plain form
599.6 104574716 104532433 104660594 104819739 104975796 105126131 105254531 105433023 105699933 105886590 105879450
620 105879450 105844021 105881691 105920541 105938709 105985236 106054246 106084418 106079197 106099641 106145942 106192207 106278563
644.5 106278563 106428587 106539631 106521273 106453574 106385648 106267583 106059551 105749440 105417514 105510914
664.9 105510914 106450105 106803465 105665779 104810238 104480231 104240918 103968763 103694355 103386533 103025770
685.3 103025770 102663326 102332354 101995349 101630616 101249242 100821149 100284910 99590290 98643595 97336626
705.7 97336626 95736217 94148552 92885643 91961598 91185349 90529799 90164125 90291953 91054630
724 91054630 92305404 93667501 94893122 95975792 96994495 97976625 98901093 99741733 100492811
742.4 100492811 101164126 101757741 102273130 102739739 103168988 103497291 103693020 103826308 103986537 104216766
762.8A04216766K57695J95968J27578J12569J31858J62601J74213J66273J60920J70803
783.2A05877244J70780J33598J09207J26922J11091L8004r966k6607o7246j28675j71327
805.6A06163025j44374p9740q5747j39570j38974r8419p8333l7265N0354P0691l1745
828.1A05449903j58644k17986k03848j50513r4581o3038o8307q2171m8280L3534J07145
850.5A04503214J23072P9727K6894m494m3226r6714j34826j62363j97387k31290k31719
872.9A03630888j59466l4189O1941R5296J08063J24252J24693R0230J0228j28985l41630
895.4A03581321m42159k45166j4436L9959M6599K5320n3609j07300q9717m3225k7978
917.8A02669609q6439k20406l30126k70427l9136K06160K93577J70314j9264p7855
$$ plain form
762.8 104216766 104474461 104670429 104798007 104910576 105042434 105205035 105379248 105545521 105706441 105877244
783.2 105877244 106048024 106181622 106290829 106417751 106528842 106566846 106556880 106530273 106463027 106334352 106163025
805.6 106163025 106018651 105938911 105853164 105713594 105574620 105476201 105397868 105360603 105410957 105481648 105449903
828.1 105449903 105291259 105073273 104869425 104718912 104624331 104561293 104492986 104410815 104362535 104396069 104503214
850.5 104503214 104626286 104706013 104732907 104728413 104685187 104588473 104453647 104291284 104093897 103862607 103630888
872.9 103630888 103471422 103437233 103499174 103594470 103702533 103826785 103951478 104041708 104051936 103922951 103581321
895.4 103581321 103139162 102893996 102879560 102919519 102966118 102991438 102937829 102830529 102740812 102697587 102669609
917.8 102669609 102583170 102362764 102032638 101762211 101723075 101929235 102222812 102393126 102373862 102296007
938.2A02296007J3983R8586P9381P666o5828j42538k23816k61211k15387j27924m9770
960.6A01409149K527J7906j3364p6365j29569j76990k36976k15602o5434O2752P8678
983.1A00656712Q4758J41251J77884J42300O0868j0812n5313j01435j62113k21217
1003.5A00712883k70402l21794k98708j02079P8601M977j98734k90287k26837j42038
1023.9I8945582j32203j20765l6448L5691j3000k14493n69231r68021j055151n89090
1044.3I5282871L8141L35574L80134L76791L16542K05684J18303Q4192Q1432P4023
1064.7I7293687L1799m0126j23590k37632m10497o24824q37791r99397j062017j041305
1085I1948307j010007j004803j003319r69380q57574o25098l09473q744K30020L70759
$$ plain form
938.2 102296007 102309990 102408576 102487957 102495623 102429795 102287257 102063441 101802230 101586843 101458919 101409149
960.6 101409149 101411676 101429582 101416218 101339853 101210284 101033294 100796318 100580716 100515282 100578034 100656712
983.1 100656712 100741470 100882721 101060605 101202905 101263773 101252961 101197648 101096213 100934100 100712883
1003.5 100712883 100442481 100120687 99821979 99719900 99798501 99803478 99604744 99314457 99087620 98945582
1023.9 98945582 98813379 98692614 98656166 98691857 98678857 98464364 97895133 96927112 95871961 95282871
1044.3 95282871 95321012 95656586 96036720 96413511 96730053 96935737 97054040 97138232 97219664 97293687
1064.7 97293687 97325486 97285360 97161770 96924138 96513641 95888817 95051026 94051629 92989612 91948307
1085 91948307 90938300 89933497 88930178 87960798 87103224 86478126 86168653 86159909 86389929 86760688
1105.4H6760688L43674J33735j60718l88050m23032k06405J91301N75239P36838N34970
1125.8H8098240L904n73790j015812j465005j950914k220946k129275j812130j479703
1144.2G5454569j241678j132977j135790j177115j182097j096833q99124o26069l46363
1162.6F6616523j10012P4059K20239L66849N89645Q95708J161534J337355J477456
1180.9G2629356J541841J483971J359129J218355J071095R39286Q64136Q60984Q85117
1199.3H2853270Q61227P49803N77998M06188K69079J70761J15365R6768P1901k122
1219.7H6170238j24794k56276l46518l60948l13663k74855k77996k68096j72645R418
1240.1H3783865K22188M18967N66298O41030O21176N21535M12887L53861L39389L18205
$$ plain form
1105.4 86760688 87104362 87238097 87077379 86689329 86266297 86059892 86251193 86826432 87563270 88098240
1125.8 88098240 88102144 87528354 86512542 85047537 83096623 80875677 78746402 76934272 75454569
1144.2 75454569 74212891 73079914 71944124 70767009 69584912 68488079 67588955 66962886 66616523
1162.6 66616523 66506511 66580570 66800809 67167658 67757303 68653011 69814545 71151900 72629356
1180.9 72629356 74171197 75655168 77014297 78232652 79303747 80243033 81107169 81968153 82853270
1199.3 82853270 83714497 84464300 85042298 85448486 85717565 85888326 86003691 86100459 86172360 86170238
1219.7 86170238 86045444 85789168 85442650 85081702 84768039 84493184 84215188 83947092 83774447 83783865
1240.1 83783865 84006053 84425020 84991318 85632348 86253524 86775059 87187946 87541807 87881196 88199401
1260.4H8199401K66492K15245K03877K39057K76321K65670K25061J85102J54966J95056
1280.8I0426248L54386N36227N83321M72897L14766K10470J66232J20353O5351P9077
1301.2I3329328J84089K89881L06350K71965K64638K45792J83958J24222R5647J27495
1321.6I5423365K06363K52557K36141J65570M0138r5254j84185k53731l41725l41195
1342I5108044k41119j87653k03293k16467j97208j78158j67221q4257N8025M8501j24777
1364.5I3614417j83499j42890j52975l77703q88741r88632j75983Q71497J404781J456135
1384.9I4436407J314473R50098N94759M56143L49164K77948L41582M71509O18023N60420
1405.3A00370526J41025l85988q99947j161694q88699k91163K00921L53819K57629
$$ plain form
1260.4 88199401 88465893 88681138 88885015 89124072 89400393 89666063 89891124 90076226 90231192 90426248
1280.8 90426248 90780634 91316861 91900182 92373079 92687845 92898315 93064547 93184900 93250251 93329328
1301.2 93329328 93513417 93803298 94109648 94381613 94646251 94892043 95076001 95200223 95295870 95423365
1321.6 95423365 95629728 95882285 96118426 96283996 96324134 96228880 96044695 95790964 95449239 95108044
1342 95108044 94866925 94679272 94475979 94259512 94062304 93884146 93716925 93632668 93690693 93739194 93614417
1364.5 93614417 93430918 93288028 93135053 92757350 91868609 90879977 90703994 91575491 92980272 94436407
1384.9 94436407 95750880 96700978 97295737 97751880 98101044 98378992 98720574 99192083 99810106 100370526
1405.3 100370526 100511551 100125563 99225616 98063922 97175223 96884060 97084981 97438800 97696429
1423.6I7696429q7565n32120r86946j252359j112258j097656j284194j096159q84801
1442H9362371q24267q18383j024050j347655j565021j551777j482225j313162q39829
1460.3G8596002o73628q17120O9630K631134N510843P192433N317962K537846J456523
1478.7A01821625J172090J013887Q75258Q35204O63150K22361K0182J36757M5216k44689
1499.1A06561041o0344M81141J003873P81036j86790l02195N01K40290K65205K14207
1519.5A08997965J23775j27244j99568j76132r5976J02187P9488j0132K90489M46546
1539.9A09431398j83702n61750m75621k38085k9230Q7393K57659N22828N74851l09026
1560.3A09076715o03712k12181O0749J95372O2407m3417J37926P9333k30062j97982
$$ plain form
1423.6 97696429 97608864 97076744 96089798 94837439 93725181 92627525 91343331 90247172 89362371
1442 89362371 88538104 87719721 86695671 85348016 83782995 82231218 80748993 79435831 78596002
1460.3 78596002 77922374 77105254 77174884 79806018 85316861 92509294 97827256 100365102 101821625
1478.7 101821625 102993715 104007602 104882860 105718064 106381214 106603575 106623757 106760514 106805730 106561041
1499.1 106561041 106500697 106981838 107985711 108766747 108579957 108277762 108278263 108518553 108783758 108997965
1519.5 108997965 109121740 108994496 108794928 108618796 108522820 108625007 108704495 108694363 108984852 109431398
1539.9 109431398 109247696 108685946 108210325 107972240 107943010 108030403 108288062 108810890 109385741 109076715
1560.3 109076715 108473003 108260822 108321571 108516943 108579350 108535933 108673859 108753192 108523130 108325148
1580.7A08325148n5135N460K5654L4559K5296Q023k2698p6210j01447r5797q5199m0006
1605.1A07947648L7205L9506P98P8392J80102j8394k10846o9308m5311j63496j76537
1627.6A07599759j54745J883K80380J56582m27270n26583l10362n2368O2310j59728
1648A06469858j33062J36435l49915p53164m03607q6582l5357j70565n7637J83236
1668.4A04799640J89257J55783K88641K16222R9969K25639L23999j49202o75500n96678
1688.8A04877770n11396l43716k23518l31485o10256j113546j137733r99284j168496
1707.1I8438340j105272q34316o51580p98804j694584k479350k454037k700674l222591
1725.5H2497132l617424m071903m618848o450378p198340n506861n101455m428041
$$ plain form
1580.7 108325148 108270013 108275473 108301127 108335686 108360982 108369005 108346307 108270097 108168650 108072853 107987654 107947648
1605.1 107947648 107984853 108024359 108025157 108103549 108283651 108265257 108054411 107985103 107939792 107776296 107599759
1627.6 107599759 107445014 107446897 107727277 107883859 107456589 106930006 106619644 106567276 106629586 106469858
1648 106469858 106336796 106473231 106123316 105370152 104966545 104879963 104844606 104674041 104616404 104799640
1668.4 104799640 104988897 105144680 105433321 105649543 105749512 105975151 106299150 106149948 105474448 104877770
1688.8 104877770 104366374 104022658 103799140 103467655 102857399 101743853 100606120 99606836 98438340
1707.1 98438340 97333068 96498752 95847172 95048368 93353784 90874434 88420397 85719723 82497132
1725.5 82497132 78879708 74807805 70188957 63738579 56540239 51033378 45931923 41503882
1741.8D1503882k592891o89986J396042L949907O267697P263034Q200044Q607143P589585
1760.1H1494457O504339M787850L281009K590513K024615J482213Q72957N44835N36465
1778.5A04119253N14889L93677L30650K87557L34692M18782K84768M4596O7115J89042
1798.9A06985021J64067N3430L3772J14155J61671J18030L2091M4441Q1479Q1742J17481
1821.3A07987380J80423J67787J18554Q0097n8496q2481J4365N0532P1717J70934J79851
1843.8A08880663j6809j11222o6852k2746K230K1732K7513K7251K5273O9272J58501
1866.2A08994806J26803p6890j60456p3385j1087P618J3077J8430K6190N6052P2670
1888.6A08993828P415k9576j776p045k0290J002J3327J7703L0219K4891j6844k6274
$$ plain form
1741.8 41503882 38910991 38221005 39617047 43566954 49834651 57097685 65297729 73904872 81494457
1760.1 81494457 87998796 92786646 96067655 98658168 100682783 102164996 103037953 103582788 104119253
1778.5 104119253 104634142 105027819 105358469 105646026 105980718 106399500 106684268 106728864 106795979 106985021
1798.9 106985021 107149088 107202518 107236290 107350445 107512116 107630146 107662237 107706678 107788157 107869899 107987380
1821.3 107987380 108167803 108335590 108454144 108534241 108475745 108393264 108407629 108458161 108529878 108700812 108880663
1843.8 108880663 108863854 108752632 108685780 108663034 108665264 108686996 108714509 108741760 108767033 108836305 108994806
1866.2 108994806 109121609 109044719 108884263 108810878 108799791 108807409 108820486 108838916 108865106 108921158 108993828
1888.6 108993828 109001243 108971667 108969891 108962846 108942556 108943558 108956885 108974588 109004807 109029698 109012854 108986580
1913.1A08986580L9232P1860J0836k5916l7015o8998m9556j0728O842Q404j07O700
1937.6A08938134M8673P2324N162n6696m5955j6701L33Q905R001L814K718L493K0516
1964.1A08993721L2759N72l1376k2995p868N00J896m566j1229q822P200L0089L7968
1990.6A09017849m399n0366m1032j5819o473j800K51m375j2076k0838k0826l529k157
2017.1A08834410l2127l9911j7143p438r776q785l648O699J0360M947O783J0693Q523
2043.6A08763587R203P141O270J1003Q286N292Q262J1575J6689J4508J991p87K408
2070.2A08865428L409N842O997J2958J4580N865L874J2612K2304K3485J0383m29K193
2096.7A08989501L302K349M351N090J0824J6713P570N519J9038J6940J800M53L135
$$ plain form
1913.1 108986580 109025812 109097672 109108508 109082592 109045577 108976579 108927023 108916295 108923137 108931541 108931434 108938134
1937.6 108938134 108986807 109059131 109064293 109007597 108961642 108944941 108945274 108954179 108963180 108966994 108969712 108973205 108993721
1964.1 108993721 109026480 109027052 108995676 108972681 108964813 108965313 108967209 108962643 108951414 108942592 108949792 108979881 109017849
1990.6 109017849 109013450 108963084 108922052 108906233 108899760 108897960 108898211 108893836 108881760 108860922 108840096 108836567 108834410
2017.1 108834410 108802283 108762372 108745229 108737791 108728015 108719230 108715582 108722281 108732641 108737588 108744371 108755064 108763587
2043.6 108763587 108772790 108779931 108786201 108797204 108805490 108810782 108819044 108830619 108847308 108861816 108863807 108863020 108865428
2070.2 108865428 108868837 108874679 108881676 108894634 108909214 108915079 108918953 108931565 108953869 108977354 108987737 108987308 108989501
2096.7 108989501 108992803 108995152 108999503 109004593 109015417 109032130 109039700 109045219 109064257 109081197 109082997 109083450 109086585
2123.2A09086585J657Q488J0693K122m864k503j431j0729j4877q404m769q690j0693
2149.7A09042585o700o31l82q22N48r30L612J0192J0825J2338J3327Q679M113P641
2178.2A09104395J5366J3840O604K492L624R954J0514L922L445Q965P891J872M77O938
2206.8A09200299J7130J9276P844k730m220j31O676O020n72n746n889j311K205L529
2235.4A09242380O55n9Q082J4651J2457Q095R369J3149J5736K4402L1388K7573J9693
2261.9A09427571J3125J6439K4021J7333m41j0777j1718k0647l8433l1948K1899Q9871
2286.3A09496295J24968J31166J41382J59704J69659J79279K04456K47919L16930L99411
2306.7A11571169M55177M46748L78168L62659N16486P27510P73609O26397M84836N00655
$$ plain form
2123.2 109086585 109088242 109096730 109107423 109109545 109104681 109102178 109100747 109090018 109075141 109066737 109061968 109053278 109042585
2149.7 109042585 109035885 109035254 109034872 109034050 109034598 109033668 109037280 109047472 109058297 109070635 109083962 109092641 109096754 109104395
2178.2 109104395 109119761 109133601 109140205 109142697 109146321 109156275 109166789 109170711 109174156 109183121 109191012 109192884 109193361 109200299
2206.8 109200299 109217429 109236705 109244549 109241819 109237599 109237468 109244144 109250164 109249592 109243846 109237957 109236646 109238851 109242380
2235.4 109242380 109243035 109242976 109251058 109265709 109278166 109286261 109295630 109308779 109324515 109348917 109380305 109407878 109427571
2261.9 109427571 109440696 109457135 109481156 109498489 109498048 109487271 109475553 109454906 109416473 109384525 109406424 109496295
2286.3 109496295 109621263 109752429 109893811 110053515 110223174 110402453 110606909 110854828 111171758 111571169
2306.7 111571169 112026346 112473094 112851262 113213921 113730407 114457917 115231526 115857923 116342759 116843414
2327.1A16843414N52643M27580K21681J96123K73335K82991J37389l53933j158821
2345.5A17422402j207244j08910J225912J963044J825630J227844N03528j15430o58286
2363.8A22078490j145589j437295j540279j527035j429022j309442j188207j047539
2380.2A11454082q53837o02257l58629j76502o3872j3912j049K4m947j4818j6141l81
2404.6A09347761J5211J7595J4448P057j406j049N173J0789R513J716K027Q964Q393
2431.2A09446192J287l111O44Q511J1528L683k575O080J4329J1492K634l123k933k610
2459.7A09492028l433m602k766l93K527J0324J1420r42j0979j0228p093o926o580k575
2488.3A09459782N36k348r346j3447j3817j4948o688Q214L516j5580k6775k7346k0624
$$ plain form
2327.1 116843414 117396057 117823637 118045318 118241441 118514776 118797767 118935156 118581223 117422402
2345.5 117422402 116215158 116106248 117332160 119295204 121120834 122348678 122852206 122736776 122078490
2363.8 122078490 120932901 119495606 117955327 116428292 114999270 113689828 112501621 111454082
2380.2 111454082 110600245 109997988 109639359 109462857 109398985 109385073 109384024 109384048 109379101 109364283 109348142 109347761
2404.6 109347761 109362972 109380567 109395015 109402072 109400666 109399617 109404790 109415579 109425092 109426808 109428835 109437799 109446192
2431.2 109446192 109447479 109444368 109445012 109453523 109465051 109468734 109466159 109472239 109486568 109498060 109500694 109497571 109494638 109492028
2459.7 109492028 109488595 109483993 109481227 109480834 109483361 109493685 109505105 109504163 109493184 109482956 109475863 109468937 109462357 109459782
2488.3 109459782 109460318 109457970 109448624 109435177 109421360 109406412 109399724 109407938 109411454 109395874 109369099 109341753 109321129
2514.8A09321129j6474j6869j2195q189r704j2612j5736j3447q893m887L016P784J741
2541.3A09214664m614L93L553L93r18q761j5748j1313j1694j5665j6319j9360k0254
2567.8A09094357k1004k2245k2065k3663k4331k5201k8085k5976k4021k9349l0244
2590.2A08818173k4294j5760j0228j5187k5499l0160k9004l3402l5274k5785j6618
2612.7A08556962j6594k4140l1507l5643l7969m3940m8304m1103k8706j9347k2328
2635.1A08207381k6262j1361j204j1015k5677l4535l0875l5203n1641n3645n4240p2348
2659.6A07799375q8036p3755m1365k8289l1101k2829p463q630k1005q810K7526N0783
2684.1A07546401M5776L3951L9208M9877M9103M2748L7396L2866K6011J7727J0717
$$ plain form
2514.8 109321129 109304655 109287786 109275591 109267402 109257698 109245086 109229350 109215903 109207010 109202123 109205139 109212923 109214664
2541.3 109214664 109210050 109210443 109213996 109214389 109213471 109204710 109188962 109177649 109165955 109150290 109133971 109114611 109094357
2567.8 109094357 109073353 109051108 109029043 109005380 108981049 108955848 108927763 108901787 108877766 108848417 108818173
2590.2 108818173 108793879 108778119 108767891 108752704 108727205 108697045 108668041 108634639 108599365 108573580 108556962
2612.7 108556962 108540368 108516228 108484721 108449078 108411109 108367169 108318865 108277762 108249056 108229709 108207381
2635.1 108207381 108181119 108169758 108168554 108157539 108131862 108097327 108066452 108031249 107979608 107925963 107871723 107799375
2659.6 107799375 107711339 107637584 107596219 107567930 107536829 107514000 107506537 107497907 107476902 107468092 107495618 107546401
2684.1 107546401 107592177 107626128 107665336 107715213 107764316 107807064 107844460 107877326 107903337 107921064 107931781
2706.5A07931781k480k6977m0626k8527k0743l8397n2523n4801o7151n5682q297K2328
2731A07557905K5999K1875K6739M6158M7981J7441j6105k0779O903K4867k39l0410
2755.4A07708335l3736l0780l5215m7671n6756n8269p2861j07300j32943j26421j24013
2777.9A06882370j51408j77419j95742k26069k44987k24041k02728k27260k77388k97571
2798.3A04657757k84004k92671l30913l70931m15409m54605m90725n48446o27601p26509
2818.7A00115943q41433r57644j084560j251858j459647j703125k026778k515847l268379
2837H5006672m347151n715818p106733q017373q020180o996522n018610k310711O05223
2855.4C8078797L108188M763133N417058N148947M153740K827150J827395J654625
$$ plain form
2706.5 107931781 107929301 107902324 107861698 107833171 107812428 107774031 107721508 107666707 107599556 107543874 107535577 107557905
2731 107557905 107583904 107605779 107632518 107678676 107726657 107744098 107727993 107707214 107714117 107738984 107738745 107708335
2755.4 107708335 107674599 107643819 107608604 107560933 107504177 107445908 107373047 107265747 107132804 107006383 106882370
2777.9 106882370 106730962 106553543 106357801 106131732 105886745 105662704 105459976 105232716 104955328 104657757
2798.3 104657757 104373753 104081082 103750169 103379238 102963829 102509224 102018499 101470053 100842452 100115943
2818.7 100115943 99274510 98316866 97232306 95980448 94520801 92817676 90790898 88275051 85006672
2837 85006672 80659521 74943703 67836970 59819597 51799417 44802895 39784285 37473574 38078797
2855.4 38078797 41186985 45950118 51367176 56516123 60669863 63497013 65324408 66979033
2871.7F6979033K058786K270412J852543R72157K009q29101j450777j875239k146888
2890.1F7832935k300161k359247k368957k395892k470166k585244k755064k993756
2906.4D7604448l285772l595507l868482m026696l943825l495827k698186j681201
2922.7B1008952o18842L60834J202926J886075K525991L194064L755012M078528M135254
2941D1528794L879175L258261K328202J318294N77628L40331O17051J257593K035450
2959.4E7140779K795625L455216L917593M095143L980350L647763L201389K745611
2975.7H4979469K331245J958203J638585J384068J169610R52577P10744M30268P6819
2994.1I5631588l72482q65352j324034j658451j704783j337301n93132L64578J317429
$$ plain form
2871.7 66979033 69037819 71308231 73160774 74132931 74134940 73305839 71855062 69979823 67832935
2890.1 67832935 65532774 63173527 60804570 58408678 55938512 53353268 50598204 47604448
2906.4 47604448 44318676 40723169 36854687 32827991 28884166 25388339 22690153 21008952
2922.7 21008952 20390110 20750944 21953870 23839945 26365936 29560000 33315012 37393540 41528794
2941 41528794 45407969 48666230 50994432 52312726 52890354 53230685 53847736 55105329 57140779
2959.4 57140779 59936404 63391620 67309213 71404356 75384706 79032469 82233858 84979469
2975.7 84979469 87310714 89268917 90907502 92291570 93461180 94413757 95124501 95554769 95631588
2994.1 95631588 95259106 94393754 93069720 91411269 89706486 88369185 87776053 88140631 89458060
3012.4H9458060K045620K422762K452957K220947J841110J439810J108122Q44657O29508
3030.8A04463553M66264L61335K95341K14720J37591J18935J42634J62137J49190J30701
3051.2A06642401J33753J32716J18756J00923Q0657N6123L5477N7209J14047J44959
3071.6A07617021J26099P9918N5003P0024Q3554P9155P6019O4040M9209O3169P2098
3094A08435309L7014k062k801J2529q83m2367m2760K5511N6565J6188J645L6955Q5652
3120.5A08616495J10746P9548J6963o651K3853M0388Q536l6967m3345O032M8674M5466
3145A08909738K3532k193j6332L278L4511L7408K3782K2340K6775K0647Q177M375J991
3171.5A09098029P010K4175J8490o92k02J967l672k325R048J8871J5855P105K849L469
$$ plain form
3012.4 89458060 91503680 93926442 96379399 98600346 100441456 101881266 102989388 103834045 104463553
3030.8 104463553 104929817 105291152 105586493 105801213 105938804 106057739 106200373 106362510 106511700 106642401
3051.2 106642401 106776154 106908870 107027626 107128549 107209206 107265329 107300806 107358015 107472062 107617021
3071.6 107617021 107743120 107823038 107878041 107948065 108031619 108110774 108186793 108250833 108300042 108363211 108435309
3094 108435309 108472323 108470261 108467460 108479989 108479106 108436739 108393979 108419490 108476055 108492243 108493888 108530843 108616495
3120.5 108616495 108727241 108806789 108823752 108817101 108840954 108881342 108889878 108852911 108809566 108815598 108864272 108909738
3145 108909738 108933270 108931077 108914745 108918023 108952534 108989942 109013724 109036064 109062839 109083486 109091663 109096038 109098029
3171.5 109098029 109105039 109129214 109147704 109147012 109146810 109148777 109145105 109142780 109151828 109170699 109186554 109193659 109196508 109199977
3200.1A09199977O735Q536J2207K1195J8001J847J491J0180P272Q297J7202J7357N173
3226.6A09335470j1647l7109n0223k766N6005N4943K5356o413m3691m0686J2684L9172
3251.1A09331095J2803r906O497K4879O211k6560l5095l6919n5254l4463J7738L5763
3275.5A09236789K9838J2111n650o604m530j6940m8137n8710k2841J8907L0994J0014
3300A09175241l6752p3397m6385K3723O8688O9964M2880J3268q512k2769l1769l2723
3324.5A09141457q476J4937J4174O461k5332p2538n3847L040J4126J4078N234l0375
3348.9A09022939j6022L3999K8801j5259m2915k8360m995l7813p7784m4513L3367O3133
3373.4A08914578L0565J3221K5022M0078M3726J3411m4549p9953m8364R823J8537l9327
$$ plain form
3200.1 109199977 109206712 109215248 109227455 109248650 109266651 109268498 109269989 109280169 109287441 109295738 109312940 109330297 109335470
3226.6 109335470 109323823 109286714 109236491 109233725 109289730 109344673 109370029 109363616 109319925 109279239 109291923 109331095
3251.1 109331095 109343898 109333992 109340489 109365368 109371579 109345019 109309924 109273005 109217751 109183288 109201026 109236789
3275.5 109236789 109266627 109278738 109273088 109266484 109261954 109245014 109196877 109138167 109115326 109134233 109165227 109175241
3300 109175241 109138489 109065092 109018707 109042430 109111118 109181082 109223962 109237230 109228718 109205949 109174180 109141457
3324.5 109141457 109132981 109147918 109162092 109168553 109143221 109070683 109016836 109019876 109034002 109048080 109053314 109022939
3348.9 109022939 109006917 109040916 109069717 109054458 109011543 108983183 108978188 108940375 108862591 108818078 108851445 108914578
3373.4 108914578 108945143 108958364 108983386 109023464 109067190 109080601 109036052 108956099 108907735 108917558 108936095 108896768
3397.9A08896768p2932M470Q4520M2569l5620m3618r442K2769L5918K1446M315j7214
3422.4A08933949n2285p4589p9286o6352o4468p7498k6393O7472Q2684J7452k9325
3444.8A08631361m2522n8353o1977n4181n8138q3399j05429p1180p0059j77181k01547
3467.2A07647395j3089J96397K05112P5269l9816k2102J24073J36197J5414J1754N5170
3489.7A08391774J0252m0579m3714j2958Q237j8978J4138Q2410N0580o3372j73199
3512.1A08204591j38354r716K8134j4734n3847l7885K0301J8645l2425m4441l9125
3534.5A07901144k9194J6379O8677R9778J04963R1410Q9610R9885Q3757N7161P6758
3557A08660328J08910J36292K20406L00181J59466j11067j20962L2521J02067Q1539
$$ plain form
3397.9 108896768 108823836 108828306 108912826 108955395 108919775 108876157 108866715 108889484 108925402 108946848 108951163 108933949
3422.4 108933949 108881664 108807075 108727789 108661437 108596969 108519471 108493078 108560550 108643234 108660686 108631361
3444.8 108631361 108588839 108530486 108468509 108414328 108356190 108272791 108167362 108096182 108026123 107848942 107647395
3467.2 107647395 107634306 107830703 108035815 108111084 108071268 108049166 108173239 108309436 108324850 108336604 108391774
3489.7 108391774 108402026 108361447 108317733 108304775 108313012 108294034 108308172 108390582 108441162 108377790 108204591
3512.1 108204591 108066237 108056521 108084655 108069921 108016074 107978189 107998490 108017135 107984710 107940269 107901144
3534.5 107901144 107871950 107888329 107957006 108056784 108161747 108253157 108342767 108442652 108526409 108583570 108660328
3557 108660328 108769238 108905530 109125936 109426117 109585583 109474516 109353554 109386075 109488142 109569681
3577.4A09569681N1927N2214J24741K40445J87599m4608r5176p999l088j5593K4868
3599.8A10085011M7302R1469J94526K01022P9465L7456O8974J22393J35600k5523j11186
3622.2A10926509O1762L06297K98774j29378l25441k11299j17040o6590k4962M5478
3642.6A10764110K18439M25506K80094k45035l30651j05285j06144k07913j01852M5597
3663A10636866J40059K88248L45695J45829J02293J18351k02775l32272j80614n960
3683.4A11055720J69909K99096K05576q2743j98221j05345M3571J59359J10972o2132
3703.8A11595762k7132J82378K22540r5666l43263j71637R4676K19631K15256J39737
3724.2A12032282Q297m7111J00255K73096J39583k65670l79920r4033K16246J92094
$$ plain form
3577.4 109569681 109621608 109673822 109798563 110039008 110226607 110181999 110086823 110078824 110075736 110060143 110085011
3599.8 110085011 110132313 110223782 110418308 110619330 110698795 110736251 110805225 110927618 111063218 111037695 110926509
3622.2 110926509 110988271 111294568 111593342 111463964 111138523 110927224 110810184 110743594 110718632 110764110
3642.6 110764110 110982549 111408055 111688149 111443114 111112463 111007178 110901034 110693121 110591269 110636866
3663 110636866 110776925 111065173 111410868 111556697 111658990 111777341 111574566 111242294 111061680 111055720
3683.4 111055720 111225629 111524725 111730301 111647558 111449337 111343992 111387563 111546922 111657894 111595762
3703.8 111595762 111568630 111751008 111973548 111877882 111534619 111362982 111457658 111677289 111892545 112032282
3724.2 112032282 112040579 111993468 112093723 112366819 112506402 112240732 111860812 111766779 111983025 112175119
3744.6A12175119m2451J1421j9741l08001k98179r5725m1592j13928p2992L3069O2704
3767.1A11289704J5366j14119j62590m0185R1076P2920m1974n4013l5906p1943n6839
3789.5A10891497K5284J21212J67180J56700J78623P3827j17076j01530j42694j97410
3809.9A11055613k5261J88112K13218J26648R3734j03402k41887j37866l8552M6599
3830.3A11176956J10745J25420J55843J03986q6165k26891k60067j38020J52814M55189
3850.7A11569810M09484k09832m42040j91951N1474J50514N8389m89M3833l6382j38235
3873.1A11264575j36674l8826R6464N9473l0434m9841p6986j4698M446r1230l1448
3895.5A10954821J65081K44594J18947j08195k81608k58600j23322j6249O7318J17266
$$ plain form
3744.6 112175119 112132668 112144089 112124348 111816347 111518168 111422443 111380851 111266923 111193931 111227000 111289704
3767.1 111289704 111305070 111190951 111028361 110988176 111079252 111152172 111110198 111056185 111020279 110948336 110891497
3789.5 110891497 110916781 111037993 111205173 111361873 111540496 111614323 111497247 111395717 111253023 111055613
3809.9 111055613 111030352 111218464 111431682 111558330 111652064 111548662 111306775 111168909 111130357 111176956
3830.3 111176956 111287701 111413121 111568964 111672950 111586785 111359894 111099827 110961807 111114621 111569810
3850.7 111569810 111979294 111769462 111327422 111135471 111186945 111337459 111395848 111395359 111439192 111402810 111264575
3873.1 111264575 111127901 111089075 111185539 111245012 111214578 111164737 111087751 111073053 111077499 110986269 110954821
3895.5 110954821 111119902 111364496 111483443 111375248 111093640 110835040 110711718 110695469 110762787 110880053
3915.9A10880053N8436k4879k1338q678k5750J037L1162k4319r3651p4482m172M4048
3940.4A10737467L4082k277n007j3757m3368m1711k1327O68J2076n472k2519j4138
3964.9A10614717n674k75Q536k74q321l505q988j0109m924j6570j5962R144J3685p844
3993.4A10563636k3902k2280
3997.5A10517454
$$ plain form
3915.9 110880053 110938489 110913610 110892272 110883594 110857844 110858881 110890043 110865724 110772073 110697591 110693419 110737467
3940.4 110737467 110771549 110769272 110764265 110750508 110707140 110665429 110644102 110644770 110656846 110651374 110628855 110614717
3964.9 110614717 110609043 110608768 110617304 110617030 110608709 110605204 110596216 110586107 110581183 110564613 110548651 110557795 110571480 110563636
3993.4 110563636 110539734 110517454
3997.5 110517454
##END=$$ End of the data block
