##TITLE=$$ Begin of the data block
##JCAMP-DX=5.00 $$ ACD/SpecManager v 10.08
##SPECTROMETER/DATA SYSTEM=Alpha
##DATE=26 Dec 2014 10:25:20
##DATA TYPE=INFRARED SPECTRUM
##DATA CLASS=XYDATA
##ORIGIN=
##OWNER=
##NPOINTS=1765
##FIRSTX=399.76428223
##LASTX=3997.64306641
##MAXX=3997.64306641
##MINX=399.76428223
##MAXY=0.74600238
##MINY=0.08171409
##XFACTOR=1.0000000000
##YFACTOR=1.000000000000000e-9
##FIRSTY=0.39359772
##DELTAX=2.03961372
##XUNITS=1/CM
##YUNITS=ARBITRARY UNITS
##XYDATA=(X++(Y..Y))
399.8C93597722p514566o382346m371316j662194J190543K992958K751142J615941
416.1C82217884O11782j265496k784967k950937l209323l992080m573167m337042l507942
434.4C56208712k362907l66807K311170M597992N805194O004632N199074L576130J700521
452.8C82673711P5012p98523j285643j807570k534986l344029m158616m599690m312903
471.2C59906763l823877l205180k692640k488493k019734j180321l80993J98991K24918
489.5C44539434n36830j572400k189278k234817k137780k471209l053397l523290l897875
507.9C22922558m009247m083395m380763m984736n701989n684674m580706k872855
524.2B86624193j345515n08189o5744N49108J899212M138172O298423P112384O171941
$$ y = [393597722, 386083156, 379700810, 375329494, 373667300, 374857843, 377850801, 380601943, 382217884, 382829666, 381564170, 378779203, 375828266, 372618943, 368626863, 364053696, 359716654, 356208712, 353845805, 353478998, 355790168, 360388160, 366193354, 372197986, 377397060, 380973190, 382673711, 382748723, 381950200, 380664557, 378856987, 376322001, 372977972, 368819356, 364219666, 359906763, 356082886, 352877706, 350185066, 347696573, 345676839, 344496518, 344115525, 344314516, 344539434, 344002604, 342430204, 340240926, 338006109, 335868329, 333397120, 330343723, 326820433, 322922558, 318913311, 314829916, 310449153, 305464417, 299762428, 294077754, 289497048, 286624193, 285278678, 284770489, 284704745, 285253853, 287153065, 291291237, 297589660, 304702044, 310873985]
542.5C10873985M127473K103060O47098m89622j544535k564132l569693m494905n320460
560.9B99768269o064236o844342p803738q263737p205069m668713j507431J592934
577.2B59003937M311443O426692P690549Q066147P606983O309271M565060K568662
593.5C06548744O75291l68386n65589l45230m649J19418J18822L95596J017332J848578
613.9C09439927K696365L451080L984093M184693M197300M175544M128635L912538
630.2C40170175L299326K357602J641661J466751J628607J755953J649857J283705
646.6C55253637Q75979Q40754J257986J712322J719981J345575R67711P88302O85542
664.9C65447789J030088K272040K314806J644194J461118J561433J865566K200574
$$ y = [310873985, 315001458, 317104518, 317751616, 317261994, 315717459, 313153327, 309583634, 305088729, 299768269, 293704033, 286859691, 279055953, 270792216, 263587147, 258918434, 257411003, 259003937, 263315380, 269742072, 277432621, 285498768, 293105751, 299415022, 303980082, 306548744, 307224035, 306855649, 306290060, 305944830, 305940181, 306059599, 306178421, 306574017, 307591349, 309439927, 312136292, 315587372, 319571465, 323756158, 327953458, 332129002, 336257637, 340170175, 343469501, 345827103, 347468764, 348935515, 350564122, 352320075, 353969932, 355253637, 356129616, 356970370, 358228356, 359940678, 361660659, 363006234, 363973945, 364762247, 365447789, 366477877, 368749917, 371064723, 372708917, 374170035, 375731468, 377597034, 379797608]
681.2C79797608K127468J547903P66367R7513l09438o80297j362503k525538l763467
699.6C75695616m413933m195630l182352j659482k1965J473427K839059M201293N568564
717.9C76304597O968140Q009583Q188486P762224P109612O426930N851269N318612
734.3D31939453M535705L285885J826435M66883p39515j938611l318369m900039o290704
752.6D24867123p090270p098258o350159n252809l965646k207547J65105L036201O208867
771D02312607R132057J1196196J2175798J2011827J0961532R698391Q697927P743269
787.3D83929604O613672N528152M837662M873753N696773O575883O509363N337596
803.6E29902458L755927K608419K132892J959861J622200R14871p3552r24647j422286
$$ y = [379797608, 381925076, 383472979, 384239346, 384336859, 384027421, 383347124, 381984621, 379459083, 375695616, 371281683, 367086053, 363903701, 362244219, 362222254, 363695681, 366534740, 370736033, 376304597, 383272737, 391282320, 399470806, 407233030, 414342642, 420769572, 426620841, 431939453, 436475158, 439761043, 441587478, 442054361, 441314846, 439376235, 436057866, 431157827, 424867123, 417776853, 410678595, 404328436, 399075627, 395109981, 392902434, 393067539, 396103740, 402312607, 411444664, 422640860, 434816658, 446828485, 457790017, 467488408, 476186335, 483929604, 490543276, 496071428, 500909090, 505782843, 511479616, 518055499, 524564862, 529902458, 533658385, 536266804, 538399696, 540359557, 541981757, 542896628, 542823076, 541898429, 540476143]
822E40476143j886546k765954m303574o141723p509529p989288p782280p329196p000357
840.3D87767696o853282o736606o448478n937755n576789n809516o717563p709890
856.6D35977817p302642l911406K382666R189337J4006764J6466349J7234624J6371518
873E00415027J3884127J0220945N805135J013160l416658o632149q320868q807540
889.3E04161179q717954q519709q295626p976383p583528p358671p687687q726478
905.6D39295143j0223717j1742979j2915373j3550758j3562113j2796462j1041045
919.9C53462696q330256n228609k537250o45012P10279J937956L109634M207849N354732
938.2C52042019O539852P199198O104916K407640k995938q173823j2074709j4740914
$$ y = [540476143, 538589597, 535823643, 531520069, 525378346, 517868817, 509879529, 502097249, 494768053, 487767696, 480914414, 474177808, 467729330, 461791575, 456214786, 450405270, 443687707, 435977817, 428675175, 424763769, 427146435, 436335772, 450342536, 466808885, 484043509, 500415027, 514299154, 524520099, 530325234, 531338394, 527921736, 521289587, 512968719, 504161179, 495443225, 486923516, 478627890, 470651507, 463067979, 455709308, 448021621, 439295143, 429071426, 417328447, 404413074, 390862316, 377300203, 364503741, 353462696, 345132440, 339903831, 337366581, 336721569, 337431848, 339369804, 342479438, 346687287, 352042019, 358581871, 365781069, 371885985, 374293625, 371297687, 363123864, 351049155, 336308241]
954.5C36308241j6479582j7596036j8300712j8735290j8971592j9012317j8947869
968.8B08264843j8752471j8198878j7202064j5817478j4076397j2021259r760677p494621
985.1I4940998n433433l722049k358541j267039m45842J15357M91977P01979P19852
1003.5H3743259N07884J24052k55264m24251k46964J42186O07722J095638J547865
1021.8H6842127J982339K385899K690450K838611K769433K401918J782634J095809
1038.2A04789220N65558L02725L00460N29170R85130J770474K928987M233383N356580
1056.5A21761687O290369P282823Q297473Q627043O945341K276704m082680q710295
1072.8A48688465r288370o686852l319516n97686J311854K630755L626019M503280
$$ y = [336308241, 319828659, 302232623, 283931911, 265196621, 246225029, 227212712, 208264843, 189512372, 171313494, 154111430, 138293952, 124217555, 112196296, 102435619, 94940998, 89507565, 85785516, 83426975, 82159936, 81714094, 81829451, 82321428, 83023407, 83743259, 84251143, 84375195, 84119931, 83695680, 83448716, 83590902, 84198624, 85294262, 86842127, 88824466, 91210365, 93900815, 96739426, 99508859, 101910777, 103693411, 104789220, 105354778, 105657503, 105957963, 106487133, 107472263, 109242737, 112171724, 116405107, 121761687, 128052056, 135334879, 143632352, 152259395, 159204736, 161481440, 157398760, 148688465, 139400095, 132713243, 129393727, 128796041, 130107895, 132738650, 136364669, 140867949]
1089.2A40867949N240500N645826N456880M523858L098786J659140P50229P69958J633986
1107.5A69647112K807320L699705L989741L745004L206522K507835J825914J460180
1123.8A92889333J745343K729312L914058M424169L551960J288891j724064m607558
1140.1B04211444o641195p550656p521287o856084n758956m359379k848059j381234
1156.5A61294594M5538J475975L009036M803524O927639R171143J1215195J2861982
1172.8B10804626J4025644J4652580J4861226J4863878J4612496J3916016J2631953
1187.1C10368419J0734468Q445025O185770M320621L045470K313852J948416J906604
1203.4C49268645K244055L037364M213184N418300O211698O320388N743324M639417
$$ y = [140867949, 146108449, 151754275, 157211155, 161735013, 164833799, 166492939, 167243168, 168013126, 169647112, 172454432, 176154137, 180143878, 183888882, 187095404, 189603239, 191429153, 192889333, 194634676, 197363988, 201278046, 205702215, 209254175, 210543066, 208819002, 204211444, 197570249, 190019593, 182498306, 175642222, 169883266, 165523887, 162675828, 161294594, 161340132, 162816107, 165825143, 170628667, 177556306, 186727449, 197942644, 210804626, 224830270, 239482850, 254344076, 269207954, 283820450, 297736466, 310368419, 321102887, 329547912, 335733682, 340054303, 343099773, 345413625, 347362041, 349268645, 351512700, 354550064, 358763248, 364181548, 370393246, 376713634, 382456958, 387096375]
1219.7C87096375L220052J699924K08050j138299k127052k599746k607703k348602
1236C81402999k034724j717716j217306l70353P40558J801848K508849K747625K541453
1254.4C86403233K030790J479149J147091J148492J490295K038717K502412K651632
1270.7D00891811K370327J678855P69555j55836r03309j283228j290679j131386j088738
1289C99857372j344114j867563k476066k929896l064305k924204k738506k731472k836555
1307.4C76944691k692193k221912j752228j515537j566947j889705k551168l653318
1323.7C59101683m998326o162435o770224o625652n818039m606992l180444j664251
1340C19275320l82394L46541O23972N78194L01809o169k79815n52147q23051j004040
$$ y = [387096375, 390316427, 392016351, 392224401, 391086102, 388959050, 386359304, 383751601, 381402999, 379368275, 377650559, 376433253, 376062900, 376803458, 378605306, 381114155, 383861780, 386403233, 388434023, 389913172, 391060263, 392208755, 393699050, 395737767, 398240179, 400891811, 403262138, 404940993, 405710548, 405554712, 404651403, 403368175, 402077496, 400946110, 399857372, 398513258, 396645695, 394169629, 391239733, 388175428, 385251224, 382512718, 379781246, 376944691, 374252498, 372030586, 370278358, 368762821, 367195874, 365306169, 362755001, 359101683, 354103357, 347940922, 341170698, 334545046, 328727007, 324120015, 320939571, 319275320, 318892926, 319239467, 319863439, 320441633, 320743442, 320737273, 320457458, 319905311, 319082260, 318078220]
1360.4C18078220r85950o85543l31223k5779L61860Q93145J455725J586944J470387
1378.8C21817786J550137K010853L043979M568547N092710L935755K631962J440734
1395.1C46092463J23679r36299j479865j769810k119214k329945k397955k398073k180517
1413.5C30604464j798749j431644q73834j40846M79758R44674J246125J581519J774043
1431.8C32385510J778901K273947K756774K283454J942843J625777J033693K07573
1448.1C46288472p31676j440585j862288k441018k285421n63085R77218K897143M811436
1466.5C45650196N826175P829368J1893392J3215572J1410921J0204256R711564R319484
1482.8D25060928Q348107P950574Q484871Q285909O331355N499929O243140N944877
$$ y = [318078220, 317092270, 316406727, 316075504, 316049725, 316411585, 317304730, 318760455, 320347399, 321817786, 323367923, 325378776, 328422755, 332991302, 338084012, 342019767, 344651729, 346092463, 346216142, 345279843, 343799978, 342030168, 339910954, 337581009, 335183054, 332784981, 330604464, 328805715, 327374071, 326500237, 326359391, 326839149, 327783823, 329029948, 330611467, 332385510, 334164411, 336438358, 339195132, 341478586, 343421429, 345047206, 346080899, 346288472, 345556796, 344116211, 342253923, 339812905, 337527484, 336964399, 337941617, 340838760, 345650196, 351476371, 359305739, 371199131, 384414703, 395825624, 406029880, 415741444, 425060928, 433409035, 441359609, 449844480, 458130389, 464461744, 469961673, 476204813, 482149690]
1499.1D82149690M642815L637731M034847N809635M601657L036440K877771L012121
1515.4E13802707L242791L139973L428578L212810K624750K619505K207100K098143
1531.8E36376357K409041J757562J193166K093792K237141J281977Q75175N64277M01676
1550.1E49190164K25544k0206l03388l29971o73950j269579j583338j732886j941621
1568.5E41560769k275646k304792k420783k873063k814949k551734k610684k664864
1584.8E21044254k747416k831042k912879k920747k864778k813101k828180k948016
1601.1D98178095l092200l156304l156781l292263l421247l482252l819347m276991
1617.4D70480710l682434l283978l572434l533930l444820l346026k795577k183765
$$ y = [482149690, 486792505, 490430236, 494465083, 500274718, 504876375, 507912815, 510790586, 513802707, 517045498, 520185471, 523614049, 526826859, 529451609, 532071114, 534278214, 536376357, 538785398, 540542960, 541736126, 543829918, 546067059, 547349036, 548224211, 548788488, 549190164, 549415708, 549395502, 549092114, 548762143, 548088193, 546818614, 545235276, 543502390, 541560769, 539285123, 536980331, 534559548, 531686485, 528871536, 526319802, 523709118, 521044254, 518296838, 515465796, 512552917, 509632170, 506767392, 503954291, 501126111, 498178095, 495085895, 491929591, 488772810, 485480547, 482059300, 478577048, 474757701, 470480710, 466798276, 463514298, 459941864, 456407934, 452963114, 449617088, 446821511, 444637746]
1633.7D44637746j704067j141370p62820m35412j8656Q65817J676679J322805K208025
1652.1D46648747M255771L002614K351761L158122M354716M761189M092276M742891
1668.4D77368087O037890N526811O055981P052511O150604N409777O354034Q815884
1684.7E28771579P346094N512774N595684M853785M926145N198479M810989N220174
1701.1E72235703L723324K790451K991974K502442K135455K151072K548695L464937
1717.4E94544053L179669K133370K080917K372265K334714K232552K097845K788365
1733.7F13763750K826392J835287K198696K755463K704263K760053L110110L955663
1750F35909677M351556L661632L518165L594160L219306L295422K915919K376914K322554
$$ y = [444637746, 442933679, 441792309, 441029489, 440594077, 440575421, 441441238, 443117917, 444440722, 446648747, 450904518, 453907132, 456258893, 459417015, 463771731, 468532920, 472625196, 477368087, 483405977, 488932788, 494988769, 502041280, 508191884, 513601661, 519955695, 528771579, 536117673, 541630447, 547226131, 552079916, 557006061, 562204540, 567015529, 572235703, 575959027, 578749478, 581741452, 584243894, 586379349, 588530421, 591079116, 594544053, 597723722, 599857092, 601938009, 604310274, 606644988, 608877540, 610975385, 613763750, 616590142, 618425429, 620624125, 623379588, 626083851, 628843904, 631954014, 635909677, 640261233, 643922865, 647441030, 651035190, 654254496, 657549918, 660465837, 662842751, 665165305]
1768.4F65165305K290070K506197K227306J556099J515865J753270J671136J485348
1784.7F80170596J300215J013577J225949J853883J582921J059651J095056J321018
1801F90622866J294434J104713J070499J149476J211762J057029Q72195Q83877R36866
1819.4G00203717Q47637Q15511Q47519O86347P72953Q98898O76751N91576O04987L62635
1839.8G07308531J55270M69506P33614N02228L72529K99395J90794J71900K33173L33488
1860.2G10770428L32833J76370P4625L13341N22554M03583M10080M82679M36723L59714
1880.5G14282930L50535M38690N22137O35624O43134L70025J91152K29776L03865L64184
1900.9G18332052L03626J40965J2100K5570J63138K29597J90676K29358J86921M410
$$ y = [665165305, 667455375, 669961572, 672188878, 673744977, 675260842, 677014112, 678685248, 680170596, 681470811, 682484388, 683710337, 685564220, 687147141, 688206792, 689301848, 690622866, 691917300, 693022013, 694092512, 695241988, 696453750, 697510779, 698382974, 699266851, 700203717, 701051354, 701866865, 702714384, 703400731, 704173684, 705072582, 705749333, 706340909, 706945896, 707308531, 707463801, 707933307, 708666921, 709169149, 709541678, 709841073, 710031867, 710203767, 710436940, 710770428, 711103261, 711279631, 711354256, 711667597, 712190151, 712593734, 713003814, 713486493, 713923216, 714282930, 714633465, 715072155, 715594292, 716229916, 716873050, 717243075, 717434227, 717664003, 717967868, 718332052, 718635678, 718776643, 718788743, 718814313, 718977451, 719207048, 719397724, 719627082, 719814003, 719818413]
1921.3G19818413J20521L40998L40879K22445Q6426K3306M0471J04845J47998K49982
1941.7G21496284L05355J72615R5069J70589L15964M09364L67046K64346J94133J52528
1962.1G23943293J93656L47912M35769K88785J11341P6652J36316K43008K78950K00152
1982.5G26255834N1797m6313j7345J16706K23994J50680K1995n2870r7394j19090j13964
2005G26374030j27673k13087l49939m75406n03302m28736m45247n90622p12693p46310
2025.4G21781015o19053m67062m39704m72844n40137o20007o44565n75185m56989l52680
2045.8G16592789l04938k93791k90155k42412j07587K8432R2327R5606P8857N6803
2066.2G15705931M5538Q1360J44661J51217O7294m3095o5505J0788J11819J91331J97708
$$ y = [719818413, 719938934, 720279932, 720620811, 720843256, 720929682, 720952988, 720993459, 721098304, 721246302, 721496284, 721801639, 721974254, 722069323, 722239912, 722555876, 722965240, 723332286, 723596632, 723790765, 723943293, 724136949, 724484861, 724920630, 725209415, 725320756, 725397408, 725533724, 725776732, 726055682, 726255834, 726307631, 726261318, 726243973, 726360679, 726584673, 726735353, 726757348, 726704478, 726607084, 726487994, 726374030, 726246357, 726033270, 725683331, 725207925, 724704623, 724275887, 723830640, 723240018, 722527325, 721781015, 721161962, 720694900, 720255196, 719782352, 719242215, 718622208, 717977643, 717402458, 716945469, 716592789, 716287851, 715994060, 715703905, 715461493, 715353906, 715382338, 715474665, 715570271, 715649128, 715705931, 715751469, 715832829, 715977490, 716128707, 716196001, 716152906, 716087401, 716098189, 716210008, 716401339, 716599047]
2088.6G16599047J40906R9957J38282K11835K59578K55406K17379J78337J33156J36733
2109G18370616K10464K50996J71840M1604k8730l576N1141O4194N6207J9372m2260
2131.4G19161868o7830j1563Q5175J35600R8825o616q5652m2141O6102J52349K15590
2153.9G19701707K15412J77502J92583L03924M66585N39660N14448N33045O11662O60658
2174.3G23917186O97792P40588P36117O62982N76437N57959O12915O56664O29842N57244
2194.6G30345726M76778M44650M84944N62548O22988N97239N18858M88758N12302N57601
2215G35612392O07253N92112M76837L46363L34263M18722M73321M52757L54647K44916
2235.4G39913583K01702K24471K81870L30925L26097K39730J57774J78098K04444K12491
$$ y = [716599047, 716739953, 716839910, 716978192, 717190027, 717449605, 717705011, 717922390, 718100727, 718233883, 718370616, 718581080, 718832076, 719003916, 719045520, 719016790, 719013214, 719064355, 719128549, 719184756, 719204128, 719161868, 719094038, 719082475, 719167650, 719303250, 719402075, 719395459, 719309807, 719267666, 719333768, 719486117, 719701707, 719917119, 720094621, 720287204, 720591128, 721057713, 721597373, 722111821, 722644866, 723256528, 723917186, 724614978, 725355566, 726091683, 726754665, 727331102, 727889061, 728501976, 729158640, 729788482, 730345726, 730822504, 731267154, 731752098, 732314646, 732937634, 733534873, 734053731, 734542489, 735054791, 735612392, 736219645, 736811757, 737288594, 737634957, 737969220, 738387942, 738861263, 739314020, 739668667, 739913583, 740115285, 740339756, 740621626, 740952551, 741278648, 741518378, 741676152, 741854250, 742058694, 742271185]
2255.8G42271185K81572L25442K64644J77920J85728K66195L17573L02374K45810K16544
2276.2G44854987K56776L02077K54333J50025O5684L1769L8147L6180J2398k2352n4657
2298.7G45925367r3997j55985k51114l31998l21269k55049k18808k83003m86255o77585
2319.1G42850304o09875l48091k56837m05371m80711l87132l66629m48465m12881k52724
2339.5G38881588j20461J67906N69761J08183r39847j440286j242817r28819o92606
2357.8G34362602l83198m7743K13563M62949O26326O07967N34714N38945O16312N93245
2378.2G38125682M20391K01881M18j35959k01761k48254k72870l30090m43757m99129
2398.6G36616552m64678l99530l74555m49002o00398p27713p39455o53386n84603o04868
$$ y = [742271185, 742552757, 742878199, 743142843, 743320763, 743506491, 743772686, 744090259, 744392633, 744638443, 744854987, 745111763, 745413840, 745668173, 745818198, 745883882, 745915651, 745953798, 745989978, 746002376, 745980024, 745925367, 745831370, 745675385, 745424271, 745092273, 744771004, 744515955, 744297147, 744014144, 743527889, 742850304, 742240429, 741892338, 741635501, 741230130, 740749419, 740362287, 739995658, 739547193, 739134312, 738881588, 738761127, 738929033, 739498794, 739606977, 738667130, 737226844, 735984027, 735055208, 734362602, 733979404, 733931661, 734145224, 734608173, 735234499, 735842466, 736377180, 736916125, 737532437, 738125682, 738546073, 738747954, 738748372, 738612413, 738410652, 738162398, 737889528, 737559438, 737115681, 736616552, 736151874, 735752344, 735377789, 734928787, 734328389, 733600676, 732861221, 732207835, 731623232, 731018364]
2419G31018364p38203q97169r39310q90553q08656p78317q60930r62019j025021j013279
2439.4G22104907q96096q05676q57532r74655j045883j031399r32574p97331p62940
2457.8G14000821q82208r96232r63331q47697p70330p43211p63952q35896q81016q43763
2478.1G05473185p76947p11918o72579o99997p41958p13229o09100n03898m77970n30660
2498.5F99034929n86629n81562n21660m58598m40419m75764n33581n86986n87583n74470
2518.9F93687677o21557o75559p37488q04246q36312q62301q85367q93474r07183r62853
2539.3F85501337j035154j050651r94742r20892r03368r58085j022219j032830r80973
2557.7F76602423r09746q83758r23991r72688r83715r79900r44734q92878q90255r03844
$$ y = [731018364, 730280161, 729382992, 728443682, 727553129, 726744473, 725966156, 725105226, 724143207, 723118186, 722104907, 721208811, 720403135, 719545603, 718570948, 717525065, 716493666, 715561092, 714763761, 714000821, 713118613, 712122381, 711159050, 710311353, 709541023, 708797812, 708033860, 707197964, 706316948, 705473185, 704696238, 703984320, 703311741, 702611744, 701869786, 701156557, 700547457, 700043559, 699565589, 699034929, 698448300, 697866738, 697345078, 696886480, 696446061, 695970297, 695436716, 694849730, 694262147, 693687677, 693066120, 692390561, 691653073, 690848827, 690012515, 689150214, 688264847, 687371373, 686464190, 685501337, 684466183, 683415532, 682420790, 681499898, 680596530, 679638445, 678616226, 677583396, 676602423, 675692677, 674808919, 673884928, 672912240, 671928525, 670948625, 670003891, 669111013, 668220758, 667316914]
2578.1F67316914q92520q73387q71420q71658q22962p48515p15315p02560o63579o24716
2598.5F59530282o13332o33001p07626q08776q80301r37939j006245j088202j162052
2616.8F51692808j237572j347899j423895j434625j453697j516283j607299j707375
2633.2F39964163j752615j693427j623929j626253j669109j709282j725376j691162
2649.5F26473010j610339j562178j578629j606822j623512j616180j555740j476169
2665.8F13843441j434147j448214j473487j447379j376391j275599j173675j159012
2682.1F03055537j251996j341879j339019j266062j225829j298427j436711j531362
2698.4E92364252j538635j519859j528084j549005j571179j618564j657247j604736
$$ y = [667316914, 666424394, 665551007, 664679587, 663807929, 662984967, 662236452, 661521137, 660818577, 660154998, 659530282, 658916950, 658283949, 657576323, 656767547, 655887246, 654949307, 653943062, 652854860, 651692808, 650455236, 649107337, 647683442, 646248817, 644795120, 643278837, 641671538, 639964163, 638211548, 636518121, 634894192, 633267939, 631598830, 629889548, 628164172, 626473010, 624862671, 623300493, 621721864, 620115042, 618491530, 616875350, 615319610, 613843441, 612409294, 610961080, 609487593, 608040214, 606663823, 605388224, 604214549, 603055537, 601803541, 600461662, 599122643, 597856581, 596630752, 595332325, 593895614, 592364252, 590825617, 589305758, 587777674, 586228669, 584657490, 583038926, 581381679, 579776943]
2714.7E79776943j478195j379610j373648j417876j410186j300156j170456j101911
2731.1E69144905j067937j071513j101553j080632j016855r74358r70304j001060j025319
2749.4E59835374j007795r64522q99494q21888p73311p72178p90716q02338q13722
2767.8E52189410q45909r04739r90629j100421j213193j270831j256466j280785j423537
2786.1E41902900j585961j648068j671732j761555j894772k024293k125621k204597
2802.4E26986301k281606k362848k457797k557337k648831k727389k800048k891242
2818.8E06259203k985776l051579l121495l248632l405004l533006l601253l650487
2835.1D79661971l781467l992230m226834m497558m787087m990727m982054m729062
$$ y = [579776943, 578298748, 576919138, 575545490, 574127614, 572717428, 571417272, 570246816, 569144905, 568076968, 567005455, 565903902, 564823270, 563806415, 562832057, 561861753, 560860693, 559835374, 558827579, 557863057, 556963563, 556141675, 555368364, 554596186, 553805470, 553003132, 552189410, 551343501, 550438762, 549448133, 548347712, 547134519, 545863688, 544607222, 543326437, 541902900, 540316939, 538668871, 536997139, 535235584, 533340812, 531316519, 529190898, 526986301, 524704695, 522341847, 519884050, 517326713, 514677882, 511950493, 509150445, 506259203, 503273427, 500221848, 497100353, 493851721, 490446717, 486913711, 483312458, 479661971, 475880504, 471888274, 467661440, 463163882, 458376795, 453386068, 448404014, 443674952]
2851.4D43674952m312158l843754l500581l450781l725887m273176m938900n576402
2867.7D10053313o140888o528944o691754o688267o467729n951554n168468m259616
2884C62156093l361374k521485j769126j165837p97063o69509p17908q75026j080394
2902.4C49198371j343965j713336k179742k722025l302484l856242m304916m525989
2918.7C25249672m468471m153430l577322k733350j677275m67240Q93533K304643L582418
2937C14953178M659891N545229O182045O588012O850183P006526P110804P196963P242888
2955.4C73335719P216394P088602O836086O453425O003678N621254N303145M985690
2971.7D22843993M768133M667073M560590M374832M094303L757238L385723K992838
$$ y = [443674952, 439362794, 435519040, 432018459, 428567678, 424841791, 420568615, 415629715, 410053313, 403912425, 397383481, 390691727, 384003460, 377535731, 371584177, 366415709, 362156093, 358794719, 356273234, 354504108, 353338271, 352541208, 351871699, 351153791, 350278765, 349198371, 347854406, 346141070, 343961328, 341239303, 337936819, 334080577, 329775661, 325249672, 320781201, 316627771, 313050449, 310317099, 308639824, 308172584, 309066117, 311370760, 314953178, 319613069, 325158298, 331340343, 337928355, 344778538, 351785064, 358895868, 366092831, 373335719, 380552113, 387640715, 394476801, 400930226, 406933904, 412555158, 417858303, 422843993, 427612126, 432279199, 436839789, 441214621, 445308924, 449066162, 452451885, 455444723]
2988D55444723K645880K343238K037942J728356J367122R13322M64380J26451j61797
3006.4D66909617m93377q69036j258165j606524j861155k042800k208382k397537k593040
3024.7D51579601k736062k835453k896368k916664k987892l124743l213317l237217
3041.1D27631885l289968l378510l421516l384500l359706l401905l431052l436088
3057.4D00528640l448010l436357l399014l385514l401578l426075l450721l428430
3073.7C73152941l347933l286630l325432l392279l395915l376037l317505l251374
3090C46459836l275752l304333l236174l127993l100961l182471l204107l073186k994716
3108.4C17960143l075093l052682k879232k818495k879917k967298l036142k991050
$$ y = [455444723, 458090603, 460433841, 462471783, 464200139, 465567261, 466480583, 466944963, 467071414, 466909617, 466416240, 465547204, 464289039, 462682515, 460821360, 458778560, 456570178, 454172641, 451579601, 448843539, 446008086, 443111718, 440195054, 437207162, 434082419, 430869102, 427631885, 424341917, 420963407, 417541891, 414157391, 410797685, 407395780, 403964728, 400528640, 397080630, 393644273, 390245259, 386859745, 383458167, 380032092, 376581371, 373152941, 369805008, 366518378, 363192946, 359800667, 356404752, 353028715, 349711210, 346459836, 343184084, 339879751, 336643577, 333515584, 330414623, 327232152, 324028045, 320954859, 317960143, 314885050, 311832368, 308953136, 306134641, 303254724, 300287426, 297251284, 294260234]
3124.7B94260234k850473k740056k755969k819568k760798k595872k496749k564818
3141B72675931k652615k610445k507925k390146k288819k340972k472222k454936k354205
3159.4B50603646k271682k192989k146110k112910k079144k040267j977906j948267
3175.7B33834371j971975j965940j913533j835659j775279j763314j738310j683429
3192B19186932j667425j695559j654029j523390j436159j447603j470551j461074j423418
3210.3B05407724j370937j344353j338526j287163j171022j137153j218646j223878
3226.7A95316046j125007j028121r71943j048178j156091j101256r93892r34348q90225
3245A86066985q85919r38892r61915q87930p89419p66873p99328q16584p80135p04646
$$ y = [294260234, 291409761, 288669705, 285913736, 283094168, 280333370, 277737498, 275240749, 272675931, 270023316, 267412871, 264904946, 262514800, 260225981, 257885009, 255412787, 252957851, 250603646, 248331964, 246138975, 243992865, 241879955, 239800811, 237760544, 235782638, 233834371, 231862396, 229896456, 227982923, 226147264, 224371985, 222608671, 220870361, 219186932, 217519507, 215823948, 214169919, 212646529, 211210370, 209762767, 208292216, 206831142, 205407724, 204036787, 202692434, 201353908, 200066745, 198895723, 197758570, 196539924, 195316046, 194191039, 193162918, 192190975, 191142797, 189986706, 188885450, 187891558, 186957210, 186066985, 185181066, 184242174, 183280259, 182392329, 181602910, 180836037, 180036709, 179220125, 178439990, 177735344]
3265.4A77735344o38441n97819o52627p30633p14034o89209o69315o29127n93349n46560
3285.8A71274230n07072m72903m75988n58600o17236o10947n57453m60088l88801m23342
3306.2A66201800n81354p37279p54714o55056n63517n28604n05313m85673m81919n44086
3326.6A60364285o24448o09517n67332m94376l80397m11465n48393n86972n60030m97684
3347A55083671l97146m25607n62191n87835m99055m28513m27112m21002l01272k21267
3367.4A50812671l62188n76600o18890m65602l35604l32251l70413l48166k27779l1680
3387.8A47143498P7099j16781l91826l19943n856R9778j51187l92809k49282J7107
3408.2A45709798N2497o3301j67906j73882p0884M3496J00717J13949J69277K85373
$$ y = [177735344, 177096903, 176499084, 175846457, 175115824, 174401790, 173712581, 173043266, 172414139, 171820790, 171274230, 170767158, 170294255, 169818267, 169259667, 168642431, 168031484, 167474031, 167013943, 166625142, 166201800, 165620446, 164883167, 164128453, 163473397, 162909880, 162381276, 161875963, 161390290, 160908371, 160364285, 159739837, 159130320, 158562988, 158068612, 157688215, 157276750, 156728357, 156141385, 155581355, 155083671, 154686525, 154260918, 153698727, 153110892, 152611837, 152183324, 151756212, 151335210, 151033938, 150812671, 150450483, 149873883, 149254993, 148789391, 148453787, 148121536, 147751123, 147402957, 147175178, 147143498, 147220597, 147103816, 146711990, 146392047, 146386191, 146485969, 146334782, 145941973, 145692691, 145709798, 145762295, 145698994, 145531088, 145357206, 145286322, 145329818, 145430535, 145544484, 145713761, 145999134]
3428.6A45999134K82391K59802L05057J75580l1665j4528J50188K83257L47659L22684
3449A48079559L13193L66062M45083N46872N98103M95419M59805O81609Q35806O16848
3469.4A53438359K46674K12476M91232P48574P66606N84706N57021P25820P48441O60583
3489.8A59180492O97136P75352Q35330Q31112Q13707Q39621P32601O00070P09712R22099
3510.2A66937232J056016J007005Q26985P76261Q95992J108169J115233R03472Q51795
3528.5A75478160R71988J139119J308233J281023J102656J157999J377419J452088
3544.8A85268685J315147J270056J434192J556784J599431J749590J968875K004594
3561.1A98167354J817897J842141K447396K803177K513662K361640K541781K773166
$$ y = [145999134, 146281525, 146541327, 146846384, 147021964, 146990299, 146975771, 147125959, 147409216, 147756875, 148079559, 148392752, 148758814, 149203897, 149750769, 150348872, 150844291, 151304096, 151985705, 152821511, 153438359, 153685033, 153897509, 154388741, 155137315, 155903921, 156488627, 157045648, 157771468, 158519909, 159180492, 159877628, 160652980, 161488310, 162319422, 163133129, 163972750, 164705351, 165305421, 166015133, 166937232, 167993248, 169000253, 169827238, 170603499, 171499491, 172607660, 173722893, 174626365, 175478160, 176450148, 177589267, 178897500, 180178523, 181281179, 182439178, 183816597, 185268685, 186583832, 187853888, 189288080, 190844864, 192444295, 194193885, 196162760, 198167354, 199985251, 201827392, 204274788, 207077965, 209591627, 211953267, 214495048, 217268214]
3577.5B17268214K963885L054574K998397L028795L312156L422186L210962L301396
3593.8B42560565L615186L741771L773794L820389L696978L596306L909350M141122
3610.1B72855461M117816M113824L935992M219979M814595M390687L639042L496468
3626.4C05583864M562587N343795M480868M169196M281283M247278M269123M169315
3642.7C41107309L870875M005819N095780N432665M205972L872067M591435M488647
3659C76670569L933788L756999L558338L396124L933668M194617L430277L781617M111916
3677.4D10767913L369093L144324L014177K802640L140539L579914L061176K466887
3693.7D35346663K420515K408415K359748K540499K414286J945287J823634K228498
$$ y = [217268214, 220232099, 223286673, 226285070, 229313865, 232626021, 236048207, 239259169, 242560565, 246175751, 249917522, 253691316, 257511705, 261208683, 264804989, 268714339, 272855461, 276973277, 281087101, 285023093, 289243072, 294057667, 298448354, 302087396, 305583864, 310146451, 315490246, 319971114, 324140310, 328421593, 332668871, 336937994, 341107309, 344978184, 348984003, 354079783, 359512448, 363718420, 367590487, 372181922, 376670569, 380604357, 384361356, 387919694, 391315818, 395249486, 399444103, 402874380, 406655997, 410767913, 414137006, 417281330, 420295507, 423098147, 426238686, 429818600, 432879776, 435346663, 437767178, 440175593, 442535341, 445075840, 447490126, 449435413, 451259047, 453487545]
3710D53487545K774120K470463J813740J650393J760631J819015J793534J829892J659185
3728.4D71058518J382768J573026K101630K347618J675189O92040P29262J881361J753748
3746.7D85195160J034677J775920K058924J244843J002520J411587J491517J141578
3763.1D96356726J137137J246363J405329J541376J221358R42052J099586J417339
3779.4E06367266J246095R45866J097798J159370J055777R57787P92861Q69394R06169
3797.7E15398383R54449J421213J097262Q44539J302778R43184L58582M96506J104296
3816.1E23921192R99808R54568J463652R13084N09500O49929O94215P87735P82729
3834.4E31676412Q30710J043677R15348Q20756Q52228M37140j47343j75356J250803
$$ y = [453487545, 456261665, 458732128, 460545868, 462196261, 463956892, 465775907, 467569441, 469399333, 471058518, 472441286, 474014312, 476115942, 478463560, 480138749, 480830789, 481560051, 483441412, 485195160, 486229837, 488005757, 490064681, 491309524, 492312044, 493723631, 495215148, 496356726, 497493863, 498740226, 500145555, 501686931, 502908289, 503850341, 504949927, 506367266, 507613361, 508559227, 509657025, 510816395, 511872172, 512829959, 513622820, 514492214, 515398383, 516352832, 517774045, 518871307, 519715846, 521018624, 521961808, 522320390, 522816896, 523921192, 524921000, 525875568, 527339220, 528252304, 528761804, 529411733, 530105948, 530893683, 531676412, 532507122, 533550799, 534466147, 535286903, 536139131, 536576271, 536428928, 536253572, 537504375]
3852.8E37504375K315640Q93712L0339J30475N77807P91013L91841N97060J157224
3871.2E44389486Q88408N38826J68621L11673P97868O93917Q56757O56784J32501N01811
3891.6E49936652O44148J37865Q2553M53829P37131Q65757P05004L19958K10941K31504
3912E54325342J39177K54571N04733M22954K30372L69966M28319J36316J43588N27381
3932.3E57482719N93186L14236Q4996J15871M15981M42207K47776L51310M19796K59041
3952.7E60727119J80662K21968K73526L38196L52919J94133O9976J77681L04997L33190
3973.1E63174367L25203K69532J89841J90258K44558K25246K13802K91943K61903J01745
3993.5E65488398R9361K69532
$$ y = [537504375, 539820015, 540713727, 540744066, 540874541, 541452348, 542243361, 542635202, 543232262, 544389486, 545277894, 545816720, 545985341, 546297014, 547094882, 547788799, 548645556, 549302340, 549434841, 549936652, 550580800, 550718665, 550801218, 551255047, 551992178, 552857935, 553562939, 553882897, 554093838, 554325342, 554464519, 554719090, 555223823, 555646777, 555877149, 556247115, 556675434, 556811750, 556955338, 557482719, 558075905, 558390141, 558475137, 558591008, 559006989, 559449196, 559696972, 560048282, 560468078, 560727119, 560907781, 561129749, 561403275, 561741471, 562094390, 562288523, 562358499, 562536180, 562841177, 563174367, 563499570, 563769102, 563958943, 564149201, 564393759, 564619005, 564832807, 565124750, 565386653, 565488398, 565587759, 565857291]
3997.6E65857291
$$ y = [565857291]
##END=$$ End of the data block
