##TITLE=$$ Begin of the data block
##JCAMP-DX=5.00 $$ ACD/SpecManager v 10.08
##SPECTROMETER/DATA SYSTEM=Alpha
##DATE=26 Dec 2014 10:25:20
##DATA TYPE=INFRARED SPECTRUM
##DATA CLASS=XYDATA
##ORIGIN=
##OWNER=
##NPOINTS=1765
##FIRSTX=399.76428223
##LASTX=3997.64306641
##MAXX=3997.64306641
##MINX=399.76428223
##MAXY=0.74742311
##MINY=0.08161352
##XFACTOR=1.0000000000
##YFACTOR=1.000000000000000e-9
##FIRSTY=0.39177445
##DELTAX=2.03961372
##XUNITS=1/CM
##YUNITS=ARBITRARY UNITS
##XYDATA=(X++(Y..Y))
399.8C91774446p439047n845309l908783j604020R73045K674282K617508J528055Q225
418.1C80778402j282722j735508k517194l410220l925413m285037m111111l421188
434.4C56090009k331733m67688K044499M527688N864352N895525N140126L753244J938642
452.8C82454664J75148q98987j507640j900733k449393l271103m085123m516334m533261
471.2C59467238m167288l175408k377272k211749k069503j436293l48419M75347L61055
489.5C44517708n51284j726388k383352k211064j976043k361953l091127l725081m000277
507.9C22491139l839314l845781m231155m890889n562097n477756m433244k932966
524.2B87277937j562566o16431K146O92725J928210L960461O170660P193595O300330
$$ y = [391774446, 384335399, 378490090, 374581307, 372977287, 373950332, 376624614, 379242122, 380770177, 380778402, 379495680, 377760172, 375242978, 371832758, 367907345, 363622308, 359511197, 356090009, 353758276, 353290588, 355335087, 359862775, 365727127, 371622652, 376762778, 380516022, 382454664, 382629812, 381730825, 380223185, 378322452, 375873059, 372601956, 368516833, 364000499, 359467238, 355299950, 352124542, 349747270, 347535521, 345466018, 344029725, 343681306, 344156653, 344517708, 343966424, 342240036, 339856684, 337645620, 335669577, 333307624, 330216497, 326491416, 322491139, 318651825, 314806044, 310574889, 305684000, 300121903, 294644147, 290210903, 287277937, 285715371, 285098940, 285101086, 285793811, 287722021, 291682482, 297853142, 305046737, 311347067]
542.5C11347067M149825J958310M10408m58091j201183k378613l803789m915655n508214
560.9B99600065n901993o539881p684350q462280p425099m738093j565277J600086
577.2B58883178M490227O607204P759750Q055240P550836O320268M594177K498597
593.5C06759477O66320k41965m06921k93106j26451L3200J80989M98504J016289J773774
613.9C09860110K782315L584862L954351M123569M168897M155040M169971L975540
630.2C40774655L387332K502054J689047J387328J551032J716941J614333J257807
646.6C55880529R18984Q90970J207114J622259J736582J460850J064092Q70883P52181
664.9C66404444R77814K127975K297700J723677J507848J542658J792908K063602K046853
$$ y = [311347067, 315496892, 317455202, 317865610, 317407519, 316206336, 313827723, 310023934, 305108279, 299600065, 293698072, 287158191, 279473841, 271011561, 263586462, 258848369, 257283092, 258883178, 263373405, 269980609, 277740359, 285795599, 293346435, 299666703, 304260880, 306759477, 307425797, 307183832, 306776911, 306483805, 306357354, 306390554, 306571543, 307070047, 308086336, 309860110, 312642425, 316227287, 320181638, 324305207, 328474104, 332629144, 336799115, 340774655, 344161987, 346664041, 348353088, 349740416, 351291448, 353008389, 354622722, 355880529, 356799513, 357690483, 358897597, 360519856, 362256438, 363717288, 364781380, 365652263, 366404444, 367382258, 369510233, 371807933, 373531610, 375039458, 376582116, 378375024, 380438626, 382485479]
683.3C82485479J541823P99060K28465j89513o68377j366287k478153l738999m484952
701.6C72128546m343420l315777j696318R686J563132K961129M268497N582511O966382
720C84124368Q009226Q210122P814080P181406O503164N908311N340397M535943L268213
738.3D40895230J797378M46438p50035j986116l420085m970818o301582p070124p095009
756.7D11545277o434739n340189l934264k149790J63167L052116O212413R075522J1178911
775.1D23368424J2232363J2072295J1003912R768307Q740962P716745O552458N432456
791.4D96887922M797757M971802N827725O611884O499767N373538L825724K641320
807.7E37437439K098620J929104J590669Q33869j12235q84235j398802j932740k883196
$$ y = [382485479, 384027302, 384826362, 385054827, 384865314, 384196937, 382830650, 380352497, 376613498, 372128546, 367785126, 364469349, 362773031, 362782717, 364345849, 367306978, 371575475, 377157986, 384124368, 392133594, 400343716, 408157796, 415339202, 421842366, 427750677, 433091074, 437627017, 440895230, 442692608, 443139046, 442389011, 440402895, 436982810, 432011992, 425710410, 418640286, 411545277, 405110538, 399770349, 395836085, 393686295, 393849462, 396901578, 403113991, 412189513, 423368424, 435600787, 447673082, 458676994, 468445301, 477186263, 484903008, 491455466, 496887922, 501685679, 506657481, 512485206, 519097090, 525596857, 530970395, 534796119, 537437439, 539536059, 541465163, 543055832, 543889701, 543777466, 542893231, 541494429, 539561689, 536678493]
826E36678493m404664o167173p559717q095145p892073p384419o938219o774247o752342
844.4D74710494o495505n979866n625546n843192o715328p694423p335037l950745
860.7D25070852K404153R240032J4066189J6504020J7221868J6361028J3854086J0105789
877E24828017N663693R24408l484726o728589q378268q793532q682490q452713q237988
895.4D78657812q013398p662653p377446p648289q717865j0293126j1793196j2886107
911.7D04265732j3528467j3589441j2840957j1064470q283227n127728k471358o44416
928C36715668O82354J912564L116191M226088N329073O516456P221610O091356K345562
946.4C74156922l026664q196950j2121886j4781863j6524106j7628550j8305988j8721133
$$ y = [536678493, 532273829, 526106656, 518546939, 510451794, 502559721, 495175302, 488237083, 481462836, 474710494, 468214989, 462235123, 456609577, 450766385, 444051057, 436356634, 429021597, 425070852, 427475005, 436715037, 450781226, 467285246, 484507114, 500868142, 514722228, 524828017, 530491710, 531416118, 527931392, 521202803, 512824535, 504031003, 495348513, 486895800, 478657812, 470644414, 462981761, 455604315, 447956026, 439238161, 428945035, 417151839, 404265732, 390737265, 377147824, 364306867, 353242397, 344959170, 339831442, 337360084, 336715668, 337398022, 339310586, 342426777, 346652865, 351981938, 358498394, 365720004, 371811360, 374156922, 371130258, 362933308, 350811422, 336029559, 319505453, 301876903, 283570915, 264849782]
962.7B64849782j8931493j8985838j8942997j8737405j8195421j7224952j5832514
977A37999162j4048092j1946626r703711p501110n459584l723540k334833j242295
993.3H2039371m25853J26139M79154O74650O67192M36671J04949j73703l07597k25067
1013.7H3395906O6161N19067J052134J593202K073921K457656K715297K796755K707444
1032I9377543K396218J823291J118906N45152K64555L07076N72793J016669J777373
1050.4A09199576K887949M176721N359531O334059P285461Q267775Q598700O902412
1066.7A59012184K247408m057035q642033r233251o668434l310531o10694J280695
1083A30018309K659917L692016M508897N205781N609870N434528M554122L135294J646042
$$ y = [264849782, 245918289, 226932451, 207989454, 189252049, 171056628, 153831676, 137999162, 123951070, 112004444, 102300733, 94799623, 89340039, 85616499, 83281666, 82039371, 81613518, 81739657, 82218811, 82893461, 83560653, 83997324, 84102273, 83928570, 83620973, 83395906, 83462067, 83981134, 85033268, 86626470, 88700391, 91158047, 93873344, 96670099, 99377543, 101773761, 103597052, 104715958, 105261110, 105525665, 105832741, 106405534, 107422203, 109199576, 112087525, 116264246, 121623777, 127957836, 135243297, 143511072, 152109772, 159012184, 161259592, 157202557, 148560524, 139327273, 132658839, 129348308, 128737614, 130018309, 132678226, 136370242, 140879139, 146084920, 151694790, 157129318, 161683440, 164818734, 166464776]
1101.4A66464776P24643P54893J646400K837777L695190L973782L759294L224627K492964
1119.8A89574346J780912J430735J759574K765507L945946M425243L529414J286760
1136.1B10498437j700639m578799o615296p535369p539972o875858n739823m360706
1152.4A65551975k884104j403422L3871J478761L057599M857585O924793R134203J1181593
1170.7A97932854J2849763J4033288J4671907J4915422J4925837J4642268J3932437
1185B97903776J2633979J0711819Q408606O146700M322856L090144K328574J934797
1201.3C47481251J894295K227128L029257M216194N434245O224513O294369N697519
1217.7C82498771M624158L241032J710028K01821j107394k074481k590656k635300
$$ y = [166464776, 167189419, 167944312, 169590712, 172428489, 176123679, 180097461, 183856755, 187081382, 189574346, 191355258, 192785993, 194545567, 197311074, 201257020, 205682263, 209211677, 210498437, 208797798, 204218999, 197603703, 190068334, 182528362, 175652504, 169912681, 165551975, 162667871, 161264449, 161298320, 162777081, 165834680, 170692265, 177617058, 186751261, 197932854, 210782617, 224815905, 239487812, 254403234, 269329071, 283971339, 297903776, 310537755, 321249574, 329658180, 335804880, 340127736, 343217880, 345546454, 347481251, 349375546, 351602674, 354631931, 358848125, 364282370, 370506883, 376801252, 382498771, 387122929, 390363961, 392073989, 392275810, 391168416, 389093935, 386503279, 383867979]
1234C83867979k377391k042144j689732j174003l43830P32988J790673K535403K778589
1252.3C84078532K543778K034276J493246J154303J147598J491726K050072K495706
1268.6C98489237K624124K357543J655548P41423j13160q20339j256376j327992j173853
1287D01176155j086355j311898j853883k470970k896935l030181k920479k739757k709299
1305.4C80156398k820492k733171k283394j771868j502037j547575j889407k566129
1321.7C63042325l636867m972994o169379o776244o637007n847394m603595l121793
1338C21277052j601159l67374L34680N99057N41240K83629O467k54274n47468q62748
1358.4C19409102j068562j032233p01636l37482j4722L85910Q85636J426816J586318
$$ y = [383867979, 381490588, 379448444, 377758712, 376584709, 376240879, 376973867, 378764540, 381299943, 384078532, 386622310, 388656586, 390149832, 391304135, 392451733, 393943459, 395993531, 398489237, 401113361, 403470904, 405126452, 405867875, 405754715, 404934376, 403678000, 402350008, 401176155, 400089800, 398777902, 396924019, 394453049, 391556114, 388525933, 385605454, 382865697, 380156398, 377335906, 374602735, 372319341, 370547473, 369045436, 367497861, 365608454, 363042325, 359405458, 354432464, 348263085, 341486841, 334849834, 329002440, 324398845, 321277052, 319675893, 319308519, 319643199, 320242256, 320783496, 321067125, 321073592, 320819318, 320271850, 319409102, 318340540, 317308307, 316606671, 316269189, 316254467, 316640377, 317526013, 318952829, 320539147]
1376.7C20539147J483947J569420K036243L033758M520595N064338L940523K623826
1393.1C44811797J384914O9380r15468j415491j758158k149165k306074k350509k398759
1411.4C32972467k201915j795053j401782q50797j40041M72903R45509J260876J604945
1429.8C30867112J816600J820416K266287K706468K268464J968175J633197J013279
1446.1C46359998K27332o77287j433135j892924k476185k304733n51611R79393K913326
1464.5C41144174M866779N839229P788181J1872590J3237804J1425584J0199786R713769
1480.8D16087896R341240Q357077P944167Q483201Q275003O332039N513996O239921
1497.1D76574540N943865M667341L667653M024327N770594M643738L104687K898156
$$ y = [320539147, 322023094, 323592514, 325628757, 328662515, 333183110, 338247448, 342187971, 344811797, 346196711, 346266091, 345350623, 343935132, 342176974, 340027809, 337721735, 335371226, 332972467, 330770552, 328975499, 327573717, 326722920, 326582879, 327055782, 328001291, 329262167, 330867112, 332683712, 334504128, 336770415, 339476883, 341745347, 343713522, 345346719, 346359998, 346587330, 345910043, 344476908, 342583984, 340107799, 337803066, 337251455, 338230848, 341144174, 346010953, 351850182, 359638363, 371510953, 384748757, 396174341, 406374127, 416087896, 425429136, 433786213, 441730380, 450213581, 458488584, 464820623, 470334619, 476574540, 482518405, 487185746, 490853399, 494877726, 500648320, 505292058, 508396745, 511294901]
1513.4E11294901K982259L225506L150641L418327L192305K631665K662658K249003
1529.7E34807265K105415K416551J807570J233042K081453K228082J295387Q63135
1546E48837900N30064L99769K55525j8299l70443m47333o10530j114845j526118j768231
1566.4E44167459k018154k312958k277970k385736k823591k765477k543389k623082
1582.8E24417102k675414k736628k824902k943158k940178k858758k803445k812386
1599.1E01822233k925247l043204l116727l198385l370554l430932l424734l792495
1615.4D75519955m308402l691316l257901l519207l484070l436208l354043k791047
1631.7D47677761k196014j707762j051724o79404m18752n1528Q05586J686067J354217
$$ y = [511294901, 514277160, 517502666, 520653307, 524071634, 527263939, 529895604, 532558262, 534807265, 536912680, 539329231, 541136801, 542369843, 544451296, 546679378, 547974765, 548837900, 549367964, 549767733, 550023258, 550004959, 549634516, 549187183, 548576653, 547461808, 545935690, 544167459, 542149305, 539836347, 537558377, 535172641, 532349050, 529583573, 527040184, 524417102, 521741688, 519005060, 516180158, 513237000, 510296822, 507438064, 504634619, 501822233, 498896986, 495853782, 492737055, 489538670, 486168116, 482737184, 479312450, 475519955, 471211553, 467520237, 464262336, 460743129, 457259059, 453822851, 450468808, 447677761, 445481747, 443773985, 442722261, 442042857, 441624105, 441572577, 442378163, 444064230, 445418447]
1650.1D45418447K124936M262596L200203K466470L147215M302889M758865M115134
1666.4D73796755M753709O062090N553663O048799P020801O125390N400956O320954
1682.7E21083117Q744716P346392N559802N616248M828155M877269N171835M789412
1699E68016946N185902L737987K841949L031313K509892K132476K137005K502978L418148
1717.4E95514596L155231K114058K084374K396345K334774K218127K088487K733111
1733.7F14639103K763212J806080K187908K796829K762794K777279L088474L935933
1750F36757612M362285L675163L506541L584683L232062L309965K919615K375483K325416
1768.4F66048825K286196K496898K220332J547695J518309J769960J688003J491904
$$ y = [445418447, 447543383, 451805979, 455006182, 457472652, 460619867, 464922756, 469681621, 473796755, 478550464, 484612554, 490166217, 496215016, 503235817, 509361207, 514762163, 521083117, 529827833, 537174225, 542734027, 548350275, 553178430, 558055699, 563227534, 568016946, 573202848, 576940835, 579782784, 582814097, 585323989, 587456465, 589593470, 592096448, 595514596, 598669827, 600783885, 602868259, 605264604, 607599378, 609817505, 611905992, 614639103, 617402315, 619208395, 621396303, 624193132, 626955926, 629733205, 632821679, 636757612, 641119897, 644795060, 648301601, 651886284, 655118346, 658428311, 661347926, 663723409, 666048825, 668335021, 670831919, 673052251, 674599946, 676118255, 677888215, 679576218, 681068122]
1784.7F81068122J301885R92119J160622J825392J638532J092076J071990J306772
1801F91457510J312137J130342J077891J139998J214683J062632Q71956Q97288R50575
1819.4G01115012Q29220P83265Q58307P15613P62045Q98659P21515O22511O05940L47496
1839.8G08259583J22189M29690P10189N11647L98278L17156K04682J86265K42352L36767
1860.2G11718798L42190J97232P4506K86579N30958M33504M04299M67837M43875L68595
1880.5G15268373L58940M45604N07891O08146O16312L48747K07007K71916L10421L51727
1900.9G19295084L19303J52111N781M0591J81258K24173J85787K28346J76608J2935
1921.3G20821977J39534L24607L26216K46704R4592j967M4108J44064J72139K44319
$$ y = [681068122, 682370007, 683362126, 684522748, 686348140, 687986672, 689078748, 690150738, 691457510, 692769647, 693899989, 694977880, 696117878, 697332561, 698395193, 699267149, 700164437, 701115012, 701944232, 702727497, 703585804, 704301417, 705063462, 705962121, 706683636, 707306147, 707912087, 708259583, 708381772, 708811462, 709521651, 710033298, 710431576, 710748732, 710953414, 711139679, 711382031, 711718798, 712060988, 712258220, 712332726, 712619305, 713150263, 713583767, 713988066, 714455903, 714899778, 715268373, 715627313, 716072917, 716580808, 717188954, 717805266, 718154013, 718361020, 718632936, 718943357, 719295084, 719614387, 719766498, 719772279, 719812870, 719994128, 720218301, 720404088, 720632434, 720809042, 720821977, 720961511, 721286118, 721612334, 721859038, 721953630, 721951663, 721995771, 722139835, 722311974, 722556293]
1941.7G22556293K84493J51098Q9466K04921L66688M11630L30388K39730J89602J67668
1962.1G24991977K09153L30865M07398K83897J23560J05620J74165K50935K51293J65999
1982.5G27294862M1962k3603N36J16765K39075J69754K9027l7312q4520j10984r3042
2005G27542520j17124k26497l78728n01812n09083m27306m22597n44190o88970p46489
2025.4G22979724o25133m72427m30166m67658n64754o43015o28829n53549m56392l52919
2045.8G17784882l14892l14533k79189k18093j05739K4677Q3923P8619P0929O8486
2066.2G16879070P4506J04904J55806J51992N8174l4153m1127J7643R8168J83642K06173
2088.6G17854798J39952P8141J07646J96755K74241K80738K22862J68323J44601J68562
$$ y = [722556293, 722840786, 722991884, 723081350, 723286271, 723652959, 724064589, 724394977, 724634707, 724824309, 724991977, 725201130, 725531995, 725939393, 726223290, 726346850, 726452470, 726626635, 726877570, 727128863, 727294862, 727336824, 727313221, 727313757, 727430522, 727669597, 727839351, 727868378, 727831066, 727746546, 727635562, 727542520, 727425396, 727198899, 726820171, 726318359, 725809276, 725381970, 724959373, 724415183, 723726213, 722979724, 722354591, 721882164, 721451998, 720984340, 720419586, 719776571, 719147742, 718594193, 718137801, 717784882, 717469990, 717155457, 716876268, 716658175, 716552436, 716577113, 716661036, 716739655, 716810584, 716879070, 716953576, 717058480, 717214286, 717366278, 717424452, 717390299, 717349172, 717366815, 717464983, 717648625, 717854798, 717994750, 718072891, 718180537, 718377292, 718651533, 718932271, 719155133, 719323456, 719468057, 719636619]
2109G19636619K21551K37703J83821Q1122j9610m0830J4425P5757Q9348K6643m4525
2131.4G20462024m5657K1935P1287O8485N2870J2636k5392q702N6028J50741K13861
2153.9G21030116J85371J54137K08736L35037M86851N70893N55754N36799N55873N93603
2174.3G25213170O74546P52628P51018O72698N77867N49853O17564O83367O47008N51343
2194.6G31691062M71414M44412M75585N50807O13868N98848N31018M89711N22852N87404
2215G36976981O08802N66661M79997L79860L32355L76583M46081M37379L57806K89739
2235.4G41252244K47836K45273K95996L35813L02851K23220J91569K10285J84655J86742
2255.8G43676484K71022K90871K29656J87934K08199K70664L25442L33011K97964K48313
$$ y = [719636619, 719858170, 720095873, 720279694, 720360816, 720341206, 720300376, 720314801, 720390558, 720479906, 720506549, 720462024, 720416367, 720438302, 720509589, 720578074, 720630944, 720643580, 720618188, 720609486, 720665514, 720816255, 721030116, 721215487, 721369624, 721578360, 721913397, 722400248, 722971141, 723526895, 724063694, 724619567, 725213170, 725887716, 726640344, 727391362, 728064060, 728641927, 729191780, 729809344, 730492711, 731139719, 731691062, 732162476, 732606888, 733082473, 733633280, 734247148, 734845996, 735377014, 735866725, 736389577, 736976981, 737585783, 738152444, 738632441, 739012301, 739344656, 739721239, 740167320, 740604699, 740962505, 741252244, 741500080, 741745353, 742041349, 742377162, 742680013, 742903233, 743094802, 743305087, 743489742, 743676484, 743947506, 744238377, 744468033, 744655967, 744864166, 745134830, 745460272, 745793283, 746091247, 746339560]
2276.2G46339560K27153K38657K02834J25528P8380P4923P1824M6730J7523k8431o7830
2298.7G47326851j00732j63972k49505l02911k78115k32518k27928k81453m33028n95212
2319.1G44461477n85735m16815l29733m12286m09603k83181l40224m89711m31538k68102
2339.5G40494549j26004K20358N97656N6744j013875j479805j220107q91328p17044
2357.8G35921144m57763n4419L01480N22316O48856O46352N58556N00142N25475N46872
2378.2G39659011M45485K21491o914j53363k21729k53737k81989l48807m30345m59016
2398.6G38170087m49419m14669l94941m64975n94259p06076p34270o46114n73397o40035
2419G32551932p93874q96990q89242q54134q18193q08776q85010r82642j015186r69827
$$ y = [746339560, 746566713, 746805370, 747008204, 747133732, 747212112, 747287035, 747358859, 747405589, 747423112, 747394681, 747326851, 747226119, 747062147, 746812642, 746509731, 746231616, 745999098, 745771170, 745489717, 745056689, 744461477, 743875742, 743458927, 743129194, 742716908, 742307305, 742024124, 741683900, 741194189, 740762651, 740494549, 740368545, 740588903, 741186559, 741243303, 740229428, 738749623, 737529516, 736638188, 735921144, 735463381, 735408962, 735710442, 736232758, 736881614, 737527966, 738086522, 738586664, 739112139, 739659011, 740104496, 740325987, 740319073, 740165710, 739943981, 739690244, 739408255, 739059448, 738629103, 738170087, 737720668, 737305999, 736911058, 736446083, 735851824, 735145748, 734411478, 733765364, 733191967, 732551932, 731758058, 730861068, 729971826, 729117692, 728299499, 727490723, 726605713, 725623071, 724607885, 723638058]
2439.4G23638058q79467q27193q77380r84133j053989j022398r02176p90358p88450
2457.8G15512514q94964r92655r65357q41081p50840p39455p73251q37744q80777q35360
2478.1G07001030p44104o91593o94334p25031p47740p13587o07371n07057m77433n25594
2498.5G00567186n90384n75543n24938m95612m48525m52042n33700n79595n69404n67913
2518.9F95229530n98311o48558p29859q16226q55148q56221q60631q88944r29475r77873
2539.3F87068284j023829j027346r75430r14812r04322r64582j024604j022100r80377
2557.7F78230882r18925q96096r38535r67920r62794r58740r48549r22262q90732q79646
2578.1F68946683q89957q85665q64625q42035q12530p64489p27535p10428o69956o16729
$$ y = [723638058, 722758591, 721931398, 721054018, 720069885, 719015896, 717993498, 717091322, 716300964, 715512514, 714617550, 713624895, 712659538, 711818457, 711067617, 710328162, 709554911, 708717167, 707836390, 707001030, 706256926, 705565333, 704870999, 704145968, 703398228, 702684641, 702077270, 701570213, 701092780, 700567186, 699976802, 699401259, 698876321, 698380709, 697932184, 697480142, 696946442, 696366847, 695797443, 695229530, 694631219, 693982661, 693252802, 692436576, 691581428, 690725207, 689864576, 688975632, 688046157, 687068284, 686044455, 685017109, 684041679, 683126867, 682222545, 681257963, 680233359, 679211259, 678230882, 677311957, 676415861, 675477326, 674509406, 673546612, 672587872, 671639323, 670717061, 669826329, 668946683, 668056726, 667171061, 666306436, 665464401, 664651871, 663887382, 663159847, 662449419, 661779463, 661162734]
2598.5F61162734n84483n91397o77824q29876r38713r65417r66251j011312j139700
2616.8F53457761j293600j402020j435995j420558j436055j521527j646042j731038
2633.2F41570926j725138j673519j634836j624585j642942j691937j756370j727343
2649.5F28094256j608789j553655j542449j548946j626789j668155j567305j432955
2665.8F15545213j399636j446843j481414j456201j376867j269877j189649j169026
2682.1F04755700j217962j313507j343429j281262j247763j304627j413166j514018
2698.4E94119966j559257j547814j523018j538634j607716j668334j656294j577377
2714.7E81441522j466036j375854j353145j376092j388192j326681j213014j119673
$$ y = [661162734, 660578251, 659986854, 659309030, 658479154, 657540441, 656575024, 655608773, 654597461, 653457761, 652164161, 650762141, 649326146, 647905588, 646469533, 644948006, 643301964, 641570926, 639845788, 638172269, 636537433, 634912848, 633269906, 631577969, 629821599, 628094256, 626485467, 624931812, 623389363, 621840417, 620213628, 618545473, 616978168, 615545213, 614145577, 612698734, 611217320, 609761119, 608384252, 607114375, 605924726, 604755700, 603537738, 602224231, 600880802, 599599540, 598351777, 597047150, 595633984, 594119966, 592560709, 591012895, 589489877, 587951243, 586343527, 584675193, 583018899, 581441522, 579975486, 578599632, 577246487, 575870395, 574482203, 573155522, 571942508, 570822835]
2731.1E70822835j054108j045823j088620j089453j035452r89974r99868j029133r98080
2749.4E61492324r47774r38236r06289q35001p69616p42971p95305q52704q28028q06928
2769.8E53069472q90851j024544j109123j166284j217425j258373j331151j440048
2786.1E43631673j551569j642942j721501j795650j861751j947939k077043k209425
2802.4E28823853k325178k431631k494633k532840k622783k733529k806782k878905
2818.8E07997572k978026l084720l168106l264516l396780l520459l611743l676712
2835.1D81296510l797442m002720m224897m475951m777402n021035n034536m752696
2851.4D45209831m294217l838271l532528l481985l740638m294395m988224n655080
$$ y = [570822835, 569768727, 568722904, 567634284, 566544831, 565509379, 564519405, 563519537, 562490404, 561492324, 560544550, 559606314, 558700025, 557865024, 557095408, 556352437, 555557132, 554704428, 553876400, 553069472, 552178621, 551154077, 550044954, 548878670, 547661245, 546402872, 545071721, 543631673, 542080104, 540437162, 538715661, 536920011, 535058260, 533110321, 531033278, 528823853, 526498675, 524067044, 521572411, 519039571, 516416788, 513683259, 510876477, 507997572, 505019546, 501934826, 498766720, 495502204, 492105424, 488584965, 484973222, 481296510, 477499068, 473496348, 469271451, 464795500, 460018098, 454997063, 449962527, 445209831, 440915614, 437077343, 433544815, 430062830, 426322192, 422027797, 417039573, 411384493]
2867.7D11384493o220460o583243o694586o638646o442397n999715n249858m327803
2884C63227785l402204k524286j740754j134395p86722o91652p38740q70645j077414
2902.4C50260973j343846j710475k184182k716542l302246l878474m308015m519642
2918.7C26297551m498154m189312l582120k741814j692563m67449Q82804K296925L593087
2937C15898955M652560N518078O183863O629497O872922O997645P124156P228791P246793
2955.4C74353260P227331P153988O919801O531775O063074N623788N284041N024850
2971.7D24181908M841328M701734M573226M408449M163205L847331L469110L048628
2988D57234919K661377K364964K085030J744955J352519R42707N59390J96397j69754
$$ y = [411384493, 405164033, 398580790, 391886204, 385247558, 378805161, 372805446, 367555588, 363227785, 359825581, 357301295, 355560541, 354426146, 353639424, 352947772, 352209032, 351338387, 350260973, 348917127, 347206652, 345022470, 342305928, 339003682, 335125208, 330817193, 326297551, 321799397, 317610085, 314027965, 311286151, 309593588, 309126139, 310008943, 312305868, 315898955, 320551515, 326069593, 332253456, 338882953, 345755875, 352753520, 359877676, 367106467, 374353260, 381580591, 388734579, 395654380, 402186155, 408249229, 413873017, 419157058, 424181908, 429023236, 433724970, 438298196, 442706645, 446869850, 450717181, 454186291, 457234919, 459896296, 462261260, 464346290, 466091245, 467443764, 468386471, 468945861, 469142258, 468972504]
3006.4D68972504n19484q52704j196593j535505j815230k014130k190858k377660k553194
3024.7D53917146k728522k867192k923906k941072l002375l131062l218323l236294
3041.1D29868400l292769l380776l411442l376931l379523l447891l464222l434747
3057.4D02680099l445625l455431l425628l407031l454476l509462l476203l394514
3073.7C75111729l300786l248751l321410l394782l378749l347665l305852l287793
3090C48525941l362447l398686l274978l126770l132879l233314l198296l042757k999664
3108.4C19756150l086745l077627k933860k853572k890348k989382l090113l061891
3124.7B95772612k895653k754331k756566k826780k769738k607972k534031k593846
$$ y = [468972504, 468453020, 467600316, 466403723, 464868218, 463052988, 461038858, 458848000, 456470340, 453917146, 451188624, 448321432, 445397526, 442456454, 439454079, 436323017, 433104694, 429868400, 426575631, 423194855, 419783413, 416406482, 413026959, 409579068, 406114846, 402680099, 399234474, 395779043, 392353415, 388946384, 385491908, 381982446, 378506243, 375111729, 371810943, 368562192, 365240782, 361846000, 358467251, 355119586, 351813734, 348525941, 345163494, 341764808, 338489830, 335363060, 332230181, 328996867, 325798571, 322755814, 319756150, 316669405, 313591778, 310657918, 307804346, 304913998, 301924616, 298834503, 295772612, 292876959, 290122628, 287366062, 284539282, 281769544, 279161572, 276627541, 274033695]
3141B74033695k655893k619475k526820k401978k327293k410829k502263k420663k273053
3159.4B51895428k233044k269327k224088k109200k055123k050504k058119k057373
3175.7B34838650k002851j897200j823247j815066j815512j801879j746282j671359
3192B20265254j675218j692578j633421j575231j534194j469404j416683j447677j480192
3210.3B06340656j411781j333997j301303j295984j278639j237809j220912j203895
3226.7A96056336j131549j008794r43407j055748j184523j138404j032591r39294q55714
3245A86766312q66756r43825r39295q52286q17538q44329q24467p64161p43449p42838
3265.4A78427368o63519n56126o21229p50899p62970p48679p00310n82546n12078n23463
$$ y = [274033695, 271377802, 268758327, 266231507, 263829529, 261502236, 259091407, 256589144, 254168481, 251895428, 249662384, 247393057, 245168969, 243059769, 241004646, 238954142, 236896023, 234838650, 232835799, 230938599, 229115352, 227300286, 225484774, 223682895, 221936613, 220265254, 218590036, 216897458, 215264037, 213688806, 212154612, 210685208, 209268525, 207820848, 206340656, 204928875, 203594878, 202293575, 200997591, 199718952, 198481143, 197260231, 196056336, 194924787, 193915993, 192972586, 191916838, 190732315, 189593911, 188561320, 187622026, 186766312, 185899556, 184955731, 184016436, 183164150, 182346612, 181502283, 180677816, 179913655, 179170206, 178427368, 177763849, 177207723, 176586494, 175835595, 175072625, 174323946, 173623636, 173041090, 172529012, 172005549]
3285.8A72005549n35786n18903n33164n91591o04465n81727n79268n20274m23744m25890
3306.2A66690737n32418o81460p73594p15837n77301m90308m96253n19678n12376n52834
3326.6A60838678o25759o16893n33253m42147l94494m41685n39660n84349n81071n05716
3347A55573651l77595m29631o18323o34104m88386l86715l98308m30718l32847k29612
3367.4A51247412l52785o06388o61194m68731l19570l27602m08173l83556k18213m6789
3387.8A47454411L2604r7186l04758k72081j877J24261j19508l67999k80663j06320
3408.2A46060884l9548l3945j13472j83478r4548L2664O7606J04770J93089K72364
3428.6A46266386K46286K55257L29107J84983n6326j7673K35677M00677L91051K86013
$$ y = [172005549, 171469763, 170950860, 170417696, 169826105, 169221640, 168639913, 168060645, 167540371, 167116627, 166690737, 166158319, 165476859, 164703265, 163987428, 163410127, 162919819, 162423566, 161903888, 161391512, 160838678, 160212919, 159596026, 159062773, 158620626, 158226132, 157784447, 157244787, 156660438, 156079367, 155573651, 155196056, 154766425, 154148102, 153513998, 153025612, 152638897, 152240589, 151809871, 151477024, 151247412, 150894627, 150288239, 149627045, 149158314, 148838744, 148511142, 148102969, 147719413, 147501200, 147454411, 147487015, 147389829, 147085071, 146812990, 146811113, 146935374, 146815866, 146447867, 146167204, 146060884, 146021336, 145987391, 145873919, 145690441, 145595893, 145628557, 145696163, 145800933, 145994022, 146266386, 146512672, 146767929, 147097036, 147282019, 147225693, 147208020, 147443697, 147844374, 148235425, 148521438]
3449A48521438K64511L55944M53830N35547N94527N38975N13717O85141P76291N63875
3469.4A53803796K85849K93612M97371O89879P31468N84767N64828P36505P42510O31049
3489.8A59561634P02784Q22722Q31634P89389Q15168Q47638P15941O12557P47487R50187
3510.2A67397141J074627J019076Q33392P95186R52109J122222J020729Q04767Q60513
3528.5A75879762J068249J204163J289740J241222J103163J207813J432494J471504
3544.8A85898110J331538J278818J412332J594678J698464J768931J905948J989499
3561.1A98878318J889095J896828K367884K692416K527953K453193K614945K789348
3577.5B18109980K972692L113464L051803K997741L245234L406286L218592L333762
$$ y = [148521438, 148785949, 149141893, 149595723, 150131270, 150725797, 151264772, 151778489, 152463630, 153239921, 153803796, 154089645, 154383257, 154880628, 155570507, 156301975, 156886742, 157451570, 158188075, 158930585, 159561634, 160264418, 161087140, 161918774, 162708163, 163523331, 164370969, 165086910, 165699467, 166446954, 167397141, 168471768, 169490844, 170324236, 171119422, 172071531, 173193753, 174214482, 175019249, 175879762, 176948011, 178152174, 179441914, 180683136, 181786299, 182994112, 184426606, 185898110, 187229648, 188508466, 189920798, 191515476, 193213940, 194982871, 196888819, 198878318, 200767413, 202664241, 205032125, 207724541, 210252494, 212705687, 215320632, 218109980, 221082672, 224196136, 227247939, 230245680, 233490914, 236897200, 240115792, 243449554]
3593.8B43449554L696397L839284L847808L850698L701359L620833L972650M150927
3610.1B74129510M045606M111170M034162M272997M766584M365206L686696L573179
3626.4C06985110M581094N248666M427343M203350M333078M288495M306495M204303
3642.7C42577934L867716L940523N041986N454809M229605L881365M617989M535943
3659C78147870L962845L774881L621638L421992L803164M038840L387660L844440M264742
3677.4D12268072L430337L076732K982140K861321L149271L462702L008991K540320
3693.7D36779886K498121K432972K339750K524495K453030K000153J860320K200365
3710D55089092K632052K393246J882672J728803J738429J770139J838773J881033J653701
$$ y = [243449554, 247145951, 250985235, 254833043, 258683741, 262385100, 266005933, 269978583, 274129510, 278175116, 282286286, 286320448, 290593445, 295360029, 299725235, 303411931, 306985110, 311566204, 316814870, 321242213, 325445563, 329778641, 334067136, 338373631, 342577934, 346445650, 350386173, 355428159, 360882968, 365112573, 368993938, 373611927, 378147870, 382110715, 385885596, 389507234, 392929226, 396732390, 400771230, 404158890, 408003330, 412268072, 415698409, 418775141, 421757281, 424618602, 427767873, 431230575, 434239566, 436779886, 439278007, 441710979, 444050729, 446575224, 449028254, 451028407, 452888727, 455089092, 457721144, 460114390, 461997062, 463725865, 465464294, 467234433, 469073206, 470954239, 472607940]
3728.4D72607940J374692J560509K078772K314389J687109P95901Q12739J828015J689285
3746.7D86749351J016915J736313K085865J332610J035095J397758J520694J176506
3763.1D98051107J136899J290679J437604J478792J168251R51051J131177J429558
3779.4E08075118J237810R06527J021266J113653J063287R85623Q47816R31203R11773
3797.7E17094076Q86082J376450J165808Q85367J267016R66549M08411M77493J080751
3816.1E25608003J019538R17553J360298R03189N93245O54519O29961P67052P88570
3834.4E33241928Q26716J042187R44257Q42631Q49903M57644j00911j62780J205564
3852.8E39147139K280056Q72731J6094J49428O03855Q29518M84049O13332J040816
$$ y = [472607940, 473982632, 475543141, 477621913, 479936302, 481623411, 482419312, 483232051, 485060066, 486749351, 487766266, 489502579, 491588444, 492921054, 493956149, 495353907, 496874601, 498051107, 499188006, 500478685, 501916289, 503395081, 504563332, 505514383, 506645560, 508075118, 509312928, 510219455, 511240721, 512354374, 513417661, 514403284, 515251100, 516182303, 517094076, 517980158, 519356608, 520522416, 521407783, 522674799, 523641348, 524049759, 524527252, 525608003, 526627541, 527545094, 528905392, 529808581, 530401826, 531056345, 531686306, 532453358, 533241928, 534068644, 535110831, 536055088, 536897719, 537747622, 538205266, 538104355, 537941575, 539147139, 541427195, 542299926, 542316020, 542465448, 543069303, 543898821, 544382870, 544996202, 546037018]
3871.2E46037018Q25882N78285K34544L52263P97987O65725P81655N73397J25229N74231
3891.6E51546216P36713J80781O3062M12166P21157Q97526P47264L24190J80304J81496
3912E55990875Q6546K41637N49734M74393K26378L00646L78609J75118J85609M89414
3932.3E59098959N42164L17633J28210J27315L44336M20869L69131M59552L96311J73509
3952.7E62377989J37866K51233L31343L41534L14832K50816J59681J32561K02894L08216
3973.1E64808965L40700K45631J59144K22027K96355K38478J65403J92403K32459J98960
3993.5E67100525K02417K91705
3997.6E67594647
$$ y = [546037018, 546862900, 547441185, 547675729, 548027992, 548825979, 549491704, 550273359, 550846756, 550971985, 551546216, 552282929, 552463710, 552526772, 552938938, 553660095, 554557621, 555304885, 555629075, 555809379, 555990875, 556077421, 556319058, 556868792, 557343185, 557569563, 557870209, 558248818, 558423936, 558609545, 559098959, 559641123, 559958756, 560086966, 560214281, 560558617, 560979486, 561348617, 561808169, 562204480, 562377989, 562515855, 562767088, 563098431, 563439965, 563754797, 564005613, 564165294, 564297855, 564500749, 564808965, 565149665, 565395296, 565554440, 565776467, 566072822, 566311300, 566476703, 566669106, 566901565, 567100525, 567302942, 567594647]
##END=$$ End of the data block
