##TITLE=$$ Begin of the data block
##JCAMP-DX=5.00 $$ ACD/SpecManager v 10.08
##SPECTROMETER/DATA SYSTEM=Alpha
##DATE=26 Dec 2014 10:25:20
##DATA TYPE=INFRARED SPECTRUM
##DATA CLASS=XYDATA
##ORIGIN=
##OWNER=
##NPOINTS=1765
##FIRSTX=399.76428223
##LASTX=3997.64306641
##MAXX=3997.64306641
##MINX=399.76428223
##MAXY=0.74902940
##MINY=0.08173651
##XFACTOR=1.0000000000
##YFACTOR=1.000000000000000e-9
##FIRSTY=0.39155772
##DELTAX=2.03961372
##XUNITS=1/CM
##YUNITS=ARBITRARY UNITS
##XYDATA=(X++(Y..Y))
$$ plain form
399.8 391557723 384163320 377900302 373323619 371404350 372688591 375774592 378329068 379212052 378868967
418.1 378868967 377956629 376735210 374910742 371853948 367595226 363097280 359079152 355405629 352692574
436.5 352692574 352304965 354707807 359509826 365536004 371452421 376589835 380444288 382409394 382512927
454.8 382512927 381594181 380213141 378500909 376170725 372960955 368933201 364383578 359727085 355544657
473.2 355544657 352408230 349918634 347451746 345220834 343975931 344033778 344760656 345092058 344304621
491.5 344304621 342492342 340263814 338036358 335903883 333629191 330901980 327569813 323595941
507.9 323595941 319355428 315212369 310909599 305923551 300271839 294756263 290318072 287489474
524.2 287489474 286114603 285600573 285605222 286225498 288076133 292102844 298381835 305542976 311794192
$$ packed form
399.8C91557723p394403o263018m576683j919269J284241L086001K554476Q82984l43085
418.1C78868967r12338j221419j824468l056794m258722m497946m018128l673523k713055
436.5C52692574l87609K402842M802019O026178N916417N137414L854453J965106J03533
454.8C82512927r18746j381040j712232k330184l209770m027754m549623m656493m182428
473.2C55544657l136427k489596k466888k230912j244903N7847P26878L31402p87437
491.5C44304621j812279k228528k227456k132475k274692k727211l332167l973872
507.9C23595941m240513m143059m302770m986048n651712n515576m438191k828598
524.2B87489474j374871n14030M649O20276J850635M026711O278991P161141O251216
$$ plain form
542.5 311794192 316002727 318032295 318477482 317967176 316644847 314256847 310669780 306010962 300571442
560.9 300571442 294537157 287701339 279866487 271551073 264212042 259429812 257926971 259577960
577.2 259577960 263900518 270375729 278213918 286360323 293961763 300383121 305108756 307693332
593.5 307693332 308341533 307994306 307448924 307001442 306831419 306991696 307272047 307679385 308603764 310467005
613.9 310467005 313316673 316883266 320870847 325066924 329340100 333617628 337808520 341649711
630.2 341649711 344863176 347338825 349214941 350801259 352396458 354102790 355781227 357099801
646.6 357099801 357950568 358734995 359877944 361454189 363221347 364828110 366007000 366786510 367318153
664.9 367318153 368181080 370466441 372928977 374706358 376267850 377834111 379612684 381710529 383807123
$$ packed form
542.5C11794192M208535K029568M45187n10306j322329k388000l587067m658818n439520
560.9C00571442o034285o835818p834852q315414p339031m782230j502841J650989
577.2B59577960M322558O475211P838189Q146405P601440O421358M725635K584576
593.5C07693332O48201l47227n45382m47482j70023J60277K80351M07338R24379J863241
613.9C10467005K849668L566593L987581M196077M273176M277528M190892L841191
630.2C41649711L213465K475649J876116J586318J595199J706332J678437J318574
646.6C57099801Q50767P84427J142949J576245J767158J606763J178890P79510N31643
664.9C67318153Q62927K285361K462536J777381J561492J566261J778573K097845K096594
$$ plain form
683.3 383807123 385421276 386295915 386456639 386141986 385444492 384060949 381554425 377829999 373351306
701.6 373351306 369036913 365762860 364014298 363968372 365555912 368541539 372859836 378596842 385692477
720 385692477 393688321 401888222 409728736 416855425 423274606 429181516 434584618 439179033 442481995
738.3 442481995 444259942 444646239 443882972 441919684 438467383 433408737 427050561 419955611 412818193
756.7 412818193 406369418 401049137 397053659 394755632 394881636 398088634 404479116 413646162 424866825
775.1 424866825 437144786 449266493 460262984 469968200 478680074 486461639 493116409 498585284
791.4 498585284 503361821 508288801 514016628 520540893 527063966 532514036 536367416 539001942
807.7 539001942 541106880 543006361 544562399 545454085 545374274 544402063 542915106 540948868 538033783
$$ packed form
683.3C83807123J614153Q74639J60724l14653o97494j383543k506524l724426m478693
701.6C73351306m314393l274053j748562m5926J587540K985627M318297N737006P095635
720C85692477P995844Q199901P840514P126689O419181N906910N403102M594415L302962
738.3D42481995J777947L86297p63267j963288l452301n058646o358176p094950p137418
756.7D12818193o448775n320281l995478k298027J26004L206998O390482R167046J1220663
775.1D24866825J2277961J2121707J0996491R705216Q711874P781565O654770N468875
791.4D98585284M776537M926980N727827O524265O523073N450070L853380K634526
807.7E39001942K104938J899481J556038Q91686p9811r72211j486957j966238k915085
$$ plain form
826 538033783 533540905 527255893 519674063 511627495 503734529 496311724 489310145 482422084 475543320
844.4 475543320 468946695 462919682 457300186 451454192 444727212 437086701 429870099 425989330
860.7 425989330 428346068 437517256 451584518 468147159 485450506 501832366 515601039 525575280
877 525575280 531120539 531949282 528410435 521719873 513380170 504500091 495696813 487168849 478899121
895.4 478899121 470941901 463357985 455947846 448177099 439405441 429178476 417434573 404524207
911.7 404524207 390968412 377366394 364525020 353464663 345149428 339957118 337445170 336833388
928 336833388 337592393 339563221 342689425 346874058 352176070 358712852 365936279 371999532 374343842
946.4 374343842 371328592 363098800 350893080 336024404 319475532 301867634 283579558 264885157
$$ packed form
826E38033783m492878o285012p581830q046568p892966p422805p001579o888061o878764
844.4D75543320o596625o027013n619496n845994o726980p640511p216602l880769
860.7D25989330K356738R171188J4067262J6562641J7303347J6381860J3768673R974241
877E25575280N545259Q28743l538847o690562q339703q880079q803278q527964q269728
895.4D78899121p957220p583916p410139p770747q771658j0226965j1743903j2910366
911.7D04524207j3555795j3602018j2841374j1060357q315235n192310k511948o11782
928C36833388P59005J970828L126204M184633N302012O536782P223427O063253K344310
946.4C74343842l015250q229792j2205720j4868676j6548872j7607898j8288076j8694401
$$ plain form
962.7 264885157 245973870 226962939 207982212 189248532 171082035 153868690 138036013
977 138036013 123992421 112037480 102334782 94874181 89453824 85750662 83431922 82185246
993.3 82185246 81736505 81846617 82330428 83037682 83755501 84221579 84306255 84086567 83740704 83507471
1013.7 83507471 83611920 84200792 85292518 86849935 88859476 91266602 93941920 96724942 99447526
1032 99447526 101845786 103648134 104760483 105322808 105619423 105951376 106536463 107569382 109363161
1050.4 109363161 112278752 116474926 121794954 128058434 135305345 143564031 152142137 159009591
1066.7 159009591 161232322 157161713 148543984 139418632 132887021 129629672 128983438 130227834
1083 130227834 132877395 136530682 140957579 146116242 151772112 157279328 161853209 165003344 166689083
$$ packed form
962.7B64885157j8911287j9010931j8980727j8733680j8166497j7213345j5832677
977A38036013j4043592j1954941r702698p460601n420357l703162k318740j246676
993.3H2185246m48741J10112M83811P07254P17819M66078Q4676k19688l45863k33233
1013.7H3507471J04449N88872J091726J557417K009541K407126K675318K783022K722584
1032I9447526K398260J802348J112349N62325K96615L31953N85087J032919J793779
1050.4A09363161K915591M196174N320028O263480P246911Q258686Q578106O867454
1066.7A59009591K222731m070609q617729r125352o531611l257349o46234J244396
1083A30227834K649561L653287M426897N158663N655870N507216M573881L150135J685739
$$ plain form
1101.4 166689083 167429328 168190479 169837400 172638193 176288888 180258512 184037015 187269285 189770877
1119.8 189770877 191571742 193029910 194807306 197543666 201403782 205763698 209318534 210662171
1136.1 210662171 208964318 204350993 197724164 190201774 182682380 175818533 170089558 165770799
1152.4 165770799 162938878 161568522 161614656 163080484 166106701 170957655 177890658 187003672 198174119
1170.7 198174119 211039498 225082427 239761472 254675090 269573301 284174591 298066825
1185 298066825 310677558 321389288 329810411 335980058 340302229 343357921 345685273 347658098
1201.3 347658098 349579573 351825207 354870409 359096825 364526659 370732486 377029985 382747054
1217.7 382747054 387367576 390587240 392284036 392471015 391332984 389229536 386630654 384012640
$$ packed form
1101.4A66689083P40245P61151J646921K800793L650695L969624L778503L232270K501592
1119.8A89770877J800865J458168J777396K736360L860116M359916L554836J343637
1136.1B10662171j697853m613325o626829p522390p519394o863847n728975m318759
1152.4A65770799k831921j370356M6134J465828L026217M850954O933003R113014J1170447
1170.7A98174119J2865379J4042929J4679045J4913618J4898211J4601290J3892234
1185B98066825J2610733J0711730Q421123O169647M322171L055692K327352J972825
1201.3C47658098J921475K245634L045202M226416N429834O205827O297499N717069
1217.7C82747054M620522L219664J696796J86979j138031k103448k598882k618014
$$ plain form
1234 384012640 381679267 379698217 378049672 376881152 376534522 377276301 379081547 381613225 384368062
1252.3 384368062 386896998 388939500 390457064 391638964 392802328 394290179 396325707 398811162
1268.6 398811162 401413113 403722674 405372202 406165838 406065166 405221701 403985083 402710497 401581496
1287 401581496 400513530 399205953 397355527 394874066 391947806 388902426 386018634 383325875 380605936
1305.4 380605936 377755463 375028014 372763455 370995402 369479179 367909163 365986139 363379478
1321.7 363379478 359723449 354768962 348648697 341928869 335328013 329483569 324878097 321768284
1338 321768284 320158035 319746703 320045650 320648581 321209133 321505010 321517408 321263671 320713937 319851726
1358.4 319851726 318819195 317842692 317130119 316731483 316678226 317052931 317931443 319343954 320910484
$$ packed form
1234C84012640k333373j981050j648545j168520l46630P41779J805246K531678K754837
1252.3C84368062K528936K042502J517564J181900J163364J487851K035528K485455
1268.6C98811162K601951K309561J649528P93636j00672q43465j236618j274586j129001
1287D01581496j067966j307577j850426k481461k926260l045380k883792k692759k719939
1305.4C80605936k850473k727449k264559j768053j516223j570016j923024k606661
1321.7C63379478l656029m954487o120265o719828o600856n844444m605472l109813
1338C21768284j610249m11332K98947O02931N60552K95877J2398k53737n49734q62211
1358.4C19851726j032531r76503p12573l98636n3257L74705Q78512J412511J566530
$$ plain form
1376.7 320910484 322401643 324006081 326061785 329084039 333563894 338575095 342484742 345098883
1393.1 345098883 346471697 346515626 345570087 344132692 342377126 340250224 337959200 335638374 333293349
1411.4 333293349 331123292 329325110 327914357 327079862 326959074 327444166 328403831 329657733 331249475
1429.8 331249475 333071232 334882706 337138414 339887798 342187643 344137788 345753103 346770138
1446.1 346770138 347002476 346319795 344880015 342981070 340497822 338205904 337672472 338644922 341535956
1464.5 341535956 346399665 352250546 360023826 371866167 385123730 396591097 406807929 416510701
1480.8 416510701 425842375 434194505 442090183 450533718 458879083 465278983 470773399 476991147
1497.1 476991147 482982039 487679988 491305709 495263904 501048803 505751252 508879304 511805058
$$ packed form
1376.7C20910484J491159J604438K055704L022254M479855N011201L909647K614141
1393.1C45098883J372814M3929r45539j437395j755566k126902k291024k320826k345025
1411.4C33293349k170057j798182j410753q34495j20788M85092R59665J253902J591742
1429.8C31249475J821757J811474K255708K749384K299845J950145J615315J017035
1446.1C46770138K32338o82681j439780j898945k483248k291918n33432R72450K891034
1464.5C41535956M863709N850881P773280J1842341J3257563J1467367J0216832R702772
1480.8D16510701R331674Q352130P895678Q443535Q345365O399900N494416O217748
1497.1D76991147N990892M697949L625721L958195N784899M702449L128052K925754
$$ plain form
1513.4 511805058 514811397 518020391 521160364 524615288 527853966 530505657 533187389 535465777
1529.7 535465777 537582934 540006042 541814864 543008924 545037866 547275960 548624218 549573839
1546 549573839 550197303 550643802 550875545 550785840 550334036 549845695 549288392 548221350 546714246 544936419
1566.4 544936419 542911112 540673971 538476288 536074102 533178926 530404150 527892292 525286317
1582.8 525286317 522614479 519875944 517063320 514162540 511243522 508350074 505512416 502697170
1599.1 502697170 499777824 496729910 493612647 490470797 487200648 483822763 480387866 476579368
1615.4 476579368 472295880 468647987 465400964 461865306 458392113 455023944 451763451 449018836
1631.7 449018836 446814805 445096314 444069117 443459660 443113297 443064064 443817139 445515156 446932942
$$ packed form
1513.4E11805058L006339L208994L139973L454924L238678K651691K681732K278388
1529.7E35465777K117157K423108J808822J194060K028942K238094J348258R49621
1546E49573839O23464M46499K31743q9705m51804m88341n57303j067042j507104j777827
1566.4E44936419k025307k237141k197683k402186k895176k774776k511858k605975
1582.8E25286317k671838k738535k812624k900780k919018k893448k837658k815246
1599.1E02697170k919346l047914l117263l141850l270149l377885l434897l808498
1615.4D76579368m283488l647893l247023l535658l473193l368169l260493k744615
1631.7D49018836k204031j718491j027197o09457l46363m9233P53075J698017J417786
$$ plain form
1650.1 446932942 449062407 453311980 456570089 459070593 462215543 466525912 471342862 475520462
1666.4 475520462 480245501 486228079 491764635 497817218 504855990 510989547 516332567 522569776
1682.7 522569776 531286538 538645625 544218242 549845874 554642975 559417605 564483106 569216907
1699 569216907 574425161 578229666 581064224 584045529 586537480 588641703 590707481 593129992 596529663
1717.4 596529663 599788189 602008224 604100764 606455147 608756602 610932112 612957597 615646183
1733.7 615646183 618441939 620292127 622479320 625246465 627980292 630736887 633807063 637727082
1750 637727082 642097890 645801663 649338603 652942538 656154752 659429491 662350833 664745569 667067885
1768.4 667067885 669313431 671781003 674046099 675663710 677208006 678945243 680597305 682096124
$$ packed form
1650.1D46932942K129465M249573L258109K500504L144950M310369M816950M177600
1666.4D75520462M725039N982578N536556O052583P038772O133557N343020O237209
1682.7E22569776Q716762P359087N572617N627632M797101M774630N065501M733801
1699E69216907N208254L804505K834558K981305K491951K104223K065778K422511L399671
1717.4E96529663L258526K220035K092540K354383K301455K175510K025485K688586
1733.7F15646183K795756J850188K187193K767145K733827K756595L070176L920019
1750F37727082M370808L703773L536940L603935L212214L274739K921342K394736K322316
1768.4F67067885K245546K467572K265096J617611J544296J737237J652062J498819
$$ plain form
1784.7 682096124 683417201 684404314 685558736 687391162 689022779 690101385 691163659 692476273
1801 692476273 693826914 694989085 696055174 697162688 698360860 699433923 700321019 701207280 702138007
1819.4 702138007 702978432 703787327 704641223 705325305 706080914 707014263 707761347 708379328 708971143 709321797
1839.8 709321797 709450901 709876537 710602045 711132050 711530089 711842000 712039351 712227046 712480128 712814450
1860.2 712814450 713139951 713322818 713391006 713667929 714191556 714638889 715067744 715555906 716015160 716387510
1880.5 716387510 716722667 717136800 717644691 718284845 718941808 719310164 719511747 719789147 720123112 720473945
1900.9 720473945 720754623 720865786 720847547 720879138 721069932 721322715 721540809 721789420 721974373 721973836
1921.3 721973836 722096860 722431302 722767591 723024070 723147094 723161936 723194599 723328352 723503947 723750949
$$ packed form
1784.7F82096124J321077R87113J154422J832426J631617J078606J062274J312614
1801F92476273J350641J162171J066089J107514J198172J073063Q87096Q86261R30727
1819.4G02138007Q40425Q08895Q53896O84082P55609R33349P47084O17981N91815L50654
1839.8G09321797J29104M25636P25508N30005L98039L11911J97351J87695K53082L34322
1860.2G12814450L25501J82867O8188K76923N23627M47333M28855M88162M59254L72350
1880.5G16387510L35157M14133N07891O40154O56963L68356K01583K77400L33965L50833
1900.9G20473945K80678J11163j8239L1591J90794K52783K18094K48611J84953n37
1921.3G21973836J23024L34442L36289K56479J23024J4842L2663J33753J75595K47002
$$ plain form
1941.7 723750949 724041343 724201620 724294364 724489808 724832773 725244880 725608289 725851476 726003051 726158500
1962.1 726158500 726407528 726774931 727168918 727430165 727564812 727671862 727831662 728114069 728417099 728603244
1982.5 728603244 728644907 728603125 728575349 728669226 728900075 729091167 729151905 729111969 728995562 728887081 728836536
2005 728836536 728754818 728537142 728138089 727612138 727120340 726743579 726326525 725731313 725007832 724273086
2025.4 724273086 723695457 723264158 722824454 722319126 721732259 721088350 720460236 719905794 719456196 719118476
2045.8 719118476 718836725 718559384 718293726 718081713 717971504 717976153 718069434 718177199 718253314 718316853
2066.2 718316853 718389809 718488872 718616188 718735754 718807697 718817770 718804181 718831360 718937337 719103158 719269037
2088.6 719269037 719416678 719554603 719706655 719914138 720186293 720469236 720711768 720896482 721026838 721156597
$$ packed form
1941.7G23750949K90394J60277R2744J95444L42965M12107L63409K43187J51575J55449
1962.1G26158500K49028L67403L93987K61247J34647J07050J59800K82407L03030J86145
1982.5G28603244M1663m1782k7776R3877K30849J91092O0738l9936j16407j08481n0545
2005G28836536q1718k17676l99053n25951m91798l76761m17054n95212p23481p34746
2025.4G24273086n77629m31299m39704n05328n86867o43909o28114n54442m49598l37720
2045.8G19118476k81751k77341k65658k12013j10209M649R3281J07765P6115O3539
2066.2G18316853P2956R9063J27316J19566P1943J0073j3589K7179J05977J65821J65879
2088.6G19269037J47641J37925J52052K07483K72155K82943K42532J84714J30356J29759
$$ plain form
2109 721156597 721348822 721583426 721765399 721852958 721873462 721866071 721868932 721915066 721979558 721994281 721959531 721936703
2133.5 721936703 721978664 722069442 722155571 722202420 722201109 722165942 722139657 722179055 722315371 722530365 722742438
2155.9 722742438 722924709 723151088 723502398 724004447 724569917 725073397 725556672 726128817 726777852 727480829
2176.3 727480829 728235841 728995025 729676962 730239451 730763555 731368005 732039690 732682347 733249366 733733773
2196.7 733733773 734179258 734659076 735217094 735848010 736470401 737004519 737475216 737957478 738497794 739110589
2217.1 739110589 739737511 740254939 740635037 740977526 741363704 741815507 742277145 742656529 742933691 743153393
2237.5 743153393 743384957 743677199 744014442 744320393 744534075 744693518 744889140 745112240 745328069 745579720
2257.9 745579720 745854676 746078134 746257186 746484816 746782899 747106373 747426331 747721374 747980893 748220861
$$ packed form
2109G21156597J92225K34604J81973Q7559K0504p391K861M6134O4492J4723l4750k2828
2133.5G21936703M1961R0778Q6129M6849j311l5167k6285L9398J36316K14994K12073
2155.9G22742438J82271K26379L51310N02049N65470N03480M83275N72145O49035P02977
2176.3G27480829P55012P59184O81937N62489N24104O04450O71685O42657N67019M84407
2196.7G33733773M45485M79818N58018O30916O22391N34118M70697M82262N40316O12795
2217.1G39110589O26922N17428L80098L42489L86178M51803M61638L79384K77162K19702
2237.5G43153393K31564K92242L37243L05951K13682J59443J95622K23100K15829K51651
2257.9G45579720K74956K23458J79052K27630K98083L23474L19958K95043K59519K39968
$$ plain form
2278.3 748220861 748458803 748685360 748869300 748960018 748987138 749014497 749029398 749022543 748998404 748958290 748889446
2300.7 748889446 748739660 748482764 748175442 747888207 747618377 747341931 747037351 746596456 745977879 745383203
2321.1 745383203 744994342 744688690 744266391 743800104 743400395 742965400 742489278 742115796 741870165 741732001
2341.5 741732001 741949081 742601812 742746115 741781473 740293324 739044249 738104284 737330437 736907542
2359.9 736907542 736912012 737199068 737699151 738358736 739024222 739583671 740107417 740697324 741304040 741791785
2380.2 741791785 742040753 742048979 741902113 741681755 741443157 741190076 740857780 740411341 739913344 739451349
2400.6 739451349 739067614 738690972 738198161 737577260 736887813 736175597 735525966 734945118 734299779 733508408
2421 733508408 732617557 731706679 730836689 730043650 729274213 728426933 727452278 726402581 725405097 724525750
$$ packed form
2278.3G48220861K37942K26557J83940R0718K7120K7359J4901o855k4139m0114o8844
2300.7G48889446j49786k56896l07322k87235k69830k76446l04580m40895o18577n94676
2321.1G45383203l88861l05652m22299m66287l99709m34995m76122l73482k45631j38164
2341.5G41732001K17080O52731J44303r64642j488149j249075r39965p73847m22895
2359.9G36907542M470K87056N00083O59585O65486N59449N23746N89907O06716M87745
2380.2G41791785K48968Q226j46866k20358k38598k53081l32296m46439m97997m61995
2400.6G39451349l83735l76642m92811o20901o89447p12216o49631n80848o45339p91371
2421G33508408q90851r10878q69990p93039p69437q47280r74655j049697r97484q79347
$$ plain form
2441.4 724525750 723701000 722829223 721853673 720793784 719764292 718872070 718108475 717343628 716455460
2459.8 716455460 715467691 714510024 713671446 712914467 712163031 711377680 710540950 709673226 708832681 708058715
2480.2 708058715 707354605 706677496 705965459 705223382 704526305 703935504 703426123 702934980 702425122 701877713
2500.6 701877713 701304555 700756729 700291932 699880838 699412823 698857903 698273659 697691679 697091937 696460962
2521 696460962 695813835 695116758 694329143 693485379 692629814 691760540 690870643 689958990 689000130 687983871
2541.4 687983871 686945498 685945332 685020328 684133053 683197975 682188630 681164026 680189669 679275930
2559.7 679275930 678376138 677453876 676513553 675545573 674556911 673600554 672684729 671793997 670914173 670010269
2580.1 670010269 669111609 668257356 667420983 666603208 665840209 665119350 664426029 663777888 663171053 662585616
$$ packed form
2441.4G24525750q24750q71777r75550j059889j029492q92222p63595p64847q88168
2459.8G16455460r87769r57667q38578p56979p51436p85351q36730q67724q40545p73966
2480.2G08058715p04110o77109p12037p42077o97077n90801n09381m91143n09858n47409
2500.6G01877713n73158n47826m64797m11094m68015n54920n84244n81980n99742o30975
2521F96460962o47127o97077p87615q43764q55565q69274q89897r11653r58860j016259
2541.4F87983871j038373j000166r25004q87275r35078j009345j024604r74357r13739
2559.7F79275930q99792r22262r40323r67980r88662r56357r15825q90732q79824r03904
2580.1F70010269q98660q54253q36373q17775p62999p20859o93321o48141o06835n85437
$$ plain form
2600.5 662585616 661962390 661233008 660407841 659501314 658523500 657541990 656537950 655416369 654156148
2618.9 654156148 652778685 651343644 649915934 648466706 646941781 645330429 643626332 641860008
2635.2 641860008 640134275 638528228 636971295 635313988 633552313 631798923 630112052 628499210
2651.5 628499210 626941323 625392556 623814702 622203052 620604455 619075656 617613554 616182983
2667.8 616182983 614751935 613299012 611855865 610488355 609224081 608027458 606831908 605562210
2684.1 605562210 604215860 602898836 601675034 600472212 599162996 597710431 596178532 594619989
2700.5 594619989 593057275 591507554 589976430 588432610 586827338 585181832 583583653 582098246
2716.8 582098246 580715656 579355180 577935517 576488256 575154543 573996961 572929859 571871877
$$ packed form
2600.5F62585616o23226p29382q25167r06527r77814r81510j004040j121581j260221
2618.9F54156148j377463j435041j427710j449228j524925j611352j704097j766324
2635.2F41860008j725733j606047j556933j657307j761675j753390j686871j612842
2651.5F28499210j557887j548767j577854j611650j598597j528799j462102j430571
2667.8F16182983j431048j452923j443147j367510j264274j196623j195550j269698
2684.1F05562210j346350j317024j223802j202822j309216j452565j531899j558543
2700.5E94619989j562714j549721j531124j543820j605272j645506j598179j485407
2716.8E82098246j382590j360476j419663j447261j333713j157582j067102j057982
$$ plain form
2733.1 571871877 570799053 569695175 568605721 567569554 566557109 565569937 564577758 563547730 562552512
2751.4 562552512 561625838 560744703 559926212 559163988 558411539 557630181 556825519 556028485 555208266 554304004
2771.8 554304004 553290248 552171946 550980806 549761355 548525989 547231972 545811653 544232666
2788.2 544232666 542540669 540785551 538991988 537172794 535259306 533174992 530938983 528594136
2804.5 528594136 526173830 523709714 521186054 518572628 515860677 513046324 510136247 507125318
2820.8 507125318 504025638 500869095 497612596 494195253 490646392 487028718 483342350 479531258
2837.1 479531258 475531220 471294075 466790318 461980999 456918001 451847672 447046489 442694038
2853.4 442694038 438828647 435276717 431764156 427994162 423666030 418625504 412912607 406672865
$$ packed form
2733.1E71871877j072824j103878j089454j036167j012445r87172r92179j030028r95218
2751.4E62552512r26674q81135q18491p62224p52449p81358q04662p97034q20219r04262
2771.8E54304004j013756j118302j191140j219451j235366j294017j420319j578987
2788.2E44232666j691997j755118j793563j819194j913488k084314k236009k344847
2804.5E28594136k420306k464116k523660k613426k711951k814353k910077l010929
2820.8E07125318l099680l156543l256499l417343l548861l617674l686368l811092
2837.1D79531258m000038m237145m503757m809319n062998n070329m801183m352451
2853.4D42694038l865391l551930l512561l769994m328132n040526n712897o239742
$$ plain form
2869.7 406672865 400075883 393326759 386624336 380113155 374074906 368858814 364556223 361136258
2886.1 361136258 358582199 356785029 355582625 354768783 354093730 353367329 352499634 351418614 350026876
2904.4 350026876 348259747 346072674 343379706 340084761 336202741 331884861 327326506 322783828
2920.7 322783828 318582207 314995199 312262893 310598969 310141295 311023563 313309520 316889644 321564496
2939.1 321564496 327114344 333310097 339941382 346817225 353831083 360984713 368271917 375618935
2955.4 375618935 382937372 390124112 397043765 403595179 409710675 415401638 420761526 425855935
2971.7 425855935 430739075 435466617 440061450 444506139 448728710 452621639 456121802 459230453
2988 459230453 461976290 464419991 466597229 468448132 469863057 470802367 471357167 471585155 471423686
$$ packed form
2869.7D06672865o596982o749124o702423o511181o038249n216092m302591l419965
2886.1C61136258k554059j797170j202404q13842o75053p26401q67695j081020j391738
2904.4C50026876j767129k187073k692968l294945l882020m317880m558355m542678
2920.7C22783828m201621l587008k732306j663924m57674Q82268K285957L580124M674852
2939.1C21564496N549848O195753O631285O875843P013858P153630P287204P347018
2955.4C75618935P318437P186740O919653O551414O115496N690963N359888N094409
2971.7D25855935M883140M727542M594833M444689M222571L892929L500163L108651
2988D59230453K745837K443701K177238J850903J414925R39310N54800K27988j61469
$$ plain form
3006.4 471423686 470881253 470026553 468869328 467386365 465590298 463558853 461361408 459000230 456441015
3024.7 456441015 453716367 450892836 448010027 445107520 442132026 439004689 435781568 432525992
3041.1 432525992 429203421 425806016 422402084 419035852 415640116 412156433 408655822 405200303
3057.4 405200303 401749998 398278743 394827634 391400754 387964666 384496123 381013542 377590030
3073.7 377590030 374247104 370934129 367589444 364187598 360769033 357390702 354076117 350783616
3090 350783616 347434551 344063848 340779006 337585270 334395200 331159294 327968776 324906856 321871728
3108.4 321871728 318749636 315661728 312732428 309853345 306908846 303881913 300789177 297717601
3124.7 297717601 294789374 292008877 289251626 286446601 283672482 281017423 278425813 275757879
$$ packed form
3006.4D71423686n42433q54700j157225j482963j796067k031445k197445k361178k559215
3024.7D56441015k724648k823531k882809k902507k975494l127337l223121l255576
3041.1D32525992l322571l397405l403932l366232l395736l483683l500611l455519
3057.4D05200303l450305l471255l451109l426880l436088l468543l482581l423512
3073.7C77590030l342926l312975l344685l401846l418565l378331l314585l292501
3090C50783616l349065l370703l284842l193736l190070l235906l190518l061920l035128
3108.4C21871728l122092l087908k929300k879083k944499l026933l092736l071576
3124.7B97717601k928227k780497k757251k805025k774119k655059k591610k667934
$$ plain form
3141 275757879 273026615 270369142 267816454 265369058 263016820 260643542 258186549 255748719 253406942
3159.4 253406942 251122564 248862550 246657401 244529918 242416412 240281597 238183171 236158594
3175.7 236158594 234206066 232321471 230451301 228560552 226669610 224812105 223046541 221354529
3192 221354529 219673440 218007997 216376036 214777678 213223964 211717561 210235611 208765849 207330182
3210.3 207330182 205951989 204612926 203282595 201977238 200742498 199544251 198297128 197042316
3226.7 197042316 195888534 194831774 193790540 192669109 191486403 190383598 189365819 188376501
3243 188376501 187461868 186602414 185692817 184754655 183872700 183022887 182165310 181322530 180527270 179781631
3263.4 179781631 179038644 178334117 177766755 177200869 176476046 175705254 174992114 174319550 173674271 173058107
$$ packed form
3141B75757879k731264k657473k552688k447396k352238k373278k456993k437830k341777
3159.4B53406942k284378k260014k205149k127483k113506k134815k098426k024577
3175.7B36158594j952528j884595j870170j890749j890942j857505j765564j692012
3192B21354529j681089j665443j631961j598358j553714j506403j481950j469762j435667
3210.3B07330182j378193j339063j330331j305357j234740j198247j247123j254812
3226.7A97042316j153782j056760j041234j121431j182706j102805j017779r89318
3243A88376501r14633q59454r09597r38162q81955q49813q57577q42780p95260p45639
3263.4A79781631p42987p04527n67362n65886p24823p70792p13140o72564o45279o16164
$$ plain form
3283.8 173058107 172485366 171954215 171474710 171003088 170455992 169843271 169198990 168597773 168128356 167745367
3304.2 167745367 167309895 166714475 165975615 165226132 164565980 163976163 163421348 162906796 162420303 161912277
3324.6 161912277 161323950 160692543 160118997 159599543 159124106 158719316 158278927 157718822 157124311 156523451
3345 156523451 155984908 155620843 155226186 154608473 153954491 153459191 153073400 152691886 152309388 151995778
3365.4 151995778 151707083 151252821 150599509 149989858 149596274 149314821 149012640 148639560 148256630 147995085
3385.7 147995085 147901565 147922873 147848874 147513121 147167981 147132888 147239074 147088960 146685123 146409258
3406.1 146409258 146365613 146354184 146297127 146194577 146043941 145963237 146005511 146056697 146130428 146320805 146585345
3428.6 146585345 146825463 147111297 147470087 147697747 147716329 147719592 147853106 148110285 148456439 148779750
$$ packed form
3283.8A73058107n72741n31151m79505m71622n47096o12721o44281o01217m69417l82989
3304.2A67745367m35472n95420p38860p49483o60152n89817n54815n14552m86493n08026
3324.6A61912277n88327o31407n73546n19454m75437m04790m40389n60105n94511o00860
3345A56523451n38543l64065l94657o17713o53982m95300l85791l81514l82498l13610
3365.4A51995778k88695m54262o53312o09651l93584k81453l02181l73080l82930k61545
3385.7A47995085r3520K1308p3999l35753l45140l5093J06186j50114m03837k75865
3406.1A46409258m3645j1429n7057j02550j50636q0704M2274N1186P3731J90377K64540
3428.6A46585345K40118K85834L58790K27660J8582L263J33514K57179L46154L23311
$$ plain form
3449 148779750 149070695 149444833 149917841 150459886 151057452 151568294 152012438 152680531 153522685 154140115
3469.4 154140115 154418066 154670864 155162528 155910194 156669438 157218665 157751530 158470675 159241468 159967780
3489.8 159967780 160704494 161439672 162220448 163052782 163886890 164725274 165457785 166085139 166831031 167787731
3510.2 167787731 168880582 169889167 170681700 171464905 172428638 173577368 174683854 175589204 176478729
3528.5 176478729 177506223 178661719 179932132 181199953 182385787 183651954 185055122 186484203
3544.8 186484203 187803045 189061716 190461159 192064211 193772107 195573837 197547913 199596629
3561.1 199596629 201488927 203379631 205847636 208671719 211245641 213670433 216231182 219026878
3577.5 219026878 222023964 225080058 228082210 231140196 234493345 237991050 241297066 244676724
$$ packed form
3449A48779750K90945L74138M73008N42045N97566N10842M44144O68093Q42154O17430
3469.4A54140115K77951K52798M91664P47666P59244N49227N32865P19145P70793P26312
3489.8A59967780P36714P35178P80776Q32334Q34108Q38384P32511O27354P45892R56700
3510.2A67787731J092851J008585P92533P83205R63733J148730J106486R05350Q89525
3528.5A76478729J027494J155496J270413J267821J185834J266167J403168J429081
3544.8A86484203J318842J258671J399443J603052J707896J801730J974076K048716
3561.1A99596629J892298J890704K468005K824083K573922K424792K560749K795696
3577.5B19026878K997086L056094L002152L057986L353149L497705L306016L379658
$$ plain form
3593.8 244676724 248368949 252231091 256126404 259994775 263706982 267343670 271286249 275423050
3610.1 275423050 279507160 283607602 287619770 291935503 296785086 301224321 304949015 308476567
3626.4 308476567 312968135 318286568 322864264 327143967 331461847 335683048 339945972 344140232
3642.7 344140232 347982734 351876736 356890321 362399966 366722703 370617449 375202745 379759729
3659 379759729 383770168 387563169 391127616 394449621 398218811 402303934 405726045 409571826 413868397
3677.4 413868397 417378247 420530140 423523605 426274836 429267526 432760507 435941488 438545465
3693.7 438545465 440989584 443372160 445737928 448313683 450777024 452758372 454567254 456714958
3710 456714958 459361196 461781949 463666350 465403020 467173278 468955517 470718861 472516805 474184871
$$ packed form
3593.8B44676724L692225L862142L895313L868371L712207L636688L942579M136801
3610.1B75423050M084110M100442M012168M315733M849583M439235L724694L527552
3626.4C08476567M491568N318433M577696M279703M317880M221201M262924M194260
3642.7C44140232L842502L894002N013585N509645M322737L894746M585296M556984
3659C79759729M010439L793001L564447L322005L769190M085123L422111L845781M296571
3677.4D13868397L509850L151893K993465K751231K992690L492981L180981K603977
3693.7D38545465K444119K382576K365768K575755K463341J981348J808882K147704
3710D56714958K646238K420753J884401J736670J770258J782239J763344J797944J668066
$$ plain form
3728.4 474184871 475610226 477198720 479307443 481650144 483295977 484022528 484823883 486674517 488376111
3746.7 488376111 489428729 491216600 493291229 494555295 495527327 496917814 498461276 499641180
3763.1 499641180 500794828 502071083 503463745 504976690 506215572 507192671 508290529 509686768
3779.4 509686768 510987639 511989415 513054252 514182925 515248835 516228676 517050803 517918587 518742681
3797.7 518742681 519574106 521001637 522249937 523164928 524457812 525422096 525788844 526250958 527308583
3816.1 527308583 528285742 529223680 530685663 531673074 532272041 532951415 533611000 534325719 535057604
3834.4 535057604 535869122 536908567 537879825 538773119 539643109 540083826 539962232 539744079 540822148
3852.8 540822148 543101251 544167817 544354618 544527471 545004547 545669377 546078622 546733737 547863185
$$ packed form
3728.4D74184871J425355J588494K108723K342701J645833P26551Q01355J850634J701594
3746.7D88376111J052618J787871K074629J264066R72032J390487J543462J179904
3763.1D99641180J153648J276255J392662J512945J238882R77099J097858J396239
3779.4E09686768J300871J001776J064837J128673J065910R79841Q22127Q67784Q24094
3797.7E18742681Q31425J427531J248300R14991J292884R64284L66748M62114J057625
3816.1E27308583R77159R37938J461983R87411N98967O79374O59585P14719P31885
3834.4E35057604Q11518J039445R71258Q93294Q69990M40717j21594k18153J078069
3852.8E40822148K279103J066566J86801J72853M77076O64830M09245O55115J129448
$$ plain form
3871.2 547863185 548750937 549365282 549608171 549946010 550727844 551346600 552077591 552714169 552971542 553578794
3891.6 553578794 554228067 554351091 554403841 554762840 555416226 556313097 557126343 557546079 557813048 558028877
3912 558028877 558087587 558265984 558747947 559190333 559454799 559833586 560211897 560311794 560465872 560988247
3932.3 560988247 561589539 561960697 562144220 562322259 562669933 563052535 563365638 563787699 564203918 564435899
3952.7 564435899 564623058 564883530 565177023 565464914 565773845 566039920 566174328 566312969 566605389 566971064
3973.1 566971064 567276001 567491889 567659438 567828417 568008244 568192482 568403125 568628848 568820119 569029748
3993.5 569029748 569317818 569585085
3997.6 569585085
$$ packed form
3871.2E47863185Q87752O14345K42889L37839P81834O18756P30991O36578K57373O07252
3891.6E53578794O49273J23024N2750L58999O53386Q96871Q13246M19736K66969K15829
3912E58028877N8710J78397M81963M42386K64466L78787L78311R9897J54078N22375
3932.3E60988247O01292L71158J83523J78039L47674L82602L13103M22061M16219K31981
3952.7E64435899J87159K60472K93493K87891L08931K66075J34408J38641K92420L65675
3973.1E66971064L04937K15888J67549J68979J79827J84238K10643K25723J91271K09629
3993.5E69029748K88070K67267
3997.6E69585085
##END=$$ End of the data block
