##TITLE=$$ Begin of the data block
##JCAMP-DX=5.00 $$ ACD/SpecManager v 10.08
##SPECTROMETER/DATA SYSTEM=Alpha
##DATE=23 Dec 2014 14:28:26
##DATA TYPE=INFRARED SPECTRUM
##DATA CLASS=XYDATA
##ORIGIN=
##OWNER=
##NPOINTS=1765
##FIRSTX=399.76428223
##LASTX=3997.64306641
##MAXX=3997.64306641
##MINX=399.76428223
##MAXY=0.85158920
##MINY=0.18272586
##XFACTOR=1.0000000000
##YFACTOR=1.000000000000000e-9
##FIRSTY=0.47732803
##DELTAX=2.03961372
##XUNITS=1/CM
##YUNITS=ARBITRARY UNITS
##XYDATA=(X++(Y..Y))
399.8 477328032 471424729 466450512 463500977 463758111 466269761 468727350 470141828 470983118 471554011
418.1 471554011 471339285 469434351 466149598 462931812 460446477 457976997 454675764 450901449 448345065
436.5 448345065 448477119 451794237 457291603 462549597 466697961 470533788 474100143 476484001 476850718
454.8 476850718 475382596 473375231 471954435 470396042 467657834 463670522 459504217 456225276
471.2 456225276 453651339 450967401 447827250 444992930 443731099 444230407 445082545 444828898 443635315
489.5 443635315 442567736 442023605 441175312 439118594 436076403 433048576 430691123 428585291 425695330
507.9 425695330 421489805 416629881 412164509 408245981 404243588 399802089 395597070 392736852
524.2 392736852 391770095 392222881 392963946 393654704 395322531 399291992 405550420 412344456 417650491
542.5 417650491 420884997 422734231 423669875 423395514 421539098 418291897 414432466 410678267 406765223
560.9 406765223 401617527 394829690 387130678 379742384 374000937 370778769 370104581 371761113 375859082
579.3 375859082 382411987 390595049 398837775 405748874 410838038 414537191 417197675 418609947
595.6 418609947 418608308 417740136 417127758 417351693 418025672 418519408 418766469 419409662 421335250 424627095
616 424627095 428240836 431446522 434664160 438549578 443178654 447709411 451003075 453012258 454791367
634.3 454791367 457219273 460056722 462287337 463426679 464237452 465824932 468257517 470486939 471722305
652.7 471722305 472252727 472985417 474511921 476387024 477732897 478964537 481750786 484701186 485200822
671 485200822 485904992 487242728 488369823 489775002 491985589 494326532 495564520 495500326 495096296
689.4 495096296 495004058 494769365 493382871 490255266 486012161 481989235 479038060 477073401 475621611
707.7 475621611 474896908 475894064 479139745 484126538 489935309 495759338 501477957 507901490 515293181
726.1 515293181 522495806 528292179 532582700 536220551 540026963 543615401 545762360 545860052 544458210
744.5 544458210 542419672 539887011 536142826 530678332 524123609 517774463 512532830 508486092
760.8 508486092 505274236 503004611 502729774 505591750 511731923 520049870 529148281 538537860 548390508
779.1 548390508 558563352 568179131 576009572 581681669 586235642 590998769 596407235 601771772
795.4 601771772 606265187 610200226 614591718 619555354 623885274 626308620 626828790 626853645 627695322
813.8 627695322 629145503 629893124 629139006 627422154 625734627 624121189 621429920 616545260 609819174
832.2 609819174 602818549 596644640 591089725 585283697 578969777 572940171 568063021 564109862
848.5 564109862 559825122 554233789 547539949 540740609 535240769 532959402 535509288 542928457
864.8 542928457 554120064 568106711 583591580 598114908 609106243 615666628 618628383 618803024
881.1 618803024 616038024 610144496 601935685 593109727 585089207 578075051 571393132 564454556
897.4 564454556 557377398 550653338 544173658 536989152 528080821 517336488 505634129 493882477
913.7 493882477 482435614 471503735 461811572 454498947 450213671 448563814 448434919 448926866
930.1 448926866 450054467 452365547 456145644 461079836 466444314 471305668 474344492 474006295 469209760
948.4 469209760 459754169 446340859 430340201 413159102 395618826 377803594 359462976 340579182
964.7 340579182 321478367 302499801 283809364 265534848 247974768 231703788 217413589
979 217413589 205662236 196643874 190159202 185879290 183501825 182725862 183156475 184328780 185845822
997.4 185845822 187504470 189193904 190764323 192032948 192796707 193005189 192929506 193044111 193692878
1015.7 193692878 194949940 196688116 198793918 201341763 204458460 208043799 211715251 215066954
1032 215066954 217854172 219984218 221455157 222367480 222912833 223344386 223959818 225137442 227276832
1050.4 227276832 230637848 235250756 240982145 247818023 255882829 265108556 274608642 282115042
1066.7 282115042 284570158 280386865 271355569 261574030 254364461 250669569 249954730 251446426
1083 251446426 254496962 258502126 263069600 268177956 273764729 279344141 284081370 287241489 288738370
1101.4 288738370 289310277 290074825 291842908 294731438 298374742 302349776 306356072 310091376 313100934
1119.8 313100934 315152586 316660374 318526745 321585685 325975776 330809206 334631979 336252034
1136.1 336252034 335096151 331172407 324951172 317253321 309108526 301546335 295282871 290560484
1152.4 290560484 287240684 285105854 284177512 284700185 286901802 290827334 296467066 303899944 313235432
1170.7 313235432 324439168 337114185 350509167 364009708 377485961 391013205 404370397
1185 404370397 416794777 427356124 435663491 442053020 447077096 451030970 453943521 456005633
1201.3 456005633 457871646 460348725 463859856 468252659 473169446 478479832 484215945 490114421
1217.7 490114421 495371073 499031484 500746965 500974834 500429988 499495178 498097181 496098816 493731886
1236 493731886 491601944 490207434 489574432 489471495 489871442 491044641 493143737 495857537 498509645
1254.4 498509645 500499249 501748681 502728522 503964424 505638242 507623732 509761274 512064040
1270.7 512064040 514468253 516542614 517663002 517551064 516631901 515672565 515103757 514719665 513964474
1289 513964474 512574255 510805309 508990228 507134318 504963994 502336502 499555498 497061670 494969785
1307.4 494969785 493123502 491330266 489530087 487898111 486610651 485448807 483671874 480512708
1323.7 480512708 475836605 470199227 464306653 458593339 453306228 448793650 445549905 443936795
1340 443936795 443688393 444022745 444392413 444632292 444783866 444881231 444716573 444026768 442857176 441551447
1360.4 441551447 440495372 439919859 439552307 439135641 438965708 439482242 440784365 442298472 443488568
1378.8 443488568 444460005 445862800 448531598 452920705 457858384 461541891 463808328 464996934
1395.1 464996934 465312511 464844584 463683248 461967081 459875703 457853854 455928773 453800559 451546341
1413.5 451546341 449517101 447856069 446783632 446435511 446448654 446687490 447302490 448493868 450177580
1431.8 450177580 451892465 453643501 455614597 457567900 459581465 461398870 462487280 462568671 461848348
1450.2 461848348 460781991 459471285 457220703 454434186 453360319 453835517 455931962 459731877
1466.5 459731877 464431673 470668077 480331063 491561949 501608074 510583639 518928587 526891649
1482.8 526891649 534233570 541457832 549087584 556331694 561858535 566698492 572293520 577924132
1499.1 577924132 582527459 586077929 589501917 594163358 598468602 601743400 604651630 607298493
1515.4 607298493 610036731 612892091 616047621 618939340 621113598 623139858 625092089 627135098
1531.8 627135098 629383266 631218851 632461488 633736253 635129750 636355639 637319446 637849331 638113678
1550.1 638113678 638411701 638851345 639153242 638658464 637475431 636845708 636298954 635661542 634658158
1568.5 634658158 633095980 631671429 630253553 628435850 626813889 625270069 623344600 621318460
1584.8 621318460 619402945 617476463 615282595 612749994 609999359 607264876 604629755 601846874
1601.1 601846874 598704815 595233679 591567814 587776065 584082603 580503643 576258481 571195483
1617.4 571195483 567346334 564270318 560743570 557253599 553897738 550771356 548521638 546798646
1633.7 546798646 544898450 543467820 542823911 542696476 543102682 544215620 545971155 547541857 549575925
1652.1 549575925 553340912 556799531 559831083 563249409 567316890 571737111 575861633 580548167
1668.4 580548167 586119652 590973496 595862091 601508856 606819391 611703157 616945446 623588622
1684.7 623588622 629475653 634358525 639388740 643757582 647843361 652001679 655896246 660056889
1701.1 660056889 663252056 665515363 667674839 669776320 672000051 674327433 676544309 678816080
1717.4 678816080 681165695 683408320 685719132 688067496 690109789 691913605 693679988 695974410
1733.7 695974410 698592365 700562954 702341259 704361141 706709802 709401131 712238729 715172291
1750 715172291 718207777 721071362 723994911 727013767 729613423 731913149 734001875 735951602 737942755
1768.4 737942755 739776611 741341352 742743075 744081080 745533586 747091174 748434842 749452174
1784.7 749452174 750428319 751547635 752788007 754104495 755174935 755988598 756865323 758027375 759326220
1803 759326220 760391831 761155784 761856616 762781620 763893485 764899850 765622616 766185582 766806960
1821.4 766806960 767595410 768528104 769287288 769712150 770139635 770819247 771589875 772241831 772641897 772804141
1841.8 772804141 772975564 773479700 774105132 774509668 774677455 774802566 775098801 775569201 776001275 776191771
1862.2 776191771 776221097 776292562 776588082 777145982 777630806 777839124 777972579 778355300 778994322 779611051
1882.6 779611051 779988468 780163705 780394495 780933499 781591594 781984031 782081544 782149613 782440126 782928467
1903 782928467 783305109 783318877 783140242 783175230 783539593 783963144 784124672 784047961 784006178 784242213 784752488
1925.4 784752488 785158634 785175502 784998775 785048604 785427213 785867989 786016762 785831213 785736620 786054611
1945.8 786054611 786581397 786948621 787013054 786978424 787157178 787629426 788143039 788378358 788361609 788415253
1966.2 788415253 788760066 789228022 789488018 789460421 789378345 789525986 789918602 790286183 790367603 790222168
1986.6 790222168 790167689 790389478 790719986 790856600 790717721 790514827 790498197 790663362 790759385 790557683
2007 790557683 790134728 789762199 789600194 789493382 789134204 788459539 787683427 786984086 786484718 786304593
2027.4 786304593 786182344 785782158 785252571 784867823 784619212 784304440 783802927 783256829 782917738 782823861
2047.8 782823861 782807052 782670796 782396197 782172978 782172680 782378495 782563210 782547653 782448828 782498956 782740712
2070.2 782740712 783013940 783080041 782902181 782756746 782901168 783259809 783529162 783537388 783407390 783450723
2090.6 783450723 783799231 784231961 784447372 784412861 784412861 784669638 785111964 785461485 785502970 785377920 785428524
2113.1 785428524 785758674 786118984 786182225 785954535 785791636 785947323 786294460 786501706 786395073 786135972
2133.5 786135972 786089957 786365330 786650538 786664724 786474824 786362112 786512792 786816537 787009895 786986768
2153.9 786986768 786900163 787041843 787525415 788082719 788392901 788514137 788777471 789406300 790261924 790944815
2174.3 790944815 791291118 791571438 792115510 792912722 793668926 794152319 794412255 794750154 795380712 796129167
2194.6 796129167 796657443 796896577 797091603 797523260 798203111 798870265 799289048 799514592 799843192 800440073
2215 800440073 801155806 801706910 801959097 802095592 802428126 803008199 803575754 803879261 803944349 804062128
2235.4 804062128 804461002 805033863 805452228 805558205 805570304 805792391 806272626 806786478 807070374 807156861
2255.8 807156861 807324231 807753205 808349252 808764398 808811307 808780074 809037209 809563577 810024858 810145855
2276.2 810145855 809970021 809834361 810074091 810705841 811401784 811860085 812177181 812736511 813696027 814714968
2296.6 814714968 815429687 815946221 816686332 817975402 819726169 821480811 822830796 823823869 825002074
2315 825002074 826930463 829504371 831919491 833637834 835070908 836809635 838650703 839782238 839958847
2333.3 839958847 840010822 840574980 841449976 841842413 840344429 836170256 832264304 832181871 836218655
2351.7 836218655 842112303 847210765 850433528 851589203 851045251 848983347 845309258 840352774
2368 840352774 835065603 830164015 825654805 821293235 817000329 813047647 809914768 807837605 806564510
2386.4 806564510 805634260 804880202 804425955 804315031 804322302 804099619 803550303 802923441 802520633 802363217
2406.8 802363217 802162409 801653385 800908744 800240397 799828112 799540997 799079239 798299730 797381163 796628833
2427.2 796628833 796148539 795695662 794968784 794019580 793163240 792560279 792083263 791450262 790508091 789513409
2447.6 789513409 788819671 788380265 787855625 787038624 786062539 785244346 784739077 784357905 783775449 782904208
2467.9 782904208 781991005 781341136 780958056 780539572 779879749 779050350 778280139 777789772 777522624 777149200
2488.3 777149200 776486814 775740862 775254190 775089502 774951756 774535775 773875415 773309708 773060381 772960544
2508.7 772960544 772686839 772120893 771443963 770945609 770690382 770409763 769850314 769075990 768345654 767832339
2529.1 767832339 767427623 766830564 765918672 764901876 764074445 763512194 762978911 762185812 761142075
2547.5 761142075 760155261 759469628 758993030 758396208 757454693 756361067 755520046 755023301 754558802
2565.8 754558802 753800809 752782941 751850128 751243353 750807106 750187337 749242127 748207390 747455359
2584.2 747455359 747059703 746705234 746090651 745275915 744573593 744185150 743955851 743541300 742802024 741950750
2604.6 741950750 741304398 740879774 740341783 739434838 738289475 737214625 736347854 735532403 734467983
2623 734467983 733053803 731525481 730202913 729159832 728107154 726717472 725069702 723536730 722289264
2641.3 722289264 721144736 719810009 718194187 716559887 715209782 714125335 713028252 711664736
2657.6 711664736 710095763 708640039 707500160 706516325 705339491 703895867 702485859 701383710
2673.9 701383710 700548172 699692369 698574543 697259665 696055412 695148766 694356740 693370879 692099750
2692.3 692099750 690728724 689550519 688610613 687585652 686203659 684618175 683156729 681962311
2708.6 681962311 680880547 679626048 678155422 676703930 675506651 674562931 673618793 672452927 671182632
2727 671182632 670125961 669365585 668659151 667742014 666631341 665584207 664787233 664172530 663470864
2745.3 663470864 662513375 661434829 660504341 659847200 659300447 658599615 657719731 656892180 656290948
2763.7 656290948 655831337 655275047 654454708 653443933 652467728 651638269 650831878 649832070 648574769
2782 648574769 647210479 645955563 644843280 643640578 642114937 640340149 638573289 636919975 635268629
2800.4 635268629 633451462 631388366 629188478 627056658 625008106 622847855 620440841 617874205
2816.7 617874205 615334570 612861872 610333323 607610464 604645252 601567864 598563671 595602572
2833 595602572 592497349 589129090 585488021 581687629 577791333 573678911 569289207 564744294 560355783
2851.4 560355783 556509554 553300440 550429404 547477305 544164896 540390670 536123514 531315029
2867.7 531315029 525944293 520153522 514201641 508302510 502676070 497543782 493014127 489166737
2884 489166737 486154467 484079897 482754111 481796980 480994433 480281532 479586154 478864402 478001863
2902.4 478001863 476791143 475151122 473137200 470756024 467878342 464367479 460350215 456153899
2918.7 456153899 452067792 448385268 445342094 443054795 441661239 441357255 442323446 444627911 448125333
2937 448125333 452536762 457664162 463373721 469481170 475749433 482044220 488375545 494726062 501112640
2955.4 501112640 507574141 513934553 519901872 525401413 530569673 535497606 540145814 544468403
2971.7 544468403 548532784 552505910 556532085 560518324 564162850 567302644 570048332 572615445
2988 572615445 575108051 577360749 579100609 580310166 581194699 581895173 582357526 582399070 581967115
3006.4 581967115 581241369 580410182 579455018 578200698 576549053 574569166 572407246 570231080 568062067
3024.7 568062067 565693200 563039362 560303152 557680964 555080831 552316725 549436629 546500266
3041.1 546500266 543477178 540411830 537345588 534282506 531146824 527911484 524726152 521622002
3057.4 521622002 518495619 515320182 512138903 509039044 506007016 502926826 499780059 496606201
3073.7 496606201 493511766 490586102 487664700 484603494 481430650 478157133 474912882 471834987
3090 471834987 468814224 465740263 462658435 459657788 456745535 453849077 450963318 448130459 445309639
3108.4 445309639 442422211 439626426 437061399 434496790 431764543 428853810 425833702 422956884
3124.7 422956884 420345336 417835176 415199369 412456036 409881949 407597691 405333102 402767003
3141 402767003 400022626 397454232 395157009 393027902 390914947 388647050 386221498 383835226 381600589
3159.4 381600589 379463434 377331793 375178665 373062670 371052921 369144619 367246091 365297675
3175.7 365297675 363338828 361466706 359693706 357927352 356134832 354358971 352635562 350986600
3192 350986600 349381566 347753674 346109748 344505996 343000293 341583312 340153188 338661134 337184012
3210.3 337184012 335800350 334521830 333296150 332018912 330670416 329327881 328062773 326899141
3226.7 326899141 325817108 324796170 323797166 322676748 321413130 320217967 319174647 318214744 317303479
3245 317303479 316380769 315397203 314449012 313611180 312760085 311805993 310873091 310071945 309339523 308604836
3265.4 308604836 307935625 307393998 306819081 306074679 305214822 304318070 303467005 302704513 302046984 301471859
3285.8 301471859 300930649 300447047 299972028 299381793 298653483 297861546 297126979 296567500 296142876 295600533
3306.2 295600533 294788152 293799579 292798102 291920573 291169077 290477335 289801359 289085209 288326234
3324.6 288326234 287496269 286586612 285698116 284867465 284130603 283519953 282870024 282058567 281166077 280239701
3345 280239701 279368192 278677106 277955264 276970416 275915474 275048375 274342507 273613840 272851378 272232652
3365.4 272232652 271676034 270879030 269807667 268768162 267964721 267255247 266526133 265823126 265211165
3383.7 265211165 264739096 264456987 264334053 264070302 263466448 262859493 262644559 262617677 262242675 261515737
3404.1 261515737 260964155 260746956 260608077 260371208 259963930 259518653 259269565 259157300 259058535 259040445
3424.5 259040445 259155869 259379208 259600729 259825230 260086685 260173470 260012984 259939879 260161519 260504335
3444.9 260504335 260838121 261174381 261566937 262043148 262553066 263122857 263784915 264363289 264921218 265781075
3465.3 265781075 266777009 267396361 267628610 267978072 268667310 269558519 270349622 270870656 271451950 272298336
3485.7 272298336 273106277 273782670 274559975 275479913 276465595 277395725 278255820 279079109 279755354 280397981
3506.1 280397981 281246215 282293499 283441186 284462541 285255313 286111116 287204862 288435310 289467871
3524.4 289467871 290179640 290965766 292078942 293363780 294689685 295946866 297079116 298364580 299888641
3542.8 299888641 301325828 302466244 303592503 304928601 306402802 307980418 309679896 311525583
3559.1 311525583 313456565 315269977 316958070 319046170 321588904 324011058 326345235 328868419
3575.4 328868419 331553370 334420383 337521255 340603411 343431711 346304923 349563509 352792442
3591.7 352792442 355935603 359388530 363140434 366863847 370517820 374060541 377388000 380871862
3608.1 380871862 384680420 388577729 392591387 396501958 400413811 404913366 409444630 413361877
3624.4 413361877 416647613 420120806 424630135 429076701 433180958 437168151 441020399 444939077
3640.7 444939077 448973387 452779621 456238985 460018307 464549989 468822896 472618431 476743847
3657 476743847 481026471 484813064 488314122 491850257 495120317 498195916 501735032 505017579 507999480
3675.4 507999480 511555076 515067637 518310249 521527827 524598777 527387142 529976845 532670975
3691.7 532670975 535470068 538191557 540693700 542845607 544883847 547148585 549390137 551235914
3708 551235914 552621424 554149330 556348205 558673680 560809195 562761962 564541757 566200614 567875087
3726.4 567875087 569634676 571188390 572368264 573428333 574919999 576756418 578183115 578769803
3742.7 578769803 579381645 580886543 581941605 582462668 583911240 585880458 587371409 588505805 589842975
3761 589842975 591225445 592447519 593603253 594645202 595772505 597055674 598292530 599387586 600349903
3779.4 600349903 601367176 602349997 603276193 604349792 605516136 606598854 607452333 608224571 609118521
3797.7 609118521 609724641 610291362 611390948 612296939 613133252 614374876 615579903 616336823 616887331
3816.1 616887331 617545903 617969811 618728995 619912744 620837450 621625781 622379601 623177111 624072731
3834.4 624072731 624636650 624895990 625422955 626184940 627110004 628162205 629017711 629138768 628531516
3852.8 628531516 629038215 630582690 631706357 632254303 632536829 633087277 633724034 633999586 634448588
3871.2 634448588 635236263 636119962 636882365 637284279 637795687 638392925 638753653 639259279 639701962 640009880
3891.6 640009880 640666068 641419530 641838133 641947985 642004728 642268538 642882645 643603742 644170761 644608736
3912 644608736 644942403 645152509 645358622 645666957 645953834 646205723 646610677 647028327 647207022 647369623
3932.3 647369623 647736967 648131073 648461401 648721337 648972213 649366438 649716258 649851918 650050819 650479734
3952.7 650479734 650946975 651263237 651482522 651694357 651858628 652046502 652354002 652704716 652972162 653103113
3973.1 653103113 653218210 653455675 653777957 654131293 654401720 654516816 654644012 654881299 655145466 655362248
3993.5 655362248 655534267 655705154
3997.6 655705154
##END=$$ End of the data block
