##TITLE=$$ Begin of the data block
##JCAMP-DX=5.00 $$ ACD/SpecManager v 10.08
##SPECTROMETER/DATA SYSTEM=Alpha
##DATE=23 Dec 2014 14:28:26
##DATA TYPE=INFRARED SPECTRUM
##DATA CLASS=XYDATA
##ORIGIN=
##OWNER=
##NPOINTS=1765
##FIRSTX=399.76428223
##LASTX=3997.64306641
##MAXX=3997.64306641
##MINX=399.76428223
##MAXY=0.85306007
##MINY=0.18307981
##XFACTOR=1.0000000000
##YFACTOR=1.000000000000000e-9
##FIRSTY=0.48041692
##DELTAX=2.03961372
##XUNITS=1/CM
##YUNITS=ARBITRARY UNITS
##XYDATA=(X++(Y..Y))
399.8D80416924n674601n058735l155351J5765K027005J933664J365304J375646J353800
418.1D74599421o6638k379864l803701l486096k410681k311050l098846l700584k611995
436.5D50729966L35366L548264N391747M989237M018485L815770L451467K108931J16736
454.8D78505969j410663j826644j358181j467020k808541m304587m403264l297359
471.2D57629710k515345k699525l063589k571493j307756k5332N37694p3314q73774
489.5D45037276r10312o36667q97646j905203k936065l093720k473533k236754l020763
507.9D26926613m227460m806697m409999l909438l991873m315137m028440k699673
524.2C94537896q80122M11927O67751O07431J515776L880620O414622P054866N349695
$$ plain form
399.8 480416924 474742323 469683588 466528237 466544002 468571007 470504671 471869975 473245621 474599421
418.1 474599421 474532783 472152919 468349218 464863122 462452441 460141391 457042545 453341961 450729966
436.5 450729966 451065332 454613596 460005343 464994580 469013065 472828835 476280302 478389233 478505969
454.8 478505969 477095306 475268662 473910481 472443461 469634920 465330333 460927069 457629710
471.2 457629710 455114365 452414840 449351251 446779758 445472002 445446670 445984364 445911050 445037276
489.5 445037276 444126964 443490297 442592651 440687448 437751383 434657663 432184130 429947376 426926613
507.9 426926613 422699153 417892456 413482457 409573019 405581146 401266009 397237569 394537896
524.2 394537896 393657774 394069701 394737452 395344883 396860659 400741279 407155901 414210767 419560462
542.5D19560462L046543J733839R83268k75880j899987l144563l748595l885657m191905
560.9D08177525n318493o809294p721633p328182n483926l106474q81047J358450L952652
579.3C76839578O685198Q361756Q229137O849140N164712L827691K652616J354992
595.6D19964820j79q69542o49393J60605O04302M11093K12491P20441J951009L211409
616D25717056L653943L386140L350556L909141M549056M403591L283739K128155J840770
634.3D56222147K372175K775729K230883J129388P39694J514107K436280K326697J353205
652.7D73100305N87046P45803J507521J768112J220643J253665L008306L099799L93778
671D86684978O01619J311422J163602J440227K209306K342164J240194j41651n67615
$$ plain form
542.5 419560462 422607005 424340844 425324112 425048232 423148245 420003682 416255087 412369430 408177525
560.9 408177525 402859032 396049738 388328105 380999923 375515997 372409523 371528476 372886926 376839578
579.3 376839578 383524776 391886532 400115669 406964809 412129521 415957212 418609828 419964820
595.6 419964820 419964641 419095099 418445706 418606311 419210613 419621706 419834197 420554638 422505647 425717056
616 425717056 429370999 432757139 436107695 440016836 444565892 448969483 452253222 454381377 456222147
634.3 456222147 458594322 461370051 463600934 464730322 465470016 466984123 469420403 471747100 473100305
652.7 473100305 473687351 474433154 475940675 477708787 478929430 480183095 483191401 486291200 486684978
671 486684978 487286597 488598019 489761621 491201848 493411154 495753318 496993512 496851861 496284246
689.4D96284246k06649j89990j251787l034561m236848m067480k977461j987487j491427
707.7D76840556p52628R87768L270119N035371N838990N820692N697727O438673P477998
726.1E16655266P255435N755663M255355L667235L850758L582776K133608J13487j430333
744.5E45839250k114594k563357l737867n494356o613493o388724n220592m010081
760.8E09696186l242970k357900l31044K929091O241560Q318782R053528R387374R937763
779.1E49632370J0295928R671390P785559N548596M492998M853189N483985N335152
795.4F03099167M495561L969789M331827M881978M329324K433836N17309L6717Q31186
813.8F28926694J431287P53104p91668j836241j758039j576364k666294m905880o769538
$$ plain form
689.4 496284246 496077597 495887607 494635820 491601259 487364411 483296931 480319470 478331983 476840556
707.7 476840556 476087928 477075696 480345815 485381186 491220176 497040868 502738595 509177268 516655266
726.1 516655266 523910701 529666364 533921719 537588954 541439712 545022488 547156096 547269583 545839250
744.5 545839250 543724656 541161299 537423432 531929076 525315583 518926859 513706267 509696186
760.8 509696186 506453216 504095316 503764272 506693363 512934923 521253705 530307233 539694607 549632370
779.1 549632370 559928298 569599688 577385247 582933843 587426841 592280030 597764015 603099167
795.4 603099167 607594728 611564517 615896344 620778322 625107646 627541482 628058791 628095508 628926694
813.8 628926694 630357981 631111085 630319417 628483176 626725137 625148773 622482479 617576599 610807061
832.2F10807061p079124o228328n540550n785286o311417o014466m879415m005253
848.5E64963222m299582n539238o702542o867767n526363k277732K543032P422685
864.8E43715715J1202872J3983786J5479744J4461458J0876357O516874K999544K15113
881.1F19451463k782106o015301q356810q863627p963837o975174o696641o955266
897.4E64842701p051408o682635o509840p290423q946478j0659457j1626720j1765629
913.7D94310111j1482597j0929226r704262p337541m235566j593768j22279M90218
930.1D49395090J096607K279937L768206M909634N355775M854441L014118l25829m780889
948.4D69567090r491592j3476640j6077608j7236591j7526090j7755180j8315763j8926382
$$ plain form
832.2 610807061 603727937 597499609 591959059 586173773 579862356 573847890 568968475 564963222
848.5 564963222 560663640 555124402 548421860 541554093 536027730 533749998 536293030 543715715
864.8 543715715 554918587 568902373 584382117 598843575 609719932 616236806 619236350 619451463
881.1 619451463 616669357 610654056 602297246 593433619 585469782 578494608 571797967 564842701
897.4 564842701 557791293 551108658 544598818 537308395 528361917 517702460 506075740 494310111
913.7 494310111 482827514 471898288 462194026 454856485 450620919 449027151 448904872 449395090
930.1 449395090 450491697 452771634 456539840 461449474 466805249 471659690 474673808 474347979 469567090
948.4 469567090 460075498 446598858 430521250 413284659 395758569 378003389 359687626 340761244
964.7C40761244j9164771j9006729j8658369j8198699j7491088j6240581j4279500
979B17721507j1767864r035036o442800m244864k393335p57799N13881J275555J585573
997.4A86454818J638829J634702J564026J285285P65219K02433o9395J14143O07923
1015.7A94197983J188740J700356K180577K686724L149196L487662L580570L341913
1032B15513721K817422K174646J534134R63360N33566L51802N40122J163751K155065
1050.4B27747589L383115M668415N775466O823048Q038655R202332R462803P454276
1066.7B82555699K406866m185766q947820r649992p136881l708899p34776J526326
1083B52124757L078520L979653M535675N060375N518138N535752M727781L189832J539915
$$ plain form
964.7 340761244 321596473 302589744 283931375 265732676 248241588 232001007 217721507
979 217721507 205953643 196918607 190475807 186230943 183837608 183079809 183593690 184869245 186454818
997.4 186454818 188093647 189728349 191292375 192577660 193342879 193545312 193475917 193590060 194197983
1015.7 194197983 195386723 197087079 199267656 201954380 205103576 208591238 212171808 215513721
1032 215513721 218331143 220505789 222039923 223003283 223536849 223888651 224428773 225592524 227747589
1050.4 227747589 231130704 235799119 241574585 248397633 256436288 265638620 275101423 282555699
1066.7 282555699 284962565 280776799 271828979 262178987 255042106 251333207 250598431 252124757
1083 252124757 255203277 259182930 263718605 268778980 274297118 279832870 284560651 287750483 289290398
1101.4B89290398N98252P62403J723498K864302L669351L998220M015446L720581K987802
1119.8C13630253K073467J546413J885891L063052M370362M810572L842115J648694
1136.1C36870819j189023m000544o265045p679492q104592p533849o237864m696876
1152.4B91163534l300101k122193r22501N08398K150207L900767N680084P447511R307295
1170.7C13813001J1194825J2678176J3388455J3495535J3495743J3563365J3380557
1185D05009657J2416124J0522753Q272261O370395N007685L945291K921670K081693
1201.3D56547529J886785K500325L542036M426509M916608N274713N704105N861461
1217.7D90660071N207152L651171J737118K27452n31495r03010j421899k061814k374768
$$ plain form
1101.4 289290398 289888650 290651053 292374551 295238853 298908204 302906424 306921870 310642451 313630253
1119.8 313630253 315703720 317250133 319136024 322199076 326569438 331380010 335222125 336870819
1136.1 336870819 335681796 331681252 325416207 317736715 309632123 302098274 295860410 291163534
1152.4 291163534 287863433 285741240 284818739 285327137 287477344 291378111 297058195 304505706 313813001
1170.7 313813001 325007826 337686002 351074457 364569992 378065735 391629100 405009657
1185 405009657 417425781 427948534 436220795 442591190 447598875 451544166 454465836 456547529
1201.3 456547529 458434314 460934639 464476675 468903184 473819792 479094505 484798610 490660071
1217.7 490660071 495867223 499518394 501255512 501482964 500951469 500048459 498626560 496564746 494189978
1236D94189978k084971j360237o01560n6774M20600J125336K027303K696872K666175
1254.4D99022722J982153J248777J010894J275480J704633K000571K137840K292931
1270.7E12676001K376556K029121J107335q0228q92699r40680n46992l76046p72357
1289E14580011j439392j815856j808345j816392k134681k591848k757728k498776k112269
1307.4D95604724j865685j807630j800865j613170j259268j161843j812249l178090
1323.7D81105924m670441n634517n906135n723566n250364m452646l217250j627117
1340D44623888k73198L28213L81738K57581J62661Q6784j85608o99997j165420j289368
1360.4D42227274j038909n78761l79979m23790j59472N49168J308530J490861J173377
$$ plain form
1236 494189978 492105007 490744770 490143210 490086436 490507036 491632372 493659675 496356547 499022722
1254.4 499022722 501004875 502253652 503264546 504540026 506244659 508245230 510383070 512676001
1270.7 512676001 515052557 517081678 518189013 518108785 517216086 516275406 515728414 515352368 514580011
1289 514580011 513140619 511324763 509516418 507700026 505565345 502973497 500215769 497716993 495604724
1307.4 495604724 493739039 491931409 490130544 488517374 487258106 486096263 484284014 481105924
1323.7 481105924 476435483 470800966 464894831 459171265 453920901 449468255 446251005 444623888
1340 444623888 444350690 444678903 445060641 445318222 445480883 445567667 445382059 444682062 443516642 442227274
1360.4 442227274 441188365 440609604 440229625 439805835 439646363 440195531 441504061 442994922 444168299
1378.8D44168299R37343J349419K647728M398883M919081L660322K276540J203745
1395.1D65561360L10063m87118j168639j704842k093881k031833j907498k095729k219409
1413.5D52162474j977324j623333j104027l73631K8431K36958O13869J223057J709431
1431.8D50895905J724124J775653J974374J923978K001375J830250J106858R5189p02530
1450.2D62625176j046181j268595k200336k848834j164197M65840K114236L768742
1466.5D60445851M683018O305218R742438J1203766R971947Q934617Q328736P948696
1482.8E27564287P366479P303118P665456P166266N473852M903019N685806N612493
1499.1E78740776M559278L621817L623426M715860M090786L128767K901673K738178
$$ plain form
1378.8 444168299 445105642 446455061 449102789 453501672 458420753 462081075 464357615 465561360
1395.1 465561360 465871423 465384305 464215666 462510824 460416943 458385110 456477612 454381883 452162474
1413.5 452162474 450185150 448561817 447457790 447084159 447112590 447349548 447963417 449186474 450895905
1431.8 450895905 452620029 454395682 456370056 458294034 460295409 462125659 463232517 463327706 462625176
1450.2 462625176 461578995 460310400 458110064 455261230 454097033 454562873 456677109 460445851
1466.5 460445851 465128869 471434087 481176525 492380291 502352238 511286855 519615591 527564287
1482.8 527564287 534930766 542233884 549899340 557065606 562539458 567442477 573128283 578740776
1499.1 578740776 583300054 586921871 590545297 595261157 599351943 602480710 605382383 608120561
1515.4F08120561K835035K924979L182411K810299K071560J970947J954495K107025
1531.8F27977312K300799J834392J318693J430691J355886J075983Q92699N43952K85685
1550.1F39016092K90811M67181M48227k78294j320362q66652o00516n97179r56893
1568.5F35602415j572788j446605j342535j729965j679421j638472j972675k046645
1584.8F22173309j932025j921057k153933k496004k766073k769113k649486k793014
1601.1F02692604l145873l451586l625453l767371l705382l575504m195273n049527
1617.4E72176635l879130l069281l516078l495813l341734l119946k269208j687229
1633.7E47798216j803994j456678p11977j02759N02706J190305J750111J595736K166986
$$ plain form
1515.4 608120561 610955596 613880575 617062986 619873285 621944845 623915792 625870287 627977312
1531.8 627977312 630278111 632112503 633431196 634861887 636217773 637293756 638186455 638730407 639016092
1550.1 639016092 639306903 639774084 640222311 639944017 638623655 637757003 637156487 636559308 635602415
1568.5 635602415 634029627 632583022 631240487 629510522 627831101 626192629 624219954 622173309
1584.8 622173309 620241284 618320227 616166294 613670290 610904217 608135104 605485618 602692604
1601.1 602692604 599546731 596095145 592469692 588702321 584996939 581421435 577226162 572176635
1617.4 572176635 568297505 565228224 561712146 558216333 554874599 551754653 549485445 547798216
1633.7 547798216 545994222 544537544 543825567 543722808 544225514 545415819 547165930 548761666 550928652
1652.1E50928652L755212L289282K968610L433585M088521M428148M166901M763842
1668.4E81822753N590320M832387M898369N638122N270720M890323N309999O622493
1684.7F24875486N766153M827202N033731M405320M154861M221618L953218M156232
1701.1F61393821L121376K230585K123952K042055K194345K341807K283275K331376
1717.4F80062592K303898K185762K306581K333641J998424J825810J886189K369046
1733.7F97271943K551496J928926J791119K022863K330422K683401K866507K931356
1750G16378033K953410K809525K941608L046632K602577K289951K079964J962662K040445
1768.4G39104807J907707J593530J352966J286149J438379J541674J290023R80974
$$ plain form
1652.1 550928652 554683864 557973146 560941756 564375341 568463862 572892010 577058911 581822753
1668.4 581822753 587413073 592245460 597143829 602781951 608052671 612942994 618252993 624875486
1684.7 624875486 630641639 635468841 640502572 644907892 649062753 653284371 657237589 661393821
1701.1 661393821 664515197 666745782 668869734 670911789 673106134 675447941 677731216 680062592
1717.4 680062592 682366490 684552252 686858833 689192474 691190898 693016708 694902897 697271943
1733.7 697271943 699823439 701752365 703543484 705566347 707896769 710580170 713446677 716378033
1750 716378033 719331443 722140968 725082576 728129208 730731785 733021736 735101700 737064362 739104807
1768.4 739104807 741012514 742606044 743959010 745245159 746683538 748225212 749515235 750496209
1784.7G50496209R85741J150608J299262J385272J088798Q05676Q68380J103640J215219
1803G60398805J039624P81775P23362R29773J092970R76622O93560N76973O90520Q49187
1823.4G68753171R33588P41601M34815M15385O29723P39098O47843M10974J93953J97888
1843.8G74098039N05209O23524L91900J27554Q6248K87116M76420M45902K01762M5001
1864.2G77288675J26422L54111N48959M36067J88291J34707L55184O08981O22451L86536
1884.6G81050384J91212K70724N54860O45280L84509R0957N5611K77638M78387L64542
1905G84364104O020j78158L7074L91603M75943J84476j03593n6922K57432N12600L88861
1927.5G86279440L2127j46508N3703L55900M03464J36613j54972o4969L19422M92930
$$ plain form
1784.7 750496209 751481950 752632558 753931820 755317092 756405890 757211566 758079946 759183586 760398805
1803 760398805 761438429 762220204 762943566 763873339 764966309 765942931 766636491 767213464 767903984 768753171
1823.4 768753171 769686759 770428360 770863175 771278560 771908283 772647381 773295224 773706198 773900151 774098039
1843.8 774098039 774603248 775226772 775618672 775746226 775832474 776119590 776596010 777041912 777243674 777288675
1864.2 777288675 777415097 777769208 778318167 778754234 778942525 779077232 779432416 780041397 780663848 781050384
1884.6 781050384 781241596 781512320 782067180 782712460 783096969 783187926 783243537 783521175 783999562 784364104
1905 784364104 784370124 784191966 784229040 784620643 785096586 785281062 785177469 785120547 785377979 785890579 786279440
1927.5 786279440 786311567 786165059 786218762 786574662 786978126 787114739 786959767 786894798 787214220 787707150
1947.9G87707150L34620Q5474K1696K32577M86910M78983J81735o6519M2438L76821
1968.3G89881885M91858K79843P16q2434J35124L94464L64005P6831j43052n7399K03967
1990.7G91545808L09527J43767j02759j70946o676J54436Q0705k00033m28379l89278
2011.1G90936172j61409j15693l78788o76512p66874o86884m88758j59621j08182m33266
2031.5G86960185n70178l86179k32339k83003m46498n20527l71099j32740j9013j09911
2051.9G83888698k82169k57730J6689K22504J56760k6822j03295L1293K47538L20971
2072.3G84214437J17898j67251j59263J36077L42131K45392M351j28567K2948L27706
2092.7G84955859M21405K17915L337N4420K90751M39227L47554P5996j06990K6703
$$ plain form
1947.9 787707150 788041770 788127244 788148940 788381517 788868427 789347410 789529145 789462626 789505064 789881885
1968.3 789881885 790373743 790653586 790654302 790571868 790706992 791101456 791465461 791542292 791399240 791341841 791545808
1990.7 791545808 791855335 791999102 791896343 791725397 791718721 791873157 791953862 791753829 791325450 790936172
2011.1 790936172 790774763 790659070 790280282 789603770 788836896 788150012 787661254 787501633 787393451 786960185
2031.5 786960185 786390007 786003828 785771489 785488486 785041988 784521461 784150362 784017622 783998609 783888698
2051.9 783888698 783606529 783348799 783365488 783587992 783744752 783717930 783614635 783645928 783893466 784214437
2072.3 784214437 784332335 784165084 784005821 784141898 784484029 784729421 784733772 784605205 784628153 784955859
2092.7 784955859 785377264 785595179 785598516 785652936 785943687 786382914 786730468 786806464 786699474 786726177
2113.1G86726177L12984L83556J06394k25604k20835R4414L39627K44379p4029k37882
2133.5G87449181l3140K57075K50160j0073j92642j10388J36316L00944K23339R655
2153.9G88280427o5982J65701N04077N71787L25143J08600K24709N99265Q36075O71863
2174.3G92221665L56794L11672N89192Q39115P63118M64082K52008L21209N99564P46190
2194.6G97464609N49078K41757J66535M04119O85037O90639M21941K13623L47376O22451
2215H01807165O97851N27978K56837J27732L33846O29485O05523L11852P2777R5964
2235.4H05467010L43143N48840M45247J28150m77K04623M89235N41687K90989L7611
2255.8H08496058J08778M37201O45339M46558P1406q583K66671N29409M58837J18494
$$ plain form
2113.1 786726177 787039161 787422717 787529111 787303507 787082672 787177086 787516713 787761092 787687063 787449181
2133.5 787449181 787416041 787673116 787923276 787913203 787720561 787610173 787746489 788047433 788270772 788280427
2153.9 788280427 788214445 788380146 788884223 789456010 789781153 789889753 790114462 790713727 791549802 792221665
2174.3 792221665 792578459 792890131 793479323 794318438 795081556 795545638 795797646 796118855 796718419 797464609
2194.6 797464609 798013687 798255444 798421979 798826098 799511135 800201774 800623715 800837338 801184714 801807165
2215 801807165 802505016 803032994 803289831 803417563 803751409 804380894 804986417 805298269 805371046 805467010
2235.4 805467010 805810153 806358993 806804240 806932390 806931913 807136536 807625771 808167458 808458447 808496058
2255.8 808496058 808604836 809042037 809687376 810133934 810205340 810196757 810463428 810992837 811451674 811570168
2276.2H11570168j65582j21057K38240O18100O71923M13716K90334N69284R61840J001358
2296.6H16048324O93262N04315P62343J339018J768947J708806J313507J014292J204133
2315H26356947J945496K613306K445996J677155J371324J748562J839698J031279J38104
2333.3H41167867J31428O03497Q46923L69310j501918m218936l944516l1769M129350
2351.7H37551236N914807N046845L258824J288355m80831k176225l847063m984617
2368H41571331n215049m845679m488170m366219m299044l933370l088475k040624j269281
2386.4H08025420r40323p54476m49240j18792j7226k42889n45919n92768l62515j40488
2406.8H03860784k01524n21123p64370o72937m06682l07322n09381q03232q75652o94811
$$ plain form
2276.2 811570168 811404586 811283529 811521769 812139869 812811792 813225508 813515842 814085126 815046966 816048324
2296.6 816048324 816741586 817245901 818008244 819347262 821116209 822825015 824138522 825152814 826356947
2315 826356947 828302443 830915749 833361745 835038900 836410224 838158786 839998484 841029763 841167867
2333.3 841167867 841299295 841902792 842749715 843119025 841617107 837398171 833453655 833421886 837551236
2351.7 837551236 843466043 848512888 851771712 853060067 852579236 850403011 846555948 841571331
2368 841571331 836356282 831510603 827022433 822656214 818357170 814423800 811335325 809294701 808025420
2386.4 808025420 807085097 806330621 805881381 805762589 805745363 805502474 804956555 804363787 804001272 803860784
2406.8 803860784 803659260 803138137 802373767 801700830 801294148 800986826 800477445 799674213 798798561 798103750
2427.2G98103750m70340m58956p13647r31322q54135n91934m49717o24358r43482j008570
2447.6G91057289p56204m95315n04375p74979r58026q15153n27978m11212n87165q52943
2467.9G84373939q90076o41942l75331l73661o43432q91865q03530m60863k52068l88086
2488.3G78653085o70850p19726m62592j80006j37687l78370o36637n79476k78712j00732
2508.7G74508297k53975n84543p11858m86910k21432k73764n86152q16226p61091n30780
2529.1G69281566m08769n75006q78274r92835q17596n64635n45204q13782j049101
2547.5G62636364r50635o35266m63784o24120r84550j138627q43644m50314m38392
2565.8G56107032p66873j019895r34363o19471m35829o17265r43661j013935p42674
$$ plain form
2427.2 798103750 797633410 797174454 796460807 795529485 794675350 794083416 793633699 793009341 792065859 791057289
2447.6 791057289 790301085 789805770 789301395 788526416 787568390 786753237 786225259 785814047 785226882 784373939
2467.9 784373939 783483863 782841921 782466590 782092929 781449497 780557632 779754102 779293239 779041171 778653085
2488.3 778653085 777982235 777262509 776799917 776619911 776482224 776103854 775467217 774887741 774609029 774508297
2508.7 774508297 774254322 773669779 772957921 772471011 772249579 771975815 771389663 770573437 769812346 769281566
2529.1 769281566 768872797 768297791 767419517 766426682 765609086 765044451 764499247 763685465 762636364
2547.5 762636364 761685729 761050463 760586679 759962559 758978009 757839382 756995738 756545424 756107032
2565.8 756107032 755340159 754320264 753385901 752766430 752330601 751713336 750769675 749755740 749013066
2584.2G49013066m18126l68655n98013q05140p17580l86060k09987m38094p77364q41200
2604.6G43452847o29842m18008m99844q69870j140476j074075q57950q10921j068711
2623G36083150j416862j530528j334608j061618j066208j384258j627565j522481j257360
2641.3G23881662j160324j330316j579463j604438j349092j094639j106739j368463
2657.6G13288188j588285j459897j095533r50158j171231j438021j423896j110971
2673.9G03050196q16881q79348j178980j326382j168549q76248p90775j010120j274764
2692.3F93728149j340330j174211r75788j034677j344025j552463j450598j199782
2708.6F83656275j099825j247763j444340j445591j212955r58562r37045j140236j264632
$$ plain form
2584.2 749013066 748594940 748226285 747628272 746823132 746105552 745719492 745509505 745071411 744294047 743452847
2604.6 743452847 742823005 742404997 741905153 741035283 739894807 738820732 737962782 737151861 736083150
2623 736083150 734666288 733135760 731801152 730739534 729673326 728289068 726661503 725139022 723881662
2641.3 723881662 722721338 721391022 719811559 718207121 716858029 715763390 714656651 713288188
2657.6 713288188 711699903 710240006 709144473 708194315 707023084 705585063 704161167 703050196
2673.9 703050196 702233315 701353967 700174987 698848605 697680056 696803808 696013033 695002913 693728149
2692.3 693728149 692387819 691213608 690237820 689203143 687859118 686306655 684856057 683656275
2708.6 683656275 682556450 681308687 679864347 678418756 677205801 676247239 675310194 674169958 672905326
2727F72905326j092732p89940o99163r18806j151263j096785q05855n83291o74784
2745.3F65092707r53853j070500q87513o17266n44607o92606q60513q47756o43015
2763.7F57975078m78685n69344q39472j014053r48906p93100q00073j011968j264155
2782F50255322j353859j218558j108110j238525j522064j745045j753867j645863j641691
2800.4F37027740j820325k065599k176881k126754k067208k160787k405465k574801
2816.7F19629920k551616k470255k511441k743066k992689l070534l025293k980888
2833E97284138l074944l359020l664553l820419l914893m144072m454792m599035m374206
2851.4E61878204l802120l191233k868295k962708l359378l817796m264593m777968
$$ plain form
2727 672905326 671812594 671022654 670323491 669404685 668253422 667156637 666350782 665767491 665092707
2745.3 665092707 664138854 663068354 662180841 661563575 661018968 660326362 659465849 658618093 657975078
2763.7 657975078 657496393 656927049 656087577 655073524 654124618 653331518 652531445 651519477 650255322
2782 650255322 648901463 647682905 646574795 645336270 643814206 642069161 640315294 638669431 637027740
2800.4 637027740 635207415 633141816 630964935 628838181 626770973 624610186 622204721 619629920
2816.7 619629920 617078304 614608049 612096608 609353542 606360853 603290319 600265026 597284138
2833 597284138 594209194 590850174 587185621 583365202 579450309 575306237 570851445 566252410 561878204
2851.4 561878204 558076084 554884851 552016556 549053848 545694470 541876674 537612081 532834113
2867.7E32834113n361557n838633o029665n955220n645930n150319m554182l834098
2884D90464509k998919k143532j408011r46253p62910p10785o85841p01398q62449
2902.4D79244411j218349j658559k035319k368778k832741l460079m029841m273414
2918.7D57367331m126758l683567l040939k275706j405626l48806R59664K370924L567815
2937D49384332M402399N057961N658924O088644O280512O340295O369591O380468O420881
2955.4E02384007O482899O380439N992413N519092N186736M927576M656434M422426
2971.7E45952022M207790M015088L956676L971934L759980L242135K768576K565444
2988E74439645K465427K204358J728773J268805R53853P20322M66764P8618l97145
$$ plain form
2867.7 532834113 527472556 521633923 515604258 509649038 504003108 498852789 494298607 490464509
2884 490464509 487465590 485322058 483914047 482967794 482204884 481494099 480808258 480106860 479244411
2902.4 479244411 478026062 476367503 474332184 471963406 469130665 465670586 461640745 457367331
2918.7 457367331 453240573 449557006 446516067 444240361 442834735 442485929 443445593 445816517 449384332
2937 449384332 453786731 458844692 464503616 470592260 476872772 483213067 489582658 495963126 502384007
2955.4 502384007 508866906 515247345 521239758 526758850 531945586 536873162 541529596 545952022
2971.7 545952022 550159812 554174900 558131576 562103510 565863490 569105625 571874201 574439645
2988 574439645 576905072 579109430 580838203 582107008 583060861 583781183 584247947 584326565 583929420
3006.4E83929420p40767q42929r21667j209974j626372j977205k144397k145767k182960
3024.7E70137382k380133k615452k731562k672433k628029k758562k884567k955258
3041.1E48511386l053069l084362l024578l004193l136277l281653l224433l096103
3057.4E23606718l076554l128707l151000l103614l072917l102720l179073l234744
3073.7D98557389l113955k915532k919167l067374l170073l225416l172100l037244
3090D73936528l030390l117889l115952l006190k924740k922505k884478k822846k860486
3108.4D47251052k954454k832651k537518k495110k742291l006577l069222k874077
3124.7D24739152k627164k547562k660036k752334k607822k345503k301961k532423
$$ plain form
3006.4 583929420 583188653 582345724 581424057 580214083 578587711 576610506 574466109 572320342 570137382
3024.7 570137382 567757249 565141797 562410235 559737802 557109773 554351211 551466644 548511386
3041.1 548511386 545458317 542373955 539349377 536345184 533208907 529927254 526702821 523606718
3057.4 523606718 520530164 517401457 514250457 511146843 508073926 504971206 501792133 498557389
3073.7 498557389 495443434 492527902 489608735 486541361 483371288 480145872 476973772 473936528
3090 473936528 470906138 467788249 464672297 461666107 458741367 455818862 452934384 450111538 447251052
3108.4 447251052 444296598 441463947 438926429 436431319 433689028 430682451 427613229 424739152
3124.7 424739152 422111988 419564426 416904390 414152056 411544234 409198731 406896770 404364347
3141D04364347k685338k576053k351791k158552k128363k310156k478302k407879k229064
3159.4C83038849k129823k129883k146333k094865k002508j938074j951814j988083
3175.7C66657466j964361j893639j816988j773447j781345j767426j704961j672268
3192C52283031j667500j660406j639754j570195j470148j417518j443476j515954j524777
3210.3C38373303j417368j293361j237393j274258j329034j325906j268983j178056
3226.7C28048944j101732j055866j080156j207471j246213j126886j051247j028717
3243C19150656r37730q59797r31054j018137r45985q47459q87334r12965q13305p57754
3263.4C10239136p72953o84470n34624n85287p91043q91060q65162q00043p02679o17504
$$ plain form
3141 404364347 401679009 399102956 396751165 394592613 392464250 390154094 387675792 385267913 383038849
3159.4 383038849 380909026 378779143 376632810 374537945 372535437 370597363 368645549 366657466
3175.7 366657466 364693105 362799466 360982478 359209031 357427686 355660260 353955299 352283031
3192 352283031 350615531 348955125 347315371 345745176 344275028 342857510 341414034 339898080 338373303
3210.3 338373303 336955935 335662574 334425181 333150923 331821889 330495983 329227000 328048944
3226.7 328048944 326947212 325891346 324811190 323603719 322357506 321230620 320179373 319150656
3243 319150656 318212926 317353129 316422075 315403938 314457953 313610494 312723160 311810195 310996890 310239136
3263.4 310239136 309466183 308781713 308247089 307661802 306870759 305979699 305114537 304314494 303611815 302994311
3283.8C02994311o21587o41287n62965m59552n09024p06494q46535p96348n83052l90828
3304.2B96876639m56393p32392r68456j017630q95321p75993p41721p28636p08759
3322.5B89851338p02203p81715q92490q98480q45552p47114o16103o60867q35001r25661
3342.9B81946152r74208q92430o54817o73145r85831j105636r13322p23839p07597
3361.3B74315327p21365o16222n83619q05468j060158j019865p76261o74099o91145
3379.6B67367125p19429p05480n48005k86758r4712k45035o16908o22302k11418n0276
3400B63266802m19647p41928n50837k02179j04397k08229l69072m05252k32071j05917
3420.4B59927273j31667p2539J26392K72423K27630J95056K59012J35482j09613r9331
$$ plain form
3283.8 302994311 302372724 301731437 301168472 300708920 300199896 299493402 298646867 297850519 297267467 296876639
3304.2 296876639 296420246 295687854 294719398 293701768 292806447 292030454 291288733 290560097 289851338
3322.5 289851338 289149135 288367420 287474930 286576450 285730898 284983784 284367681 283706814 282871813 281946152
3342.9 281946152 280971944 280079514 279424697 278751552 277765721 276660085 275746763 275022924 274315327
3361.3 274315327 273593962 272977740 272394121 271588653 270528495 269508630 268732369 268058270 267367125
3379.6 267367125 266647696 265942216 265394211 265107453 265012741 264767706 264150798 263528496 263317078 263266802
3400 263266802 262847155 262105227 261554390 261352211 261247814 261039585 260670513 260265261 260033190 259927273
3420.4 259927273 259795606 259723067 259849459 260121882 260349512 260544568 260803580 260939062 260829449 260730118
3440.8B60730118J12831K88308M04984M17620L91751M19229M41403N20855O67333O17057
3461.2B65011489N91070Q98689J036763O41674K17676K75344N95271Q74549Q45135
3479.6B70987660N52624N78404Q29696P90716O91026Q07226R09656R53734R35167Q70198
3500B78906107Q26597P09266O45458P93189J028001J170040J024901Q03173Q46446
3518.3B86753178J060128J281410J152695P88986P69466J015574J219034J341880J287937
3536.7B96670288J173764J351178J565933J402945J077443J114666J355231J505703
3553C07217151J635581J769751J888693J944870J834988J734376K105653K496839K377778
3571.3C25005680K307177K527803K723754K885401L106266L147602K939761K908826
$$ plain form
3440.8 260730118 260842949 261131257 261536241 261953861 262345612 262764841 263206244 263727099 264394432 265011489
3461.2 265011489 265602559 266501248 267538011 268179685 268397361 268672705 269267976 270142525 270987660
3479.6 270987660 271540284 272118688 272948384 273739100 274430126 275237352 276147008 277100742 278035909 278906107
3500 278906107 279732704 280441970 281087428 281880617 282908618 284078658 285103559 285906732 286753178
3518.3 286753178 287813306 289094716 290247411 291036397 291805863 292821437 294040471 295382351 296670288
3536.7 296670288 297844052 299195230 300761163 302164108 303241551 304356217 305711448 307217151
3553 307217151 308852732 310622483 312511176 314456046 316291034 318025410 320131063 322627902 325005680
3571.3 325005680 327312857 329840660 332564414 335449815 338556081 341703683 344643444 347552270
3587.7C47552270L225684L227591L176213L446042L686279L716737L728211L616870
3604C75375897L384024L507614L776848L860205M012764L940672L967911M535347M496753
3622.3D10858035L892958L401757L661870M539371M378140M005432L871054L812074
3638.7D42420691L956288M080594L875703L580153L899693M556358M240364L799200
3655D74409044M128963M232615L733426L482580L544718L304452L153324L621251L317773
3673.3E06928146K919078L443897L481984L219664L186524L133595K945780K691925
3689.6E31950593K643108K703309K682865K537489K210617K051234K244413K244473
3706E51268101J883030J441180J506210K075851K246916K145469K037883J909733J716554
$$ plain form
3587.7 347552270 350777954 354005545 357181758 360627800 364314079 368030816 371759027 375375897
3604 375375897 378759921 382267535 386044383 389904588 393917352 397858024 401825935 406361282 410858035
3622.3 410858035 414750993 418152750 421814620 426353991 430732131 434737563 438608617 442420691
3638.7 442420691 446376979 450457573 454333276 457913429 461813122 466369480 470609844 474409044
3655 474409044 478538007 482770622 486504048 489986628 493531346 496835798 499989122 503610373 506928146
3673.3 506928146 509847224 513291121 516773105 519992769 523179293 526312888 529258668 531950593
3689.6 531950593 534593701 537297010 539979875 542517364 544727981 546779215 549023628 551268101
3706 551268101 553151131 554592311 556098521 558174372 560421288 562566757 564604640 566514373 568230927
3724.3E68230927J677155J810909J602351J192093J049042J378954J733481J481712
3740.6E80156624P03931O13272J450897J118362N71489J314580J826048J463235J149654
3759E90368092J329362J379610J206755J125992J024127J104593J266897J255095J144230
3777.3F01204753R81390R31919Q81076R31561J107037J185000J191735J010299Q08120
3795.7F10232890Q40306O38783O28233J089096Q68559P61092J156866J174331P74920
3814.1F18165076O03556P69496M95911O70314J101076R44078Q25346P86543P76768
3832.4F25138164Q13543N51403K98858N42581P79748R15110J021743Q95559K69890
3850.8F31226599n57184K82943J450241J220286O40988K83122M87447O17862L41057
$$ plain form
3724.3 568230927 569908082 571718991 573321342 574513435 575562477 576941431 578674912 580156624
3740.6 580156624 580860555 581473827 582924724 584043086 584614575 585929155 587755203 589218438 590368092
3759 590368092 591697454 593077064 594283819 595409811 596433938 597538531 598805428 600060523 601204753
3777.3 601204753 602186143 603118062 603999138 604930699 606037736 607222736 608414471 609424770 610232890
3795.7 610232890 611073196 611711979 612340212 613429308 614297867 615058959 616215825 617390156 618165076
3814.1 618165076 618768632 619538128 620034039 620704353 621805429 622749507 623574853 624361396 625138164
3832.4 625138164 625951707 626503110 626801968 627344549 628124297 629039407 630061150 630956709 631226599
3850.8 631226599 630669415 630952358 632402599 633622885 634263873 634546995 635034442 635652304 635993361
3869.1F35993361M74036O98447Q09491Q01385M65810M82678N75304M13835N57959N12600
3889.5F41784906L17037N44131O75679L90708J19150J69813L41833N53727O26087M88103
3909.9F46011174M49419M29392K20537J58310L35753L33965K43008L34143L86656K32279
3930.3F49134636J66356L19481M07041L85820L03686K38001L14773L11315J80006K00510
3950.7F51961625L77595M39644L47018L09229K33173J12653J88887L12448L04520K55644
3971.1F54842436K14279J79887J81258K25424L02971L04877J90557J49548K29120K68817
3991.5F57089174K20418J63316J35780
3997.6F57608688
$$ plain form
3869.1 635993361 636467397 637165844 637975335 638776720 639242530 639725208 640300512 640714347 641272306 641784906
3889.5 641784906 642101943 642646074 643321753 643712461 643831611 644001424 644343257 644896984 645523071 646011174
3909.9 646011174 646460593 646889985 647110522 647268832 647604585 647938550 648181558 648515701 648902357 649134636
3930.3 649134636 649300992 649620473 650027514 650413334 650717020 650955021 651269794 651581109 651761115 651961625
3950.7 651961625 652339220 652778864 653125882 653435111 653668284 653780937 653969824 654282272 654586792 654842436
3971.1 654842436 655056715 655236602 655417860 655643284 655946255 656251132 656441689 656591237 656820357 657089174
3991.5 657089174 657309592 657472908 657608688
3997.6 657608688
##END=$$ End of the data block
