##TITLE=$$ Begin of the data block
##JCAMP-DX=5.00 $$ ACD/SpecManager v 10.08
##SPECTROMETER/DATA SYSTEM=Alpha
##DATE=23 Dec 2014 14:28:26
##DATA TYPE=INFRARED SPECTRUM
##DATA CLASS=XYDATA
##ORIGIN=
##OWNER=
##NPOINTS=1765
##FIRSTX=399.76428223
##LASTX=3997.64306641
##MAXX=3997.64306641
##MINX=399.76428223
##MAXY=0.85175514
##MINY=0.18299395
##XFACTOR=1.0000000000
##YFACTOR=1.000000000000000e-9
##FIRSTY=0.47852924
##DELTAX=2.03961372
##XUNITS=1/CM
##YUNITS=ARBITRARY UNITS
##XYDATA=(X++(Y..Y))
399.8D78529245n985260n231917l202737J41323K520949K452314J402914J071274J253337
418.1D72951442q8125k531291l760278l474861k541751k350777k952516l283441k154291
436.5D49814111L40939L061145M962653N060315M266352M109323L758132K128989j33992
454.8D77367967j743465j830936j004666j183420k646923m286081m538745l444105
471.2D56689626k616137k588630k804339k478629j283109N9396M99069k41130j065046
489.5D44171071j066923o58870q03023j773864k828777l154934k643168k227217k887338
507.9D26126957m112631m723787m428953l920466l999144m434407m132330k679139
524.2C93696100p18624N64844O78658O18398J621008L937781O318241O951630N457253
$$ plain form
399.8 478529245 472543985 467312068 464109331 464250654 466771603 469223917 470626831 471698105 472951442
418.1 472951442 472863317 470332026 466571748 463096887 460555136 458204359 455251843 451968402 449814111
436.5 449814111 450155050 453216195 458178848 463239163 467505515 471614838 475372970 477501959 477367967
454.8 477367967 475624502 473793566 472788900 471605480 468958557 464672476 460133731 456689626
471.2 456689626 454073489 451484859 448680520 446201891 444918782 444978178 445477247 445236117 444171071
489.5 444171071 443104148 442445278 441642255 439868391 437039614 433884680 431241512 429014295 426126957
507.9 426126957 422014326 417290539 412861586 408941120 404941976 400507569 396375239 393696100
524.2 393696100 392977476 393542320 394220978 394839376 396460384 400398165 406716406 413668036 419125289
542.5D19125289L276139J803130Q95828l22610k000958l337651l794372l823251m090577
560.9D07730967n152524o749421p794201p398069n526215l107220q50827J432896M034400
579.3C76619786O615132Q280367Q277058O864071N073846L760844K737314J495361
595.6D19723779J11550q04782o54995J66177O34790M67360L33667Q42839J944900L050476
616D25815761L548831L448635L422439L883273M474282M378617L341824K225041J884311
634.3D56423014K295137K658248K232104J229883Q11070J552075K472460K319932J270384
652.7D73264307N51581Q00073J510501J766831J288921J239597K862364L093541O04332
671D86982048P72327J302808J007855J365245K242654K318263J224607K1667l46870
$$ plain form
542.5 419125289 422401428 424204558 425100386 424777776 422776818 419439167 415644795 411821544 407730967
560.9 407730967 402578443 395829022 388034821 380636752 375110537 372003317 371152490 372585386 376619786
579.3 376619786 383234918 391515285 399792343 406656414 411730260 415491104 418228418 419723779
595.6 419723779 419835329 419030547 418375552 418541729 419176519 419643879 419977546 420820385 422765285 425815761
616 425815761 429364592 432813227 436235666 440118939 444593221 448971838 452313662 454538703 456423014
634.3 456423014 458718151 461376399 463608503 464838386 465649456 467201531 469673991 471993923 473264307
652.7 473264307 473815888 474615961 476126462 477893293 479182214 480421811 483284175 486377716 486982048
671 486982048 487754375 489057183 490065038 491430283 493672937 495991200 497215807 497237474 496890604
689.4D96890604j06155k49416j444370l212958m216969l876895k899051k094209j572817
707.7D77217764p33823J010537L276021N073338N852461N838573N809665O545365P478773
726.1E17368674P184029N671382M243076L752470L897369L550112K098262J03891j405775
744.5E46463490k122581k658964l840267n549014o651998o407737n241275m057229
760.8E09934425l251195k300500k75195K939761O280660Q446098R195268R399235R780884
779.1E50149441J0145485R640753P888854N755365M596293M824221N498648N362332
795.4F03861392M434406L879726M341245M994988M357338K312780M55141J14977Q79646
813.8F29631639J317381N72801q38876j743436j687347j601100k729178m971266o855130
$$ plain form
689.4 496890604 496784449 496535033 495090663 491877705 487660736 483783841 480884790 478790581 477217764
707.7 477217764 476483941 477494478 480770499 485843837 491696298 497534871 503344536 509889901 517368674
726.1 517368674 524552703 530224085 534467161 538219631 542117000 545667112 547765374 547869265 546463490
744.5 546463490 544340909 541681945 537841678 532292664 525640666 519232929 513991654 509934425
760.8 509934425 506683230 504382730 504107535 507047296 513327956 521774054 530969322 540368557 550149441
779.1 550149441 560294926 569935679 577824533 583579898 588176191 593000412 598499060 603861392
795.4 603861392 608295798 612175524 616516769 621511757 625869095 628181875 628637016 628751993 629631639
813.8 629631639 630949020 631521821 630682945 628939509 627252162 625651062 622921884 617950618 611095488
832.2F11095488p150888o251097n541146n818844o415963o109059m870355l950715
848.5E64987421m308879n611539o743193o793082n352795k142072K551973P359207
864.8E43947041J1188328J4047444J5511394J4405667J0774315O387114K865732J16825
881.1F19243860k846002o046117q357763q836269p922709p001698o811977p029950
897.4E64391375p026852o637692o453097p246017q978129j0745823j1707902j1778683
913.7D93817180j1435985j0891676r676099p293165m222333j618832j27435N33819
930.1D49085474J156539K283692L759623M947275N356967M814863L001452l57420m840195
948.4D69208270r518295j3492257j6115903j7272115j7543346j7758965j8295974j8876314
$$ plain form
832.2 611095488 603944600 597693503 592152357 586333513 579917550 573808491 568938136 564987421
848.5 564987421 560678542 555067003 548323810 541530728 536177933 534035861 536587834 543947041
864.8 543947041 555135369 569182813 584694207 599099874 609874189 616261303 619127035 619243860
881.1 619243860 616397858 610351741 601993978 593157709 585235000 578233302 571421325 564391375
897.4 564391375 557364523 550726831 544273734 537027717 528049588 517303765 505595863 493817180
913.7 493817180 482381195 471489519 461813420 454520255 450297922 448679090 448551655 449085474
930.1 449085474 450242013 452525705 456285328 461232603 466589570 471404433 474405885 474048465 469208270
948.4 469208270 459689975 446197718 430081815 412809700 395266354 377507389 359211415 340335101
964.7C40335101j9096553j8958509j8661380j8216700j7482146j6235084j4274925
979B17409804j1705935q967816o451443m249200k322510p18952M59522J209304J573891
997.4A86236665J677215J653731J531586J260891P82028K27690o3330J21817O31750
1015.7A94060043J213625J732081K161324K577960L091499L539101L625512L335357
1032B15336502K796992K148882J501381R50828N75677M38273O17072J211300K182454
1050.4B27759361L377274M608437N702868O795452Q041411R200782R429872P379979
1066.7B82295436K328574m205376q906513r599388p086485l655196p22050J481354
1083B51930356L033012L949017M500001N051166N561829N605638M764527L177136J512945
$$ plain form
964.7 340335101 321238548 302280039 283618659 265401959 247919813 231684729 217409804
979 217409804 205703869 196736053 190284610 186035410 183712900 182993948 183453470 184662774 186236665
997.4 186236665 187913880 189567611 191099197 192360088 193142116 193369806 193306476 193428293 194060043
1015.7 194060043 195273668 197005749 199167073 201745033 204836532 208375633 212001145 215336502
1032 215336502 218133494 220282376 221783757 222734585 223310262 223748535 224365607 225576907 227759361
1050.4 227759361 231136635 235745072 241447940 248243392 256284803 265485585 274915457 282295436
1066.7 282295436 284624010 280418634 271512121 261912733 254826248 251171052 250449002 251930356
1083 251930356 254963368 258912385 263412386 268463552 274025381 279631019 284395546 287572682 289085627
1101.4B89085627N66512P58618J770914K891719L666133M021078M043907L715426K970129
1119.8C13490063K063662J529604J874894L083020M400403M796326L751606J553714
1136.1C36543292j191318l939390o217629p651389q069008p494003o221205m726261
1152.4B91033089l357351k123177q38607N76138K154917L876000N635202P414073R311110
1170.7C13681394J1211127J2664586J3358593J3496965J3509602J3566553J3369173
1185D04857993J2384713J0493457Q258820O377339N014241L898829K858639K091795
1201.3D56235826J957148K558798L554642M414976M920751N272388N663991N835801
1217.7D90414321N227387L661275J722276K26558n33641r15855j401633k021164k359390
$$ plain form
1101.4 289085627 289652139 290410757 292181671 295073390 298739523 302760601 306804508 310519934 313490063
1119.8 313490063 315553725 317083329 318958223 322041243 326441646 331237972 334989578 336543292
1136.1 336543292 335351974 331412584 325194955 317543566 309474558 301980555 295759350 291033089
1152.4 291033089 287675738 285552561 284713954 285290092 287445009 291321009 296956211 304370284 313681394
1170.7 313681394 324892521 337557107 350915700 364412665 377922267 391488820 404857993
1185 404857993 417242706 427736163 435994983 442372322 447386563 451285392 454144031 456235826
1201.3 456235826 458192974 460751772 464306414 468721390 473642141 478914529 484578520 490414321
1217.7 490414321 495641708 499302983 501025259 501251817 500718176 499802321 498400688 496379524 494020134
1236D94020134k086073j348138n81115m6671M23998J138121K049625K693683K652168
1254.4D98915732K000391J272619J025796J284242J681685J972854K147019K299726
1270.7E12600064K366245K039909J118958q4221q89599r15945n03599l57688p93993
1289E14580131j445353j796127j796007j811802k135039k600729k766252k478957k048612
1307.4D95701253j816421j831472j852364j624316j248508j175404j847863l184676
1323.7D81120229m617512n576462n881935n721391n272328m458428l190070j624048
1340D44778055k89917L11315L53217K31505J42186P9811j64449o77228j161546j304984
1360.4D42297965j064390n91039l80904m21256j73688N03391J266778J480192J183867
$$ plain form
1236 494020134 491934061 490585923 490004808 489958137 490382135 491520256 493569881 496263564 498915732
1254.4 498915732 500916123 502188742 503214538 504498780 506180465 508153319 510300338 512600064
1270.7 512600064 514966309 517006218 518125176 518040955 517151356 516235411 515731812 515374124 514580131
1289 514580131 513134778 511338651 509542644 507730842 505595803 502995074 500228822 497749865 495701253
1307.4 495701253 493884832 492053360 490200996 488576680 487328172 486152768 484304905 481120229
1323.7 481120229 476502717 470926255 465044320 459322929 454050601 449592173 446402103 444778055
1340 444778055 444488138 444799453 445152670 445384175 445526361 445606172 445441723 444764495 443602949 442297965
1360.4 442297965 441233575 440642536 440261632 439840376 439666688 440170079 441436857 442917049 444100916
1378.8D44100916R84490J413614K664804M350424M839867L588319K218366J166195
1395.1D65326995K95072m85688j150042j678228k063304k006174j895099k091766k228260
1413.5D52023506k006441j642436j070887l25054N3704K42651O15090J238674J736551
1431.8D50865358J742512J781136J980036J930058K000750J829743J105547Q6129p02113
1450.2D62619156j037598j289666k232611k806485j118153M68165K124458L821522
1466.5D60548788M737199O331086R747058J1179417R932846Q903682Q315862P953763
1482.8E27649701P354378P270694P682562P226527N503356M894436N638182N578696
1499.1E78798532M555464L602207L615618M807412M178226L131092K886355K730548
$$ plain form
1378.8 444100916 445085406 446499020 449163824 453514248 458354115 461942434 464160800 465326995
1395.1 465326995 465622067 465136379 463986337 462308109 460244805 458238631 456343532 454251766 452023506
1413.5 452023506 450017065 448374629 447303742 446978688 447032392 447275043 447890133 449128807 450865358
1431.8 450865358 452607870 454389006 456369042 458299100 460299850 462129593 463235140 463321269 462619156
1450.2 462619156 461581558 460291892 458059281 455252796 454134643 454602808 456727266 460548788
1466.5 460548788 465285987 471617073 481364131 492543548 502476394 511380076 519695938 527649701
1482.8 527649701 535004079 542274773 549957335 557183862 562687218 567581654 573219836 578798532
1499.1 578798532 583353996 586956203 590571821 595379233 599557459 602688551 605574906 608305454
1515.4F08305454K797485K858638L192425K901852K126992J977623J923799K063811
1531.8F28148079K302110J860559J285851J359940J406312J209259R71079N35965K58803
1550.1F39337957K97964M71115L85701l78132j275181p92086n94438o23703r78589
1568.5F35850608j551568j424492j368463j756847j664519j619279j975477k066433
1584.8F22423530j933217j904965k157688k520621k774298k745032k607942k759039
1601.1F03020728l140450l464341l637791l751933l652275l534317m193485n029022
1617.4E72617114l834486l056705l539920l520191l340483l109514k262414j705706
1633.7E48247695j814365j369894o15835o8426M97102J232028J860321J640141K114832
$$ plain form
1515.4 608305454 611102939 613961577 617154002 620055854 622182846 624160469 626084268 628148079
1531.8 628148079 630450189 632310748 633596599 634956539 636362851 637572110 638543189 639079154 639337957
1550.1 639337957 639635921 640107036 640492737 640114605 638839424 638047338 637452900 636829197 635850608
1568.5 635850608 634299040 632874548 631506085 629749238 628084719 626465440 624489963 622423530
1584.8 622423530 620490313 618585348 616427660 613907039 611132741 608387709 605779767 603020728
1601.1 603020728 599880278 596415937 592778146 589026213 585373938 581839621 577646136 572617114
1617.4 572617114 568782628 565725923 562186003 558665812 555325329 552215815 549953401 548247695
1633.7 548247695 546433330 545063436 544447601 544379175 544876277 546108305 547968626 549608767 551723599
1652.1E51723599L761471L388107L015935L439665M104972M475474M208863M765093
1668.4E82883179N547464M794538M904151N671859N309999M934251N326629O582975
1684.7F25955045N721390M788459M982114M348576M117727M219055L918886M102886
1701.1F62154138L111959K195656K082169K052724K219975K358496K279163K302766
1717.4F80757046K279997K171099K301216K345502K025307J824915J842320K339601
1733.7F97887003K534628J897753J779258K034247K340913K689242K882004K957225
1750G17002273K950847K790570K926469L030598K612114K310753K077043J974344K066076
1768.4G39741087J880586J526654J329720J304209J441538J529813J318932J022994
$$ plain form
1652.1 551723599 555485070 558873177 561889112 565328777 569433749 573909223 578118086 582883179
1668.4 582883179 588430643 593225181 598129332 603801191 609111190 614045441 619372070 625955045
1684.7 625955045 631676435 636464894 641447008 645795584 649913311 654132366 658051252 662154138
1701.1 662154138 665266097 667461753 669543922 671596646 673816621 676175117 678454280 680757046
1717.4 680757046 683037043 685208142 687509358 689854860 691880167 693705082 695547402 697887003
1733.7 697887003 700421631 702319384 704098642 706132889 708473802 711163044 714045048 717002273
1750 717002273 719953120 722743690 725670159 728700757 731312871 733623624 735700667 737675011 739741087
1768.4 739741087 741621673 743148327 744478047 745782256 747223794 748753607 750072539 751095533
1784.7G51095533R95279J162648J308262J344145J029908P71523Q73565J167953J272142
1803G61020958J034737P63595P11322R35256J123727R96709P09474N80728O70016Q55088
1823.4G69401610R49919P24256M25756M34160O56307P46608O20782L87430J97113K03133
1843.8G74747074N01334O22392L90530J33514R9003K95639M75645M25280J84536N3644
1864.2G77928591J48892L71397N41687M05609J48118J32203M20928O71923O17981L42906
1884.6G81730235J67906K87473N77688O44267L71158Q8394P3611L02673M90486L63768
1905G85097659J013j80364M3690L71933M19140J54555n8949N126K64526M82201L66450
1927.5G86966980L1888j34945O2466L75867M24385J27673j76132p3314L16501N09083
$$ plain form
1784.7 751095533 752090812 753253460 754561722 755905867 756935775 757707298 758580863 759748816 761020958
1803 761020958 762055695 762819290 763530612 764465868 765589595 766586304 767295778 767876506 768546522 769401610
1823.4 769401610 770351529 771075785 771501541 771935701 772592008 773338616 773959398 774346828 774543941 774747074
1843.8 774747074 775248408 775870800 776261330 776394844 776493847 776789486 777265131 777690411 777874947 777928591
1864.2 777928591 778077483 778448880 778990567 779396176 779544294 779676497 780097425 780769348 781387329 781730235
1884.6 781730235 781898141 782185614 782763302 783407569 783778727 783867121 783940732 784243405 784733891 785097659
1905 785097659 785098672 784918308 784961998 785333931 785753071 785907626 785848677 785853803 786118329 786600530 786966980
1927.5 786966980 786998868 786863923 786926389 787302256 787726641 787854314 787678182 787604868 787921369 788430452
1947.9G88430452L57569O7770k3484K06530N00798N18680K12192m7445N3525L70145
1968.3G90646732M85897K76863m589p8797J34229L93749L66866O1929j47164l9637
1988.7G92096078K04027K97129J48833q1718j58429j0252J56462P8440k26259m48645
2009G92055666l70860j08242o3121l59237o85036p85232o95169m78148j48952r4116
2029.4G88267553l98934n39064l76583k42054l09110m78267n35965l44217r3639l6597
2049.8G84913123j63257k76983j96994M5121K12014J49011k0980p8321O1452K56420
2070.2G84900606L00169J00970j50442j42932J35302L46721K42650j2994j25467N4776
2090.6G85649359L66211M51029J93178p1943J1564L11315M77910L31402J4364j18255
$$ plain form
1947.9 788430452 788788021 788855791 788832307 789038837 789539635 790058315 790270507 790223062 790276587 790646732
1968.3 790646732 791132629 791409492 791404903 791326106 791460335 791854084 792220950 792282879 792135715 792096078
1988.7 792096078 792300105 792597234 792746067 792664349 792505920 792495668 792652130 792730570 792504311 792055666
2009 792055666 791684806 791576564 791513443 791154206 790469170 789683938 788988769 788510621 788361669 788267553
2029.4 788267553 787868619 787329555 786952972 786710918 786401808 785923541 785387576 785043359 784949720 784913123
2049.8 784913123 784749866 784472883 784275889 784321010 784533024 784682035 784661055 784582734 784644186 784900606
2070.2 784900606 785200775 785301745 785151303 785008371 785143673 785490394 785733044 785720050 785594583 785649359
2090.6 785649359 786015570 786466599 786659777 786587834 786599398 786910713 787388623 787720025 787734389 787616134
2111G87616134Q9287L77894L68595M1962k36750j47581J99437L59237J65344j37687
2131.4G88695872k40982j1027K72870K73169N483k30193j42515J59085L21210K08854
2151.8G89311826m947o0737J79827N21004N58973K84969J09971K76268O58214Q67903
2172.2G92703271O66082L64244L44753N78165P87318P44462M75645K50757L23355O13987
2192.6G97852039P50661N56588K65122J95145M15743O57260O48141M00543K04683L55124
2213H02301049O74725P60555N12958J92999J20283L27646N82517O01172L19958M9293
2233.4H06443155J24991M32014N95510M19259P5758k8670K05398M74810N15163K90632
2253.8H09548020N2154J26481M56632O43611M18722K6822k6345K90394N42045M44948
$$ plain form
2111 787616134 787705421 788083315 788451910 788493872 788257122 788109541 788308978 788668215 788833559 788695872
2131.4 788695872 788454890 788443863 788716733 788989902 788995385 788765192 788622677 788781762 789102972 789311826
2151.8 789311826 789306879 789246142 789425969 789946973 790505946 790790915 790900886 791177154 791835368 792703271
2172.2 792703271 793369353 793733597 794078350 794656515 795443833 796188295 796663940 796914697 797238052 797852039
2192.6 797852039 798602700 799159288 799424410 799619555 800035298 800692558 801340699 801741242 801945925 802301049
2213 802301049 802975774 803736329 804249287 804442286 804562569 804890215 805472732 806073904 806393862 806443155
2233.4 806443155 806568146 807000160 807595670 808014929 808090687 808062017 808267415 808742225 809257388 809548020
2253.8 809548020 809600174 809726655 810183287 810826898 811245620 811272442 811246097 811536491 812078536 812523484
2274.2H12523484J00136j61588p5638L01241O23107O24061M23729L36647N51224Q93951
2294.6H16140354R33587O50227M83632P28488J296044J738846J651764J213551R31322
2312.9H25767815J170337J885832K444267K231538J525522J267373J648188J781583
2329.3H39722455J020729J01686P0989N64217Q43704L99530j430511m030169l766715
2347.6H33495915p4983L883899N573928M688084K990782J197517m55797k098083l603399
2366H45597863m633426m932881m580378m215897m138648m083514l710985k886773j902580
2384.3H10512781j226425r56953p73489m45366r8646K861k16961n26547n91338l63171
2404.7H05316746j50323k30729n37396p32779o33717m03464l07321n00262q16107r03964
$$ plain form
2274.2 812523484 812623620 812462032 812386394 812687635 813310742 813934803 814358532 814695179 815246403 816140354
2294.6 816140354 817073941 817724168 818207800 818936288 820232332 821971178 823622942 824836493 825767815
2312.9 825767815 826938152 828823984 831268251 833499789 835025311 836292684 837940872 839722455
2329.3 839722455 840743184 840844870 840915859 841480076 842323780 842723310 841292799 837262630 833495915
2347.6 833495915 833420932 837304831 842878759 847566843 850557625 851755142 851299345 849201262 845597863
2366 845597863 840964437 836031556 831451178 827235281 823096633 819013119 815302134 812415361 810512781
2384.3 810512781 809286356 808329403 807555914 807110548 807011902 807014763 806797802 806271255 805679917 805316746
2404.7 805316746 805166423 804935694 804398298 803665519 803031802 802628338 802321017 801820755 801004648 800100684
2425.1H00100684o99162m45426m25756p09176r78649q93592n90682m51029o36756r47476
2445.5G93322980r98735p29859m72546n06281p66218r34362q04723n14447m02749o07312
2465.9G86585748q84056r09388o48081l78490l89337o51181q54909p70331m79579k90990
2486.3G80329406m15504o72161p00057m47333j56045j25527m32015o89148n62370k41161
2506.7G75888085q9585k54810n59330o66142m78744k58267k92957n74052q06570p43568
2527.1G71164060m94421l86715n73516q66115r66191q05736n81622n68390q42392j081646
2547.5G63997316r44852n83768m18485o27338j000762j122237q40723m95434m62592
2565.8G57501125p51018j024187r40203n81384l85761o11008r79125j032293p20024
$$ plain form
2425.1 800100684 799401522 798956096 798530340 797821164 796842515 795948923 795358241 794907212 794270456 793322980
2445.5 793322980 792324245 791594386 791121840 790615559 789849341 788914979 788110256 787595809 787193060 786585748
2465.9 786585748 785701692 784792304 784144223 783765733 783376396 782725215 781870306 781099975 780620396 780329406
2486.3 780329406 779913902 779241741 778541684 778094351 777938306 777812779 777380764 776691616 776129246 775888085
2506.7 775888085 775798500 775543690 774984360 774318218 773839474 773581207 773288250 772714198 771907628 771164060
2527.1 771164060 770669639 770282924 769709408 768843293 767877102 767071366 766489744 765921354 765078962 763997316
2547.5 763997316 763052464 762468696 762050211 761422873 760422111 759299874 758459151 757963717 757501125
2565.8 757501125 756750107 755725920 754785717 754204333 753818572 753207564 752228439 751196146 750476122
2584.2G50476122l91424l85523o52372q31962o85215l29793j79588m43995q00729q71539
2604.6G44903982o49929m35472n34356q92400j137197j057089q30888p99835j074612
2623G37492204j414359j512408j296103j025736j077474j435518j663208j515984j224220
2641.3G25327194j135528j333654j609266j631022j337707j067340j111209j389146
2657.6G14712322j570821j419365j067520r33885j177550j477360j470268j130223
2673.9G04465330q18074q52764j128256j309693j189411q92043p72774r92596j305461
2692.3F95204258j366019j138270r36091j041591j361311j562238j444697j167238
2708.6F85186803j087784j265288j444995j416207j183033j000106j027226j164973
$$ plain form
2584.2 750476122 750084698 749699175 749046803 748214841 747529626 747199833 747020245 746576250 745775521 744903982
2604.6 744903982 744254053 743818581 743284225 742391825 741254628 740197539 739366651 738566816 737492204
2623 737492204 736077845 734565437 733269334 732243598 731166124 729730606 728067398 726551414 725327194
2641.3 725327194 724191666 722858012 721248746 719617724 718280017 717212677 716101468 714712322
2657.6 714712322 713141501 711722136 710654616 709720731 708543181 707065821 705595553 704465330
2673.9 704465330 703647256 702794492 701666236 700356543 699167132 698275089 697502315 696509719 695204258
2692.3 695204258 693838239 692699969 691763878 690722287 689360976 687798738 686354041 685186803
2708.6 685186803 684099019 682833731 681388736 679972529 678789496 677789390 676762164 675597191
2724.9F75597191j239300j076877p77543o85811q84771j116097j098633q30710o20067
2743.3F67267382p01427r41634j028538q65281o39617n67735o86824q35717q24093
2761.6F60176516o50466n04911n63681q00729r80794r37164p92444q03947j031220
2780F53111160j283109j340628j197577j103162j247347j557052j778126j744628j612424
2798.4F40247107j634181j840115k081871k191424k133548k070010k180994k430737
2814.7F23684227k580583k526521k450586k525508k730072k950191l073990l057480
2831F01789296l001809l101230l378272l660441l834247l947318m140258m414439m580438
2849.3E67730844m406929l840625l210545k896845l017605l431320l867149m286826
$$ plain form
2724.9 675597191 674357891 673281014 672503471 671817660 670932889 669816792 668718159 667887449 667267382
2743.3 667267382 666565955 665624321 664595783 663730502 663090885 662523150 661836326 661000609 660176516
2761.6 660176516 659526050 659021139 658457458 657656729 656675935 655738771 654946327 654142380 653111160
2780 653111160 651828051 650487423 649289846 648186684 646939337 645382285 643604159 641859531 640247107
2798.4 640247107 638612926 636772811 634690940 632499516 630365968 628295958 626114964 623684227
2814.7 623684227 621103644 618577123 616126537 613601029 610870957 607920766 604846776 601789296
2831 601789296 598787487 595686257 592307985 588647544 584813297 580865979 576725721 572311282 567730844
2849.3 567730844 563323915 559483290 556272745 553375900 550358295 546926975 543059826 538773000
2865.7E38773000m811823n409479n880952o065130n980015n653143n157650m568398
2882D95246410l854751l026545k159059j424223r61692p66396p34419p07537o93977
2900.3D80917811q64416j243561j683444k047599k364665k835721l510534m071147
2916.6D62296724m246920m101515l697991l066987k302766j398712l03865R74953K318174
2935D46471095L488600M371763N079597N701363O168634O358802O351560O356925O386787
2953.4D96735126O428987O498217O399691O020665N579472N263984N022288M750430
2969.7E42698860M447222M184425M029095M022121M031122L771305L265739K836823
2986E73286712K632439K556503K320588J793921J275539R62556P65979N26428J28806
$$ plain form
2865.7 538773000 533961177 528551698 522670746 516605616 510625601 504972458 499814808 495246410
2882 495246410 491391659 488365114 486206055 484781832 483820140 483053744 482319325 481611788 480917811
2900.3 480917811 480053395 478809834 477126390 475078791 472714126 469878405 466367871 462296724
2916.6 462296724 458049804 453948289 450250298 447183311 444880545 443481833 443177968 444152921 446471095
2935 446471095 449959695 454331458 459411055 465112418 471281052 477639854 483991414 490348339 496735126
2953.4 496735126 503164113 509662330 516062021 522082686 527662158 532926142 537948430 542698860
2969.7 542698860 547146082 551330507 555359602 559381723 563412845 567184150 570449889 573286712
2986 573286712 575919151 578475654 580796242 582590163 583865702 584828258 585594237 586120665 586249471
3004.4E86249471l43442o90758q14021r04739j201272j625061j973450k129138k120197
3022.7E74447393k148747k358556k637684k748549k644837k598941k717376k830923
3039E53761780k955377l076434l086805l066063l078461l169477l289342l260136l151237
3057.4E25628448l109754l124535l161013l143191l100455l142774l208399l197014
3073.7E00441313l083766k959549k978444l087908l176213l246188l218084l096432
3090D75594729l078908l142118l093302k962560k917468k939701k918870k871275k874553
3108.4D48795974k945661k859682k603829k565444k778500k992570l059596k897620
3124.7D26093072k642215k555936k682954k768636k595872k338528k342880k617151
$$ plain form
3004.4 586249471 585906029 585215271 584401250 583496511 582295239 580670178 578696728 576567590 574447393
3022.7 574447393 572298646 569940090 567302406 564553857 561909020 559310079 556592703 553761780
3039 553761780 550806403 547729969 544643164 541577101 538498640 535329163 532039821 528779685 525628448
3057.4 525628448 522518694 519394159 516233146 513089955 509989500 506846726 503638327 500441313
3073.7 500441313 497357547 494397998 491419554 488331646 485155433 481909245 478691161 475594729
3090 475594729 472515821 469373703 466280401 463317841 460400373 457460672 454541802 451670527 448795974
3108.4 448795974 445850313 442990631 440386802 437821358 435042858 432050288 428990692 426093072
3124.7 426093072 423450857 420894921 418211967 415443331 412847459 410508931 408166051 405548900
3141D05548900k752959k578467k340377k153128k095402k298653k518654k449244k261340
3159.4C84100676k182216k194792k195090k106070j999349j970112k006501k027512
3175.7C67419034j959115j820117j759351j800656j828253j826883j773595j668752
3192C52982312j634717j692652j712293j627385j496852j418918j439542j501590j503795
3210.3C38954568j430869j335293j269549j280755j335412j351178j299411j212031
3226.7C28440070j143306j095116j054615j145929j268685j183987j042068r83983
3243C19522381r32127r18538r84430j020670r66519q97199q87364q71837p86275p24912
3263.4C10532510p45356p12424n94318o40363q02636q64088q65192q05169o94692o35505
$$ plain form
3141 405548900 402795941 400217474 397877097 395723969 393628567 391329914 388811260 386362016 384100676
3159.4 384100676 381918460 379723668 377528578 375422508 373423159 371453047 369446546 367419034
3175.7 367419034 365459919 363639802 361880451 360079795 358251542 356424659 354651064 352982312
3192 352982312 351347595 349654943 347942650 346315265 344818413 343399495 341959953 340458363 338954568
3210.3 338954568 337523699 336188406 334918857 333638102 332302690 330951512 329652101 328440070
3226.7 328440070 327296764 326201648 325147033 324001104 322732419 321548432 320506364 319522381
3243 319522381 318590254 317671716 316687286 315666616 314700097 313802898 312915534 312043697 311257422 310532510
3263.4 310532510 309787154 309074730 308480412 307840049 307037413 306173325 305308133 304502964 303808272 303172767
3283.8C03172767o48498o39975n45443m89562n65589o85274p88927q06839o43462m34994
3304.2B96924204m70192p60763j018018j041502q70347p07000o94931p78138p97421
3322.5B89785892p54386q28445r35763q99107q03500o90460n92083o72758q60929r61274
3342.9B81787187j000404q91477o57827p10130r87023j051634q85636p22736p28131
3361.3B74152189p51405n72563m92960p74026j107186j092851q13246o71059p13408
3379.6B67163485p49349o67930n14328l19899j37239k56539n97626o01530j89036l3021
3400B63096988m59313p82103n20795j96785j67668k64793l94524m10825k23279q7648
3420.4B59589255j23620o3121J73389L21120K39999J98245K77519J42932j58102j50144
$$ plain form
3283.8 303172767 302524269 301884294 301338851 300849289 300283700 299598426 298809499 298002660 297359198 296924204
3304.2 296924204 296454012 295693249 294675231 293633729 292763382 292056382 291361451 290583313 289785892
3322.5 289785892 289031506 288203061 287267298 286368191 285564691 284874231 284282148 283609390 282748461 281787187
3342.9 281787187 280786783 279895306 279237479 278527349 277540326 276488692 275603056 274880320 274152189
3361.3 274152189 273400784 272828221 272335261 271561235 270454049 269361198 268547952 267876893 267163485
3379.6 267163485 266414136 265746206 265231878 264911979 264774740 264518201 263920575 263319045 263130009 263096988
3400 263096988 262637675 261855572 261334777 261137992 260970324 260705531 260311007 259900182 259676903 259589255
3420.4 259589255 259465635 259402514 259575903 259897023 260137022 260335267 260612786 260755718 260597616 260447472
3440.8B60447472J30922L07262L46869L31223L81649M64856M68225N42044O88166O24954
3461.2B64733642N81265Q79556J042098O51508J92821K69145O25044Q53539P87437
3479.6B70616055N46008O07073Q60691Q45433P10815P49320Q70615R86367R88335Q91089
3500B78671801Q25077P16031O46025P95394J028150J157940J050383Q43167Q68648
3518.3B86602616J073838J236587J069576P91341Q96931J160651J293630J365661J279175
3536.7B96770006J154185J315564J498192J390994J150220J161129J342565J486063
3553C07268918J639276J779199J888245J946003J828193J683891K071947K596021K554088
3571.3C25255781K425224K520889K682358K893120L109366L122091K928227K952218
$$ plain form
3440.8 260447472 260578394 260885656 261232525 261563748 261945397 262410253 262878478 263420522 264108688 264733642
3461.2 264733642 265314907 266194463 267236561 267888069 268080890 268350035 268975079 269828618 270616055
3479.6 270616055 271162063 271769136 272629827 273475260 274186075 274935395 275806010 276792377 277780712 278671801
3500 278671801 279496878 280212909 280858934 281654328 282682478 283840418 284890801 285733968 286602616
3518.3 286602616 287676454 288913041 289982617 290773958 291670889 292831540 294125170 295490831 296770006
3536.7 296770006 297924191 299239755 300737947 302128941 303279161 304440290 305782855 307268918
3553 307268918 308908194 310687393 312575638 314521641 316349834 318033725 320105672 322701693 325255781
3571.3 325255781 327681005 330201894 332884252 335777372 338886738 342008829 344937056 347889274
3587.7C47889274L310055L311932L223747L452897L723741L784299L775507L638774
3604C76110226L364623L468424L787666L915906M064649L950596L949136M562110M571855
3622.3D11745191L939986L372282L579229M512727M422247M075140L958613L887385
3638.7D43492800L986537M066229L846824L574819L906041M566938M284888L800512
3655D75525588M060805M189729L745795L534078L593654L324031L132761L558874L316224
3673.3E07981539K980172L451348L479421L262818L203213L093481K868414K608120
3689.6E32928526K631665K752661K705336K480268K169908K121210K329170K249837
3706E52368581J820743J372517J545429K210140K312303K104044J948058J836300J683235
$$ plain form
3587.7 347889274 351199329 354511261 357735008 361187905 364911646 368695945 372471452 376110226
3604 376110226 379474849 382943273 386730939 390646845 394711494 398662090 402611226 407173336 411745191
3622.3 411745191 415685177 419057459 422636688 427149415 431571662 435646802 439605415 443492800
3638.7 443492800 447479337 451545566 455392390 458967209 462873250 467440188 471725076 475525588
3655 475525588 479586393 483776122 487521917 491055995 494649649 497973680 501106441 504665315 507981539
3673.3 507981539 510961711 514413059 517892480 521155298 524358511 527451992 530320406 532928526
3689.6 532928526 535560191 538312852 541018188 543498456 545668364 547789574 550118744 552368581
3706 552368581 554189324 555561841 557107270 559317410 561629713 563733757 565681815 567518115 569201350
3724.3E69201350J662910J803577J574218J157523J086056J497984J818359J492202
3740.6E81294179O93321N91576J382888J033365O11961J472354J897037J479388J185417
3759E91641486J332223J344919J171530J117885J067757J178861J344204J281083J117467
3777.3F02597415R94444R84073Q90374Q92937J103044J218796J141071Q63135P09772
3795.7F11395061Q46148O52611O33061J098513Q82864Q55327J275241J217604P46429
3814.1F19602859N49614P41303M71175O58691J129150R55999P84278P63476Q42929
3832.4F26499474Q69095N07534K57671N83410Q49366R80616J029134Q36849K43842
3850.8F32656991n29885L09169J472652J199305O14346K95341M90307O08027L10243
$$ plain form
3724.3 569201350 570864260 572667837 574242055 575399578 576485634 577983618 579801977 581294179
3740.6 581294179 581987500 582579076 583961964 584995329 585607290 587079644 588976681 590456069 591641486
3759 591641486 592973709 594318628 595490158 596608043 597675800 598854661 600198865 601479948 602597415
3777.3 602597415 603591859 604575932 605466306 606359243 607462287 608681083 609822154 610685289 611395061
3795.7 611395061 612241209 612893820 613526881 614625394 615508258 616363585 617638826 618856430 619602859
3814.1 619602859 620152473 620893776 621364951 622023642 623152792 624108791 624893069 625656545 626499474
3832.4 626499474 627368569 627876103 628133774 628717184 629566550 630547166 631576300 632413149 632656991
3850.8 632656991 632127106 632436275 633908927 635108232 635722578 636017919 636508226 637116253 637426496
3869.1F37426496M32431P41244Q76605P99775M34459M53114N68986M58002N55098M13776
3889.5F43159986K58207N74767O98805M14133J43111Q5294K31505N87165P10249N44608
3909.9F47407830M94480M51863K13325J18911L19839L78429L01600L65794L62813J80006
3930.3F50594890J72317L70562M25697L56197K23041J87814L75867M00424K22802K06888
3950.7F53536499L37719L53516K81930K94506K89917K25484K24591K63989K94864K80976
3971.1F56383991J93954J59502K30491K79725L14295L14534J79410R6201J97530K61963
3991.5F58611596K07185J73033J76608
3997.6F59168422
$$ plain form
3869.1 637426496 637858927 638600171 639476776 640276551 640711010 641164124 641733110 642191112 642746210 643159986
3889.5 643159986 643418193 643992960 644691765 645105898 645249009 645334303 645565808 646152973 646863222 647407830
3909.9 647407830 647902310 648354173 648567498 648686409 649006248 649384677 649686277 650052071 650414884 650594890
3930.3 650594890 650767207 651137769 651563466 651919663 652142704 652330518 652706385 653106809 653329611 653536499
3950.7 653536499 653874218 654227734 654509664 654804170 655094087 655319571 655544162 655808151 656103015 656383991
3971.1 656383991 656577945 656737447 656967938 657247663 657561958 657876492 658055902 658152103 658349633 658611596
3991.5 658611596 658818781 658991814 659168422
3997.6 659168422
##END=$$ End of the data block
