##TITLE=$$ Begin of the data block
##JCAMP-DX=5.00 $$ ACD/SpecManager v 10.08
##SPECTROMETER/DATA SYSTEM=16PC
##DATE=Mon Sep 23 10:34:09 2013
##DATA TYPE=INFRARED SPECTRUM
##DATA CLASS=XYDATA
##ORIGIN=
##OWNER=
##NPOINTS=3401
##FIRSTX=600.00000000
##LASTX=4000.00000000
##MAXX=4000.00000000
##MINX=600.00000000
##MAXY=95.90119934
##MINY=52.35800934
##XFACTOR=1.0000000000
##YFACTOR=0.000000100000000
##FIRSTY=63.66579437
##DELTAX=1.00000000
##XUNITS=1/CM
##YUNITS=TRANSMITTANCE
##XYDATA=(X++(Y..Y))
600 636657944 632036438 626253128 622615356 619837265 618013840 616309166 612231750 610840073 619714966
609 619714966 628794899 627704620 624963531 627357712 629709702 628127098 625537643 623458138 622226257
618 622226257 623310318 624834061 624596367 625038147 629423599 633079071 630486717 627439728 628905792
627 628905792 631840706 634733429 637951126 641448059 644950180 648804398 651099472 649672775 645621796
636 645621796 638145676 630777130 627486000 626158714 626591454 627023697 624813080 622401237 621685753
645 621685753 621656189 621460915 622520676 626498718 631814957 638339767 643383026 642811279 640823135
654 640823135 640391083 641059189 644027023 647296906 649213104 649947662 648534088 646730881 645783691
663 645783691 646264572 650764008 654471893 651419373 647669830 648416519 650298843 651418457 652578812
672 652578812 653779297 655534058 659111938 662247620 662548294 661662369 660205841 658881912 659262161
681 659262161 659356079 656697769 654284973 654750824 656723709 660626373 663707733 661898346 659573288
690 659573288 660602798 662431488 663511047 664688568 666665039 668330460 668468018 668095551 667618027
699 667618027 667655487 669785767 671538620 669927368 668078690 668750076 670059204 671098480 671698303
708 671698303 671158295 670160522 669016113 668134918 668365021 668699265 667952271 667505493 668479919 670469971
718 670469971 674126587 677399902 678057175 677296143 675491104 672877579 668756027 666305084 669907303
727 669907303 675249100 679564972 682591934 682226868 681223373 682618103 683458328 681149979 677650452
736 677650452 673572769 670352707 670712967 671405106 669086685 666762390 666414032 667765350 672258606
745 672258606 676716766 677049866 677438507 681944351 686832657 689734497 690611115 687404404 683802109
754 683802109 683322906 684415131 686996918 690174789 693437576 695554504 694027176 692144165 693336487
763 693336487 694677353 693524857 692452164 693903427 695623398 695665817 695546417 696524353 697421799
772 697421799 697216034 696697693 696057816 696071625 698613663 700574417 698731918 695296021 690710754
781 690710754 687049866 687106628 689162979 692966690 696911545 698993225 700151901 700593262 700514069
790 700514069 700000534 699587097 700162888 700747986 700512161 699893951 699202805 697993011 695239792 692990570
800 692990570 694349976 695120850 690541992 685408096 684653015 683095245 674785385 666958771 666472473
809 666472473 668510437 670714645 672565689 671130447 671292038 680006027 688122711 686183014 682068329
818 682068329 680773010 681497345 686348648 691597443 692858429 694205551 699287872 704993973 709254532
827 709254532 712588806 714382401 715965042 718889465 721871338 723732452 725706100 728953629 732510529
836 732510529 735816498 738821030 741583862 743212967 742086868 740450592 740046768 740758667 743417740
845 743417740 746920853 750701675 753979645 755396118 756117554 756554565 757615814 761080246 764744263
854 764744263 766604691 767836075 768976669 769933243 770543823 771550674 774226913 776816101 777247925
863 777247925 777735748 780539551 783448944 784316101 785210114 788235626 791138153 791834335 791914215 792531738
873 792531738 792911530 792420654 791783829 791539154 791611938 792096405 793020248 794582138 796363373 798116455
883 798116455 799523087 800217590 800092010 798409958 796690445 796598434 796957245 797107468 797159195 796772919
893 796772919 796636810 798121719 798837433 795992584 792160492 788801193 786461563 786995163 787942429
902 787942429 786972733 785551071 784491272 783412704 782273788 780868530 778830795 776596756 774660568
911 774660568 772482605 769521484 766274185 762980728 759869843 757050018 755121918 754880905 755848618
920 755848618 758048325 760770798 763077011 765677719 769008179 772954483 777609863 782786407 788497696
929 788497696 794231415 799888153 804240265 805465012 805247345 805088730 803716431 800122223 795013199
938 795013199 788092117 781362534 776628265 774188766 775667648 778896332 782236557 785717697 788692245
947 788692245 791551819 794669189 797450562 799546967 800595016 799918442 798104248 795461655 792147903
956 792147903 788005142 784286957 782514343 781726151 781422882 781738281 782445221 784124374 787676544
965 787676544 791913757 796168823 799779205 801610489 802410355 802473297 802021027 801943817 800529251 795413513
975 795413513 789439468 785345764 781080017 774931641 768611221 763479004 758873215 754552612 750613708
984 750613708 746979675 743929367 741710892 740338821 740200958 740425110 740191498 739727478 738834381
993 738834381 737971039 737629623 737510452 737455139 737529526 738195648 738102875 735435944 732048035 729383698
1003 729383698 726853104 724490891 721864929 718160400 714557648 711802216 710382690 711913834 713761063
1012 713761063 713280945 712113342 710849075 709991684 710910797 711599808 710294266 707637329 703042984
1021 703042984 698431473 696680756 694330673 688042374 680326691 672805328 664806595 655765076 646982651
1030 646982651 639920959 633535156 627246132 621116867 614841003 608945122 604172707 599563599 593923569
1039 593923569 588697891 585311890 582629929 579517822 577393303 577347984 579224586 583572388 589362144
1048 589362144 595970879 602728615 608381729 614057999 620357513 627609482 636486778 646556625
1056 646556625 658100357 669648895 679791183 688630829 695227127 701299896 708347778 716091843
1064 716091843 725541840 734329910 739593048 743827133 748894196 753832092 758094101 762292404 766903839
1073 766903839 771787872 777492523 782425385 784318924 785746613 789301605 792654724 793879242 794357529
1082 794357529 794830093 795295715 796002655 796940079 798171768 799721451 801925659 803909531 804442139
1091 804442139 804926376 806791763 808724136 809778671 810276489 810124893 809617310 808850555 808319092
1100 808319092 808669357 809540024 811189880 812404861 811609268 810147018 808823853 807676773 807023315
1109 807023315 806826859 807359238 808010101 808196106 808107834 807509689 807095490 807692795 808663330 809884033
1119 809884033 810637970 809760132 808469086 807460098 807135315 808903198 810438614 809284897 807242889
1128 807242889 805034409 803436508 804033051 805125504 805413208 805284729 804427872 803641357 803854218
1137 803854218 804360123 804816971 805060120 804628601 804066620 804014664 803722839 802413712 800809174 799466858
1147 799466858 798100739 796486130 794994354 794126511 793267746 791814346 790233612 788769989 787485580
1156 787485580 786766739 785885773 784015656 781840363 779648285 777796249 777189941 776468735 774277191
1165 774277191 771503677 768473358 765518875 763269424 761160583 758936615 756301193 752681503 748650513
1174 748650513 744741669 740497818 735510559 730167389 725003967 719164886 711592178 703428497 694993973
1183 694993973 687694778 683790436 681040802 677869339 674542694 670470963 666646957 664391785 662129898
1192 662129898 658471832 654180984 649570923 644600143 639154434 633762360 628606796 624609222 623177299
1201 623177299 623032799 623415222 624178658 624941826 625648270 626253853 626339417 625400772 623646011 621136169
1211 621136169 617807846 613190155 608563652 605216026 602653732 601010094 599689026 598229637 596359253
1220 596359253 593507042 590106506 586495171 582387466 577154160 572163582 569019775 566384544 563511620
1229 563511620 560225716 555544128 551140060 548645020 547200928 546846848 546519775 544465790 542795410
1238 542795410 543671379 545180321 545848389 546517372 547564011 548908463 551013947 552625656 552293549
1247 552293549 551064987 549230347 547610054 547444572 547762642 547779541 548173447 549665222 551338921
1256 551338921 552204132 553204536 555137634 557450790 560028801 562353859 563220253 564576149 568725815
1265 568725815 573394547 576999893 579767456 580870399 581881752 584446907 587520370 590741386 593701134
1274 593701134 595861206 597245712 597353210 597219009 597913742 598827820 599716415 600554962 601035118 601761322
1284 601761322 603418579 605456352 607635040 609704742 611247787 612527390 613579979 614665260 615999222
1293 615999222 617748260 620416412 623203735 625373116 627238274 628872871 630257378 631414185 632287979
1302 632287979 632776489 633040428 633117905 633273621 633862991 634650002 635550270 636461258 637148857 637921829
1312 637921829 638847122 640414963 643477936 647013702 650074921 653287201 656943054 661089935 666144104
1321 666144104 671288452 675794601 679809799 683171234 686079483 688822021 690971375 692088394 692495117
1330 692495117 692243118 691703568 691273193 690924377 690818787 690784683 690558929 690574875 691482315 692369003
1340 692369003 692142029 691993256 693176727 694412460 694759369 694452972 693557053 691643677 688188095
1349 688188095 683542938 677737274 671217651 664402008 657403946 650639267 643618317 635954361 627752304
1358 627752304 618952026 609659920 599618454 589855652 581313362 573991547 568500290 563950310
1366 563950310 559626350 555614014 551722527 548063049 544678688 541581383 538418999 536325684 536808014
1375 536808014 538395386 539676895 541977158 546347618 552193642 559703369 567579994 574856262 580729980
1384 580729980 583954811 584894180 582984467 579760323 576725464 573408852 569541702 566019058 563453903
1393 563453903 562420845 564350853 567286263 569610825 571731567 573188553 574963799 578489075 581952095
1402 581952095 583582382 584684143 586048355 587441216 588784218 590401421 592853546 595350990 597177734
1411 597177734 598671913 599702606 600957642 603602409 606072197 606956253 606954575 605893860 604980469
1420 604980469 606056671 607041130 605826149 604330063 604257584 604139099 602791061 601057510 599252472
1429 599252472 597781181 597271919 597370148 598495712 598952293 596234818 593186150 592252274 592118759
1438 592118759 592276573 592753906 593520164 594241638 594519615 594514847 593987694 593739738 594888687 596245995
1448 596245995 596736908 597136726 597788315 598913651 601392517 603592873 603738785 603140831 602173805
1457 602173805 601865997 603720894 606685410 610515823 614284286 616929779 618606339 618652802 618452797
1466 618452797 619697342 620799294 620856056 619503975 614679337 610578766 612038612 615073929 616546402
1475 616546402 618751526 623451004 629104843 634840965 640417557 645298004 649493256 652768631 655323486
1484 655323486 657288055 658633957 659539719 659511337 657470474 655347824 655158768 655571213 656277924
1493 656277924 656217117 653440704 650299759 648988037 648026428 646548309 644907684 642773895 641332169
1502 641332169 643005371 643749695 638897171 632741470 628383865 624731293 621976128 619360428 615725021
1511 615725021 612464905 611308098 610093346 606570740 602733383 600399742 597841034 593246002 588676910
1520 588676910 586082687 583990822 581505547 578842392 575741768 572733650 570444336 568323593 565933228
1529 565933228 563563118 561538239 559314499 555627098 552960625 554739723 556878090 556028595 553397179
1538 553397179 548325768 543058853 540376663 538012733 533551712 530218582 531607399 534192810 535407791
1547 535407791 535969238 535564880 534715195 533806305 532926102 532213669 531900406 532881012 533303757 530646324
1557 530646324 527812004 527204742 527798653 529662132 531913986 533275604 535007477 538566589 542083511
1566 542083511 543911705 544837952 544317970 544695358 549170990 554628601 559260597 562341919 561189194
1575 561189194 559869995 562443237 566248398 569909821 573630829 577293854 580484161 582306633 584084511
1584 584084511 587142220 590580444 593920479 597222099 600456963 603409538 605952988 607793083 608272552
1593 608272552 608353844 608914604 609551430 610270500 610719681 610426178 609758377 608795624 607930908 607777824
1603 607777824 607750168 607237816 606925964 607607117 608346214 608257751 607982635 608037491 607905884 607716789
1613 607716789 606050262 599942207 594150772 593994141 594825516 593503494 590828171 585821152 580673943
1622 580673943 577837715 575552444 572961807 569804192 564843674 560145149 558000565 556490402 554261703
1631 554261703 551905632 549857864 547232628 542420158 538027534 537190666 536711922 533479919 530369034
1640 530369034 529862900 530020485 529820213 528987656 525842896 523580093 525878677 529599419 533422699
1649 533422699 535569191 532015076 528170586 529312592 531814346 533674698 535290947 536021461 536978722
1658 536978722 539891472 542266617 540960541 539652596 541625252 544923782 548805695 552913895 556669235
1667 556669235 559992790 561863174 564526062 571613541 577943344 577155609 576413155 582589149 590191841
1676 590191841 595276108 600072861 606143227 611549377 614054184 616116524 619489899 624051094 631205788
1685 631205788 638117294 641731033 644105225 646251678 648252029 650988312 653067322 652870865 651954422
1694 651954422 651595840 651006927 650596619 648050079 638830643 630010147 629754791 630241852 624968033
1703 624968033 618141174 611789703 605947037 601614723 597915192 594178925 590781937 588109741 585462570
1712 585462570 582283745 578526001 573739052 568573952 562875748 558609734 558987389 560114632 558388481
1721 558388481 556144257 554497948 553502083 554039001 554734459 553843498 553359985 555443993 557849426
1730 557849426 559579620 559046249 551870346 545424690 548149834 552463303 552174072 551546822 553380508
1739 553380508 555880318 557748070 560290337 564452171 570018311 577003708 585660934 596452255
1747 596452255 608762512 622167130 636556854 651830215 667537460 683279037 698800049 714026184
1755 714026184 728015671 739344635 749382706 759321213 768269043 775272369 781710129 788989792
1763 788989792 796070557 802390823 807918091 812110672 815934677 820309372 824829788 829636841 834011307
1772 834011307 836930771 839445114 842300186 845384369 848974686 852647781 856323242 859246521 859962921
1781 859962921 860491257 862972031 865582199 866856308 867860336 868988495 870786667 874502869 878424683
1790 878424683 881134033 882992020 883540649 883817215 884914627 886207123 887273788 888591080 890706558
1799 890706558 892982254 895006638 896644821 897339096 897942810 899350433 900878220 902087936 903137436
1808 903137436 904010086 904790192 905708084 906307220 905747681 905407867 906784744 908681641 910744629
1817 910744629 911940079 910255661 908272247 908173828 909138947 911546936 913976440 914813995 915013580
1826 915013580 914910812 914743423 915153732 915263672 913846512 912589798 913363495 914393158 913944016
1835 913944016 913766403 915800095 917740555 917058258 916367493 917997589 920274734 922738571 924075165
1844 924075165 921806793 918961792 918279190 918145447 917698364 917422333 917697220 917971878 917676926 917246094
1854 917246094 916947861 916705627 916555405 916427155 916183701 916062317 916447144 916759491 916382751 915814362
1864 915814362 915245972 914976807 915716400 916423111 916245956 915321350 913046875 910786896 909910660 909800262
1874 909800262 910649033 911389847 910617599 909538040 909047852 908666611 908135147 907682877 907556534 907444916
1884 907444916 906935425 906576385 906921387 907540054 908319473 908859253 908491135 907905121 907666473 907479248
1894 907479248 907262344 906934052 906196365 905614166 905837784 906311264 906899414 906987152 905518036 903679352
1904 903679352 902290573 901395569 901539764 902035675 902414093 902564774 902095566 901380997 900644989 899944534
1914 899944534 899397125 899043808 899167557 899159927 898197403 897207489 897056808 897101440 897025833 896707535 895691605
1925 895691605 894658585 894278564 894124756 893982391 893882751 893719177 893690109 894253998 894523163 893297653
1935 893297653 891971130 891939621 891994019 891088028 890125504 889895477 889694443 888825912 888056030 888103027
1945 888103027 888414154 888612061 888887177 889585266 889861832 888455887 886961975 886850586 887230835 887842407
1955 887842407 888264160 887752075 887012024 886546631 886219482 886023026 886072845 886615067 887247314 887581329
1965 887581329 887819977 888079147 888230057 888163071 887935638 887595215 887061844 885974884 885220795 885947952
1975 885947952 887007446 887639542 887825012 887086411 886036606 885115891 884364624 883912354 883929520 884823532
1985 884823532 886012344 887135010 887931824 887748947 887407532 887840958 888058167 886954041 885802002
1994 885802002 885768661 886069031 886277924 886483459 886680374 886723251 886394730 885903854 885505905 884842148
2004 884842148 883269043 881893158 882014008 882405548 882063370 881620178 881412506 881320496 881279221 881457367
2014 881457367 882317047 882911911 881920319 880926590 881402740 882360458 883514633 884227753 883369904 882129898
2024 882129898 881355057 880936584 881217957 881690292 881967545 882022629 881583252 880998383 880505066 880165329
2034 880165329 880228729 880367737 880230637 880138626 880449295 880698700 880605240 879975815 878027191 876246490
2044 876246490 876390457 876864929 876398087 875775833 875444412 875147095 874774475 874328384 873636703 873108826
2054 873108826 873273621 873600235 873759537 873675385 873178253 872217407 870247345 868580093 868781586 869541626
2064 869541626 870108643 870371552 869803696 868900299 867924957 867044678 866563797 866331558 866404800 866462479
2074 866462479 866096954 865622253 865262527 864877472 864308319 863831482 863834610 863823853 863244324 862663956
2084 862663956 862554779 862649231 862865677 863115768 863292694 863367538 863368301 863016815 861769180 860448380
2094 860448380 859762192 859509964 859821548 860412369 861123581 861706696 861729889 861581345 861551285 861502151
2104 861502151 861315994 861220627 861681213 861867218 860676498 859386902 859207840 859239349 858804474 858442764
2114 858442764 858563156 858877182 859367142 859628677 858873825 858235855 858954926 859920731 860451965 860498657
2124 860498657 859425507 858304749 858318100 858497849 858139725 857633133 857101898 856637268 856374283 856302032
2134 856302032 856537781 856830597 856910477 856950989 857099533 857164383 857042770 856614609 855530472 854371796
2144 854371796 853601456 853223114 853464127 854115982 855260391 856251678 856174240 855918427 856287689 856624603
2154 856624603 856377335 856031418 856061249 855944672 855068665 854178467 853956223 853974838 853945465 854131927
2164 854131927 854981384 855653763 854970703 854392776 855410843 856752625 857388229 858078918 859673004
2173 859673004 860877991 860097656 859090805 859603653 860075989 859107513 857963791 857449799 857547073 858900757
2183 858900757 860323639 860614090 860456696 859965363 859647751 860331573 861169815 861552963 861595612 861091385
2193 861091385 860390396 859637985 859241486 859973221 860880585 861088028 861136703 861300507 861503143 861762543
2203 861762543 862067947 862411270 862799683 863404236 863724442 862880478 862180481 863095245 864255905 864782562
2213 864782562 864678116 863111267 861701736 862231750 863380890 864505768 865355530 865206223 864830704
2222 864830704 864901581 864993362 864732742 864633560 865279465 866085052 866713028 867002487 866462021 865743866
2232 865743866 865379562 865237274 865517349 865750809 865308075 864867935 864947815 865399628 866433105 867489548
2242 867489548 867950439 868202896 868468018 868622742 868630371 868453293 867907257 867394409 867307434 867488632
2252 867488632 868091583 868575592 868175507 867717285 868060150 868338623 867619247 866962891 867492218 868087540
2262 868087540 867752991 867240448 867015839 866940231 866987457 867285233 868270645 868987579 868064651 867182465
2272 867182465 868090363 869207611 869344025 869074554 868655701 867849808 866100998 864619980 864779968
2281 864779968 865534821 866379471 867062836 866992035 866683044 866391907 866305389 866930466 867561111 867455978
2291 867455978 867224960 867288589 867473602 867827682 868106613 867921143 867754440 868332596 868537445 866963348
2301 866963348 865197906 864672394 864449005 864079971 863524475 862205963 861282578 862227936 863517303
2310 863517303 863928299 864024887 864113541 863741150 862448959 860559921 857732086 855501175 855694504 857092896
2320 857092896 859794617 861671906 859915771 856665344 852434616 849288483 850520859 852955093 854213486
2329 854213486 855189590 856330643 856598129 853920212 851841660 854931107 858043213 856509247 853467484
2338 853467484 850434265 847604294 845341415 844651718 847727280 851370850 852731705 852958908 851986160
2347 851986160 850607376 849806061 848946075 847710571 846122513 843649902 841636887 841734161 842489014
2356 842489014 843139648 843263626 841548462 839900284 839473724 841210861 848081131 855154037 857614059
2365 857614059 858084412 857312698 856110840 855670242 855599136 856105576 856578598 856176376 855796585 856116028
2375 856116028 856952896 858707428 860307922 860317688 860228806 861546249 862790604 862685242 862125168 861511688
2385 861511688 861047058 861380844 861570816 860482941 859342575 859210052 859446259 859931488 860167007 859325409
2395 859325409 858271866 857730408 857296906 856680145 856262665 856597443 856882324 856259613 855447311 854924927
2405 854924927 854549866 854427567 854292145 853678436 853286514 853962631 854799728 855125198 855081558 854455948
2415 854455948 853641968 852953644 852416534 852274399 852183609 851814728 851367035 850847702 850499878 850710907
2425 850710907 851053467 851215820 851239471 851036301 850681076 850169678 849648743 849273911 849012375 848942719
2435 848942719 848882904 848712692 848322372 847323685 846429596 846449127 846703262 846753387 846684418 846353531 846006393
2446 846006393 846045227 845856400 844648590 843357086 842781754 842535019 842576523 842660675 842453461 842180252
2456 842180252 842010498 841774445 841199188 840762177 841041336 841461411 841840057 841574707 839477539 837119827
2466 837119827 835736542 835146942 835990677 837040863 837072601 836719513 836035995 835531693 836027603 836644440
2476 836644440 836715012 836422882 835556488 834632187 834144821 833945007 834212799 834453812 834057312 833550186
2486 833550186 833289642 833170395 833287201 833396912 833186874 832959671 832846680 833046417 834236832 835110168
2496 835110168 834032059 832657318 832401733 832344742 831890793 831478119 831420441 831493378 831605453 831670990
2506 831670990 831478348 831314316 831445694 831719131 832280884 832497864 831300735 830141754 830596237 831224670
2516 831224670 830818863 830260773 830121307 830121765 830150375 830277405 830674438 830924072 830485077 829898605 829603653
2527 829603653 829362183 829058151 828764191 828499069 828307648 828293076 828298111 828239670 827995300 827260971 826496582
2538 826496582 826047897 825951080 826620331 827266693 827007294 826536636 826406479 826161880 825283966 824513397
2548 824513397 824515610 824996262 826133957 827173004 827302246 826865234 825595627 824512024 824899445 825689545
2558 825689545 826250305 826558075 826143036 825709839 826085052 826433640 825974197 825368195 825072327 824916611
2568 824916611 824935455 824969330 824896317 824636917 823930969 823195496 822932281 822626343 821811447 820842514
2578 820842514 819784164 819040070 819285660 819769592 819925079 819872360 819540482 818935165 817858200 816848984
2588 816848984 816645889 816452942 815335770 814446411 815048676 815872879 815943756 815639954 814845123 814066391
2598 814066391 813927612 813962479 814008026 813775330 812747269 811445236 810051880 809064178 809315948 809976120
2608 809976120 810436707 810861588 811389694 811485977 810281525 808916550 808342896 808254013 808913956 809561996
2618 809561996 809364090 808803787 807969055 807212372 806936264 807075729 808071136 808806152 807893753 806585083
2628 806585083 805654755 805145264 805724869 806288986 805529327 804724426 804984589 805505066 805957108 806023102
2638 806023102 804897766 803713837 803511658 803761749 804491501 805068283 804596634 803889999 803590546 803312988
2648 803312988 802714615 802306671 802764206 803253632 803024063 802500458 801664352 801094055 801776657 802466125
2658 802466125 801954041 801112671 800430756 799849014 799553833 799294968 798821182 798320084 797885666 797544479
2668 797544479 797540665 797312469 796118011 794739456 793695679 793033142 793153763 793509521 793548355 793681641
2678 793681641 794372787 794911346 794550629 793861618 793137512 792465210 792096634 791828384 791480560 791233978
2688 791233978 791369934 791405945 790716629 790012360 789929123 790062866 790331116 790402908 789716034 788881073
2698 788881073 788416138 788036346 787500610 787191849 787672729 788161545 787969131 787376633 786208191 785144577
2708 785144577 785089264 785195312 784646759 784251938 784798355 785531769 785834579 786083450 786520004 786928864
2718 786928864 787150650 787259064 787290115 787197342 786886215 786535950 786317825 786158600 786048889 785967865
2728 785967865 785877457 785816422 785915375 785858612 785179825 784458847 784338455 784159927 783204575 782293549 782275925
2739 782275925 782347717 781852951 781195145 780506592 779944458 779835205 779802551 779628525 779161911 777979126
2749 777979126 776679535 775775681 775102844 774602203 774467239 775172958 775814056 775455246 774659653 773491135
2759 773491135 772510300 772563248 772856445 772995453 772626648 770845184 768909912 767902374 767449875 767675171
2769 767675171 768173447 768705368 768894653 768098373 766875534 765473099 764180908 763612289 763039551
2778 763039551 761677017 760309448 759560318 759126205 759057541 758913727 758186111 757126312 755585175
2787 755585175 754254074 754031906 754146805 754199066 753969193 752939453 751602173 750234146 748960953
2796 748960953 748098831 747350922 746456833 745622406 744976959 744486084 744131088 743991852 744410782 744579544
2806 744579544 743518829 742082596 740736694 739662628 739495773 739337921 738186798 736988297 736415405
2815 736415405 736284027 736967545 737466812 736599426 735287399 734069138 732912750 731911392 731229095
2824 731229095 731152496 731406479 731972198 732364883 732059250 731157532 729196777 727346191 727014313 727019806
2834 727019806 726543198 725905151 725228577 724285812 722680588 721039734 720019836 719135056 718111496
2843 718111496 716968765 715464325 714109421 713459930 713138580 712973633 712902069 713002701 712677002 710941772
2853 710941772 709029694 707890015 707389374 708153229 708852768 708013306 706695328 705722351 704329987
2862 704329987 701656113 698813934 696633072 695101776 694956284 694779358 693076859 690815430 688322296
2871 688322296 686019897 684450150 683578491 683794250 684366455 684625168 684775620 684971313 684696884 683082581
2881 683082581 681341171 680678635 680244217 679452667 678713074 678342590 678030014 677545547 676959991 676244278
2891 676244278 675465851 674761505 673891068 672534943 671065826 669773788 668584824 667569885 666580200
2900 666580200 665410004 664298782 663306503 662762146 663432617 664064636 663529129 662217865 659778595
2909 659778595 657312851 656071167 655253677 654564819 653741379 652330170 650600891 648521423 646543045
2918 646543045 645519943 644210129 641102524 637856483 635880241 634415398 633346786 632150650 629923820
2927 629923820 627686729 626408348 625337143 623914719 622530441 621218452 620484848 621233940 622304916
2936 622304916 622678299 622833710 622789612 622907867 623855820 624735107 624543419 624257088 624655952 625326385
2946 625326385 626155853 627019653 627834549 628362427 628255615 627757301 626832733 625967026 625786552 625831375
2956 625831375 625953217 625842323 625076065 623843193 622127304 620121727 618041992 615801582 613284836
2965 613284836 610791931 608618240 606661072 604965935 603383064 601790924 600147247 598218193 596454391
2974 596454391 595195541 594537964 594934692 595652580 595870514 596304169 597612381 599141350 600359421
2983 600359421 601557007 602696419 604229698 607060661 609792709 610949020 611672630 612639656 613770256
2992 613770256 615304947 616955261 618573685 619977226 620638123 621440430 623334160 625591736 627936859
3001 627936859 629963150 631017227 631563911 631620407 631874313 633345375 635052185 636397133 637247314
3010 637247314 636966705 636465302 636533279 636893997 637587318 638452759 639335403 640255432 641417770 642113647
3020 642113647 641328125 640183945 639548798 639171600 639311790 639305115 638279190 637114525 636600952 636137009
3030 636137009 635216484 634341736 634044876 633727074 632678986 631761322 631865005 632188072 632322311 631975899
3040 631975899 630473633 628554344 626859436 625004768 622468948 620303383 619770279 619714966 619452705
3049 619452705 618834267 617170792 615395775 614387054 613622208 613023300 612135162 610192528 608046532
3058 608046532 606309662 604931831 604271660 603713760 602555275 601415863 600923538 600348701 599005928
3067 599005928 597390175 595520973 594136009 594436188 595051270 594863167 594315300 593323212 592349052
3076 592349052 591929932 591753731 591866722 591729164 590375443 589127312 589376907 589945793 589903831 589897881
3086 589897881 590440521 591001053 590986252 591094513 592153778 593179474 593059082 593002319 594194870 595595131
3096 595595131 596561432 597078552 596582413 596075783 596559982 597472687 598786583 599894028 599836121 599639168
3106 599639168 600260010 600945473 601176262 601207008 601019859 600910912 601306915 601796150 602092972 602243195
3116 602243195 602147827 601953735 601824036 601609459 601099243 600638618 600533981 600689392 601330032 601796150
3126 601796150 601267090 600450058 599665146 599251251 600045700 600869904 600528946 599908371 599556923 599289398
3136 599289398 599225998 598998566 598144073 597064247 595924835 594969749 594676743 594507446 593870888 593402138
3146 593402138 593826294 594281921 594023933 593428383 592515945 591605682 591151733 590768585 590217133 589512329
3156 589512329 588442307 587446213 587057114 586778183 586201439 585591316 585085640 584654808 584391594 584064713
3166 584064713 583377609 582616081 582110634 581427574 579937706 578555336 578179588 578224907 578584671 578719139
3176 578719139 577653885 576585541 576846352 577052116 575965424 574477425 572986603 571733932 571188927
3185 571188927 571063538 571402321 571675301 571234703 570475807 569475403 568538437 568190079 567844391 566971283
3195 566971283 565927277 564826012 563862572 563264618 563048134 563504944 564032784 563997726 563786736 563553810
3205 563553810 563363571 563418388 563458214 563264122 562913437 562392464 561752777 560871124 560257683 560696602
3215 560696602 561239700 561122169 560575714 559404602 558126450 557214966 556602478 556413422 556543350 557116013
3225 557116013 557571411 557202110 556572685 556063881 555516968 554730186 554213028 554752350 555311928 554979324
3235 554979324 554168701 552752991 551442642 551235657 551141281 550246735 549311867 548964272 548687439 548054199
3245 548054199 547424545 546991119 546825180 547327042 547701111 546962967 546076050 545895348 545758476 545159836
3255 545159836 544481506 544040909 543523788 542710800 541631470 539968033 538541336 538201828 538542747
3264 538542747 539794922 540894279 540467262 539671898 539343109 539075127 538722992 538338661 537828217 537481537
3274 537481537 537664413 538054962 538573761 538856735 538248520 537540207 537482758 537538528 537335396 537124863
3284 537124863 537134628 537062416 536561966 535991898 535660973 535371780 534939537 534631958 534817467 535005798
3294 535005798 534700165 534289131 533934097 533816566 534265289 534999619 536037445 536811829 536478767 535885811
3304 535885811 535562744 535617828 536779633 537714729 536838531 535630951 535158615 535073509 535488358 536086311
3314 536086311 536626091 536992073 536942253 536611099 535818329 535264244 535916100 536789894 537110558 537215958
3324 537215958 537055740 537016869 537666092 538412094 538898010 538986931 538185120 537206421 536534309 536365280
3334 536365280 537315369 538607597 539640656 540500183 541192551 541354179 540174713 538999786 539245148
3343 539245148 539887199 540405273 540704498 540328255 539838066 539734116 539740791 539743423 539756546 539693604 539741974
3354 539741974 540297012 540647964 539817352 538998833 539305191 539999008 540933609 541446915 540340195 539075623
3364 539075623 539091835 539258957 538654099 538094521 538320312 538640518 538499107 538229713 537878036 537750473
3374 537750473 538347969 539132843 539698372 540150871 540561676 540626297 539692879 538874855 539500465 540270081
3384 540270081 540128479 539669762 538911362 538524628 539601326 540894737 541403999 541482201 541020889 540403366
3394 540403366 539960136 539738159 539992561 540427704 540828934 541205902 541463127 541697502 542032242 542292595
3404 542292595 542339096 542186508 541639786 541187286 541381836 541831245 542504082 542869797 541944046 541056404
3414 541056404 541608353 542399178 542685738 542493591 541105499 540005684 541092873 542403221 542132874
3423 542132874 541698685 542255173 542785416 542383423 541867752 541838150 542041321 542445908 542982559 543488731
3433 543488731 544209709 545583267 546867828 547434578 547380905 546261787 545075417 544880371 545047035
3442 545047035 545448303 545632133 544820557 543863525 543425560 543281784 543463211 543863525 544320831 545032043
3452 545032043 546484947 547644386 547117233 546462555 547172318 548051376 548139343 548220863 549013596 549756050
3462 549756050 549772987 549521446 549190063 548908234 548911591 549069633 549386749 549691696 549717674 549753189 550124893
3473 550124893 550448189 550272446 550119858 550589561 550996552 550600052 550164223 550261726 550726166 551738281
3483 551738281 552826653 553549271 553996582 554077606 553894272 553404808 552945633 552958488 553082695 552958717
3493 552958717 553022385 553796768 554659843 555344353 555306664 553275604 551165352 550804367 551177254 551874886
3503 551874886 552904129 554382553 555568237 555474052 554949760 554438820 554172974 554592857 555513153 557159653
3513 557159653 558738251 559184303 559532890 560842972 561975021 561733971 561342010 561856995 562573929
3522 562573929 563331375 563554039 562093010 560504913 560241699 560465584 560815353 561310768 561752548 562433243
3532 562433243 563916702 565187454 564856033 564607391 566152573 568023682 569320221 570050240 569651833
3541 569651833 568934212 568396339 568407059 569916496 571676254 572649460 573151360 572791595 572646370 574201584
3551 574201584 575836906 576168785 575970650 575276871 574919701 575954895 577745209 580280533 582731476
3560 582731476 584341049 584878693 583333740 581289520 579810371 579439163 581819534 584712982 585992355
3569 585992355 586966019 588395119 589791527 590958595 591781387 591906548 591849327 591705322 592377434 595333099
3579 595333099 598971367 602514267 604958534 604548225 602760086 599737625 597722282 599952469 603577385
3588 603577385 607014427 609695206 609792709 609498253 610640755 612478256 615380287 617837906 617639084
3597 617639084 617261162 618646393 621185532 625614395 629838715 631611328 632123222 631225357 630688171
3606 630688171 633030396 635858078 637100945 638303299 640524902 643145828 646300583 648785095 648802490
3615 648802490 648264389 648344269 649457703 652808685 657202988 661936035 666739960 672013016 675048599
3624 675048599 670956573 666682968 669081421 673535309 677787323 681610565 683509827 685032120 687523117
3633 687523117 690089264 691863556 694108276 698321075 702928085 706349640 710098038 716018448 721532593
3642 721532593 724205704 725450058 725589523 725450745 725709229 727140884 731463699 736524353 740649261
3651 740649261 744114838 746117554 748221664 752168198 756622543 760675888 764790802 769169083 773682861
3660 773682861 778402328 782932281 786807098 790304871 793520966 796535950 799034576 802299728 808961182
3669 808961182 814662476 813959579 812745361 816074142 821014404 826691589 831988068 834701538 837211151
3678 837211151 841794510 846554031 850019913 853183289 856969376 860104523 860579758 861526260 866564789
3687 866564789 872217865 875794678 878555069 880761871 882712402 884869843 886998444 889005432 890922089
3696 890922089 892724533 894484787 896402817 898069382 898765564 899617157 901898651 904442520 906355362
3705 906355362 908088226 909853439 911470871 912983398 913932343 913476486 912802734 913004608 913520355
3714 913520355 914309998 914899139 914462585 914011230 914304962 915271988 917445908 919767609 921205750
3723 921205750 922208099 922558517 923213730 925563354 928091049 929885406 930519791 928247681 926116486
3732 926116486 927567749 929669342 930518188 930469055 928909302 926838608 924891510 923549881 923390121
3741 923390121 924761276 929310303 933718185 934174500 933797607 934813538 936085663 937376251 938213120
3750 938213120 937794952 936869125 935922852 934934387 933909454 933252335 933366547 934258728 936635284 938797455
3760 938797455 938735962 938086243 937616348 937918396 940724335 943383179 943314514 942035446 939851303 937814026
3770 937814026 937471390 937639923 937298508 937504272 939324646 941705017 944282532 946047821 945447693
3779 945447693 943749924 941238632 939308167 939999084 941652985 943387527 944914551 945643921 945598831
3788 945598831 944257050 942664413 941654663 941338806 942409973 943954468 945295792 946412582 946944275
3797 946944275 947229385 947458267 947712860 948286514 948732376 948431702 948190002 949264297 949678650 947163544
3807 947163544 943853378 940798264 938979187 940242538 943038712 946969528 950424652 951231995 950678864
3816 950678864 948920288 947178802 947042007 947568436 948474884 949372787 949616699 949692688 950092545 950152130
3826 950152130 949118881 947748413 946455231 945509644 945528488 945886383 946008682 946359634 947278748 948562393
3836 948562393 950404434 951948624 952036896 951765747 952165833 952277222 951418152 949782410 946805725
3845 946805725 944077225 942650528 943566055 949908295 956598511 959011993 958869019 955724030 951447754
3854 951447754 947670441 944666901 943250198 943433075 946121674 949447861 952023773 953312836 951587906
3863 951587906 949032745 947236328 946255188 946934662 948496552 950796356 952774734 953006287 952442398
3872 952442398 951589813 950357208 948576965 946983337 946280518 946388474 947858582 949501038 950120926
3881 950120926 950281830 949759750 949721603 952155151 954373627 953770370 952091675 950246353 948137512
3890 948137512 945569534 943747787 944453506 945763550 945973129 946207733 947124939 948422928 950268707
3899 950268707 951909790 952744980 952485046 949883728 947210770 946926804 947213669 946942825 946502228
3908 946502228 945702057 945146790 945587845 946391602 947197647 947935104 948408127 948627472 948472519 948141556
3918 948141556 947901993 947422943 946063309 945019455 945692520 946825027 947619476 948093414 947738876
3927 947738876 947333374 947728424 948192368 948192368 947982788 947592239 947162628 946995468 946639557 945451736 944306107
3938 944306107 944026031 944118042 944624634 944761505 943010101 941614151 943123550 945098419 945762863
3947 945762863 945670853 944404831 943102875 943070145 943386078 943514328 943603516 943715363 943571320 942730865
3957 942730865 941742172 941040268 940520325 940239182 940146713 940357208 940432281 939628372 938972473 939668198
3967 939668198 940441360 940186234 939601440 938848495 938432007 939242096 940280914 940667648 940939407 941402893
3977 941402893 941868744 942252655 942544479 942881317 942735443 941057892 939548264 940052261 941079407
3986 941079407 941783676 942076187 941231232 940310211 940458527 940696259 940246811 939642944 938975067 938793182
3996 938793182 940305710 941623917 940653534 939217834
4000 939217834
##END=$$ End of the data block
