##TITLE=$$ Begin of the data block
##JCAMP-DX=5.00 $$ ACD/SpecManager v 10.08
##SPECTROMETER/DATA SYSTEM=Alpha
##DATE=23 Dec 2014 14:28:26
##DATA TYPE=INFRARED SPECTRUM
##DATA CLASS=XYDATA
##ORIGIN=
##OWNER=
##NPOINTS=1765
##FIRSTX=399.76428223
##LASTX=3997.64306641
##MAXX=3997.64306641
##MINX=399.76428223
##MAXY=0.82742023
##MINY=0.17303801
##XFACTOR=1.0000000000
##YFACTOR=1.000000000000000e-9
##FIRSTY=0.50692642
##DELTAX=2.03961372
##XUNITS=1/CM
##YUNITS=ARBITRARY UNITS
##XYDATA=(X++(Y..Y))
$$ plain form
399.8 506926417 501014888 495784849 492181748 491343468 492643863 495058686 497734129 499539971 499462694
418.1 499462694 497730851 495958805 493561119 490189224 486658424 482985497 479154825 475665748
434.4 475665748 473437369 473482758 475675225 479412884 484247595 489342511 493737191 496988863 498912305
452.8 498912305 499480546 499036968 497736335 495967060 494049162 491785347 488662720 484760791 480592579
471.2 480592579 476511806 473208159 470857859 469106406 467634618 466460705 465902507 465909332 466023564
489.5 466023564 465780050 464816928 462999582 460655212 458339542 456086189 453676999 450970411 447590292
507.9 447590292 443542689 439194739 434741020 430038601 424934328 419976860 415787637 412579507
524.2 412579507 410525560 409648120 409775555 410943389 413358718 417282879 422746658 429024905 434740990
$$ packed form
399.8E06926417n911529n230039l603101q38280J300395K414823K675443J805842p7277
418.1D99462694j731843j772046k397686l371895l530800l672927l830672l489077
434.4D75665748k228379M5389K192467L737659M834711N094916M394680L251672J923442
452.8D98912305N68241m43578j300633j769275j917898k263815l122627l901929m168212
471.2D80592579m080773l303647k350300j751453j471788j173913n58198O825J14232
489.5D66023564k43514r63122j817346k344370k315670k253353k409190k706588l380119
507.9D47590292m047603m347950m453719m702419n104273m957468m189223l208130
524.2D12579507k053947q77440J27435J167834K415329L924161N463779O278247N716085
$$ plain form
542.5 434740990 438829094 441087455 441600293 440634936 438836724 436418831 433051735 428784221 423846215
560.9 423846215 417942107 410882771 402932554 394807070 387890756 383427262 381874472 383194953
577.2 383194953 387145042 393345147 401176125 409588546 417289406 423285902 427272230 429444432
593.5 429444432 430306524 430463254 430431604 430308223 429933667 429553181 429631710 430391371 431815952 433921695
613.9 433921695 436656266 439816833 443376660 447388798 451757610 456263989 460556448 464184225
630.2 464184225 466949761 469059020 470881522 472687870 474539101 476241142 477555513 478571236
646.6 478571236 479564607 480665475 481937230 483358622 484699070 485683143 486284673 486897737 488028020
664.9 488028020 490235806 492880255 494124144 494973063 496213049 497835785 499779761 501881480 503747642
$$ packed form
542.5D34740990M088104K258361N12838r65357j798212k417893l367096m267514m938006
560.9D23846215n904108p059336p950217q125484o916314m463494j552790J320481
577.2C83194953L950089O200105P830978Q412421P700860N996496L986328K172202
593.5D29444432Q62092J56730l1650j23381l74556l80486P8529P59661J424581K105743
613.9D33921695K734571L160567L559827M012138M368812M506379M292459L627777
630.2D64184225K765536K109259J822502J806348J851231J702041J314371J015723
646.6D78571236R93371J100868J271755J421392J340448R84073O01530O13064J130283
664.9D88028020K207786K644449J243889Q48919J239986J622736J943976K101719J866162
$$ plain form
683.3 503747642 504961669 505443454 505416751 505140841 504588366 503369987 500983953 497379482 493181050
701.6 493181050 489289284 486458361 485133320 485325456 486744344 489301771 493159324 498350412 504710138
720 504710138 511798561 519042790 525893509 531950891 537325561 542379677 547184348 551405847 554407418
738.3 554407418 555749059 555647552 554562092 552622616 549703121 545604706 540310323 534174621 527924061
756.7 527924061 522346616 517981350 515110552 513900638 514644027 517736673 523419082 531608462 541828394
775.1 541828394 553029299 563747525 572904587 580388427 586822212 592820644 598504066 603583038
791.4 603583038 607895613 611798704 616045415 621133506 626778603 632150412 636492670 639540374
807.7 639540374 641533136 643099070 644782245 646570802 647934675 648239017 647243798 645248771 642629683
$$ packed form
683.3E03747642J214027M81785k6703k75910n52475j218379k386034l604471m198432
701.6D93181050l891766k830923j325041J92136J418888K557427L857553N191088O359726
720E04710138P088423P244229O850719O057382N374670N054116M804671M221499L001571
738.3E54407418J341641j01507j085460j939476k919495m098415n294383o135702o250560
756.7E27924061n577445m365266k870798j209914P43389L092646N682409Q189380J0219932
775.1E41828394J1200905J0718226R157062P483840O433785N998432N683422N078972
791.4F03583038M312575L903091M246711N088091N645097N371809M342258L047704
807.7F39540374J992762J565934J683175J788557J363873L04342r95219j995027k619088
$$ plain form
826 642629683 639435530 635402858 630185127 623745024 616611898 609743834 603874743 598994076 594540060
844.4 594540060 590068102 585457504 580735147 575964093 571023405 565761983 560762525 557955384
860.7 557955384 559678316 566721976 578013361 591958940 606950700 620967984 632041872 639283597
877 639283597 642908752 643399298 641103387 636359692 629686475 621945798 614179909 607144237 601070523
895.4 601070523 595656514 590263784 584389865 577820182 570450902 562207580 552956104 542493284
911.7 542493284 530796707 518346608 506246448 495893955 488299519 483592808 481115133 480013281
928 480013281 479966342 481266499 484176308 488584757 494153708 500463367 506786048 511635721 513132989
946.4 513132989 510146439 502678514 491396010 477232516 461056769 443476707 424894691 405502796
$$ packed form
826F42629683l194153m032672n217731o440103p133126o868064n869091m880667m454016
844.4E94540060m471958m610598m722357m771054m940688n261422m999458k807141
860.7E57955384J722932P043660J1291385J3945579J4991760J4017284J1073888P241725
877F39283597L625155M90546k295911m743695o673217p740677p765889p035672o073714
895.4F01070523n414009n392730n873919o569683p369280q243322r251476j0462820
911.7E42493284j1696577j2450099j2100160j0352493p594436m706711k477675j101852
928D80013281m6939J300157K909809M408449N568951O309659O322681M849673J497268
946.4E13132989k986550p467925j1282504j4163494j6175747j7580062j8582016j9391895
$$ plain form
962.7 405502796 385365069 364541888 343086839 321170896 299160719 277520686 256821305
977 256821305 237730101 220883980 206739455 195459083 186924353 180850595 176888227 174606979
993.3 174606979 173586100 173465520 173914060 174658716 175401285 175773919 175589323 174944595 174058244 173285156
1013.7 173285156 173038006 173555210 174860284 176932320 179721966 183101460 186884254 190827295 194664538
1032 194664538 198098764 200819358 202625439 203660786 204332560 205040842 206090912 207793653 210549638
1050.4 210549638 214728802 220471829 227651507 236153841 246012002 257145196 268605530 277777135
1066.7 277777135 280891567 275767803 264495045 252234697 243178442 238491029 237434551 238979906
1083 238979906 242391542 247166350 253028125 259756893 266857773 273572415 279086441 282873303 284977406
$$ packed form
962.7D05502796k0137727k0823181k1455049k1915943k2010177k1640033k0699381
977B56821305j9091204j6846121j4144525j1280372q534730o073758l962368k281248
993.3A74606979j020879j20580M48540P44656P42569L72634j84596o44728q86351p73088
1013.7A73285156k47150N17204J305074K072036K789646L379494L782794L943041L837243
1032A94664538L434226K720594J806081J035347O71774P08282J050070J702741K755985
1050.4B10549638M179164N743027P179678Q502334R858161J1133194J1460334R171605
1066.7B77777135L114432n123764j1272758j2260348r056255m687413j056478J545355
1083B38979906L411636M774808N861775O728768P100880O714642N514026L786862K104103
$$ plain form
1101.4 284977406 286059558 287186205 289344549 292874306 297396123 302258193 306891769 310868412
1117.7 310868412 313963503 316278875 318238676 320560277 323964655 328637779 333759010 337730050
1134 337730050 339037895 336840987 331207335 323062241 313741833 304417014 295891315 288720638 283277512
1152.4 283277512 279722601 278061181 278248310 280273437 284264773 290402859 298823953 309589654
1168.7 309589654 322504997 337080836 352766871 369006693 385303199 401290476 416652322
1183 416652322 431056142 444072932 455202460 464012682 470374048 474615782 477435470 479544550
1199.3 479544550 481417537 483379304 485698372 488651186 492522448 497441977 503196776 509206176
1215.6 509206176 514736295 519115806 521919429 523131788 523043752 522016168 520318985 518151343 515765965
$$ packed form
1101.4B84977406J082152J126647K158344L529757M521817M862070M633576L976643
1117.7C10868412L095091K315372J959801K321601L404378M673124N121231L971040
1134C37730050J307845k196908n633652q145094r320408r324819q525699p170677n443126
1152.4B83277512l554911j661420J87129K025127L991336O138086Q421094J0765701
1168.7C09589654J2915343J4575839J5686035J6239822J6296506J5987277J5361846
1183D16652322J4403820J3016790J1129528Q810222O361366M241734K819688K109080
1199.3D79544550J872987J961767K319068K952814L871262M919529N754799O009400
1215.6E09206176N530119M379511K803623J212359q8036j027584j697183k167642k385378
$$ plain form
1234 515765965 513415039 511311173 509709537 508850694 508862257 509754419 511385083 513510168 515914679
1252.3 515914679 518372715 520575762 522288263 523525774 524554253 525801718 527652979 530142665
1268.6 530142665 532788098 534903467 536087096 536319256 535815597 534904361 533884227 532840610 531658113
1287 531658113 530236781 528613567 526824534 524801731 522532761 520135581 517736435 515386403 513079584
1305.4 513079584 510859549 508889496 507281601 505909324 504532278 502978384 501119435 498718888
1321.7 498718888 495367795 490730584 484893590 478413045 472068161 466575861 462376773 459558517
1338 459558517 458016008 457551509 457787514 458324820 458817929 459016502 458847761 458289266 457372427 456242472
1358.4 456242472 455031812 453734726 452588946 451848865 451456875 451520532 452156812 453235358 454443693
$$ packed form
1234E15765965k350926k103866j601636q58843J1563Q92162J630664K125085K404511
1252.3E15914679K458036K203047J712501J237511J028479J247465J851261K489686
1268.6E30142665K645433K115369J183629K32160n03659r11236j020134j043617j182497
1287E31658113j421332j623214j789033k022803k268970k397180k399146k350032k306819
1305.4E13079584k220035j970053j607895j372277j377046j553894j858949k400547
1321.7D98718888l351093m637211n836994o480545o344884n492300m199088k818256
1338D59558517j542509m64499K36005N37306M93109J98573j68741n58495r16839j129955
1358.4D56242472j210660j297086j145780p40081l91990O3657O36280J078546J208335
$$ plain form
1376.7 454443693 455678850 457084417 459025651 462046206 466468006 471324503 475218385 477942675
1393.1 477942675 479407728 479525775 478571683 477171868 475674242 473841071 471791804 469721973 467601478
1411.4 467601478 465679199 464266688 463205367 462337375 462087601 462502718 463326484 464522421 466078341
1429.8 466078341 467892975 469903439 472235054 474671125 476771861 478771359 480612099 481964707
1446.1 481964707 482418418 481925994 480961114 479838103 477982640 475620747 475019902 476179034 479033917
1464.5 479033917 483569682 489301473 497089952 508473694 520691752 531103015 540464222 549399853
1480.8 549399853 557960391 565643489 572894275 580236673 587017000 592362165 597285211 602569282
1497.1 602569282 607244611 610999167 614372671 618148625 622458696 625445843 627619088 629867077
$$ packed form
1376.7D54443693J235157J405567J941234L020555M421800M856497L893882K724290
1393.1D77942675J465053J18047r54092j399815j497626j833171k049267k069831k120495
1411.4D67601478j922279j412511j061321q67992k49774M15117Q23766J195937J555920
1429.8D66078341J814634K010464K331615K436071K100736J999498J840740J352608
1446.1D81964707M53711m92424r64880j123011j855463k361893o00845J159132K854883
1464.5D79033917M535765N731791P788479J1383742J2218058J0411263R361207Q935631
1480.8E49399853Q560538P683098P250786P342398O780327N345165M923046N284071
1497.1F02569282M675329L754556L373504L775954M310071K987147K173245K247989
$$ plain form
1513.4 629867077 632240593 634718299 637117445 639448822 641308844 642668426 643859744 644977212
1529.7 644977212 646234751 647472858 648554385 649679959 650530815 650350690 649955153 649876952 650026798
1548.1 650026798 650155067 650166094 650180876 650295198 649921417 648503006 647758901 647360623 646854520 646115839
1568.5 646115839 645098925 644496381 644192874 643344283 642176926 641120374 639929533 638674140 637399018
1586.8 637399018 636042893 634446025 632467449 630073965 627442598 624779344 622030735 619044840
1603.2 619044840 615721166 611955345 607653260 603321493 599492490 595324934 590010583 585623503
1619.5 585623503 581957579 577486396 573066771 569148362 565522492 562787831 560497642 557365537
1635.8 557365537 554557621 553256035 552896678 553187847 553865194 554788649 556050062 558094025 561152577
$$ packed form
1513.4F29867077K373516K477706K399146K331377J860022J359582J191318J117468
1529.7F44977212J257539J238107J081527J125574Q50856j80125l95537p8201J49846
1548.1F50026798J28269J1027J4782J14322l73781j418411p44105l98278n06103p38681
1568.5F46115839j016914o02544l03507q48591j167357j056552j190841j255393j275122
1586.8F37399018j356125j596868j978576k393484k631367k663254k748609k985895
1603.2F19044840l323674l765821m302085m331767l829003m167556n314351m387080
1619.5E85623503l665924m471183m419625l918409l625870k734661k290189l132105
1635.8E57365537k807916j301586l59357K91169O77347R23455J261413K043963L058552
$$ plain form
1654.1 561152577 564031720 567096293 570814431 575172007 579761088 584208608 589483559 595734894
1670.5 595734894 601307511 606813908 612646282 618020236 623349965 629587054 637227595 643386424
1686.8 643386424 648216784 653136015 657796979 662968516 668538392 673347652 677733421 681007385
1703.1 681007385 683752298 686644673 689451456 692274630 695081532 697666109 699708223 700999260
1719.4 700999260 702236235 703921974 706023574 708191991 710304081 712301910 714368343 716433823
1735.7 716433823 718416095 720603704 722765386 724835277 727141261 729867697 733046889 736335456
1752 736335456 739209294 741813660 744248211 746517420 748936534 751305580 753456235 755423307 757102072
1770.4 757102072 758470118 759640574 760871828 762287498 763664424 764710248 765514612 766346335 767411888
$$ packed form
1654.1E61152577K879143L064573L718138M357576M589081M447520N274951O251335
1670.5E95734894N572617N506397N832374N373954N329729O237089P640541O158829
1686.8F43386424M830360M919231M660964N171537N569876M809260M385769L273964
1703.1F81007385K744913K892375K806783K823174K806902K584577K042114J291037
1719.4G00999260J236975J685739K101600K168417K112090J997829K066433K065480
1735.7G16433823J982272K187609K161682K069891K305984K726436L179192L288567
1752G36335456K873838K604366K434551K269209K419114K369046K150655J967072J678765
1770.4G57102072J368046J170456J231254J415670J376926J045824Q04364Q31723J065553
$$ plain form
1788.8 767411888 768778086 770189226 771175921 771867514 772516251 773241937 774134338 775168955 776228011
1807.1 776228011 777115762 777714014 778171837 778796673 779666960 780624688 781472921 782129884 782627046 783128619
1827.5 783128619 783759058 784422338 785043597 785528481 785786510 785963058 786298335 786817133 787306309 787620366
1847.9 787620366 787757993 787766755 787786543 787989259 788392425 788855255 789190888 789363623 789493918 789651632
1868.3 789651632 789856136 790175855 790582299 790898263 791046798 791164219 791474640 792045832 792716026 793220043
1888.7 793220043 793411374 793445051 793547213 793805361 794178963 794554174 794770122 794783175 794729054 794764459
1909.1 794764459 794940412 795219183 795501053 795644820 795630455 795602500 795685589 795905769 796192169 796390772
1929.5 796390772 796421170 796361089 796351969 796502531 796786904 797074199 797208250 797188580 797178268 797313213 797608733
$$ packed form
1788.8G67411888J366198J411140R86695O91593O48737P25686Q92401J034617J059056
1807.1G76228011Q87751N98252M57823O24836Q70287R57728Q48233O56963M97162N01573
1827.5G83128619O30439O63280O21259M84884K58029J76548L35277N18798M89176L14057
1847.9G87620366J37627Q762J9788K02716M03166M62830L35633J72735J30295J57714
1868.3G89651632K04504L19719M06444L15964J48535J17421L10421N71192O70194N04017
1888.7G93220043J91331L3677J02162K58148L73602L75211K15948J3053n4121L5405
1909.1G94764459J75953K78771K81870J43767j4365k7955Q3089K20180K86400J98603
1929.5G96390772L0398o0081r120J50562K84373K87295J34051j9670j0312J34945K95520
$$ plain form
1951.9 797608733 797991812 798306048 798427999 798452318 798544645 798797727 799159408 799449444 799574554 799588799
1972.3 799588799 799577117 799658060 799869418 800076067 800179899 800196648 800179303 800186813 800287664 800430179 800489783
1994.8 800489783 800451100 800343633 800206482 800088167 800019324 799941182 799753308 799423337 799024880 798636794
2015.2 798636794 798260212 797863781 797380805 796723187 796004951 795549214 795318067 795023084 794645071 794248819
2035.6 794248819 793806970 793315887 792827427 792434514 792195439 791998684 791733146 791461349 791285515 791226864
2056 791226864 791232884 791248262 791266501 791300893 791341484 791390896 791450143 791519642 791589797 791626394 791620731 791601956
2080.4 791601956 791630507 791735113 791868150 791983187 792086661 792182267 792282164 792411089 792593479 792812705
2100.8 792812705 793000460 793136597 793257594 793409467 793580592 793723226 793809593 793828726 793814719 793819726
$$ packed form
1951.9G97608733L83079L14236J21951K4319R2327K53082L61681K90036J25110J4245
1972.3G99588799j1682Q0943K11358K06649J03832J6749j7345P510J00851J42515N9604
1994.8H00489783l8683j07467j37151j18315o8843p8142j87874l29971l98457l88086
2015.2G98636794l76582l96431m82976o57618p18236m55737k31147k94983l78013l96252
2035.6G94248819m41849m91083m88460l92913k39075j96755k65538k71797j75834n8651
2056G91226864O020J5378J8239L4392M0591M9412N9247O9499P0155L6597n663j8775
2080.4G91601956K8551J04606J33037J15037J03474R5606R9897J28925J82390K19226
2100.8G92812705J87755J36137J20997J51873J71125J42634Q6367J9133j4007N007
$$ plain form
2121.2 793819726 793855131 793895662 793911040 793913186 793915331 793907881 793927968 794005096 794107795 794148088 794102848 794075429
2145.7 794075429 794113636 794179082 794259429 794369400 794500649 794670343 794921577 795266926 795663953 796035230
2166.1 796035230 796379089 796773791 797266901 797833741 798407435 798958719 799500585 800010741 800476670 800933242
2186.5 800933242 801432550 801988304 802517831 802938282 803292990 803674161 804102540 804571629 805075049 805552065
2206.9 805552065 805956841 806346416 806774974 807241082 807723045 808174193 808561742 808887780 809198797 809539974
2227.3 809539974 809939981 810359240 810683906 810895979 811070204 811276972 811558247 811876953 812161267 812387884
2247.7 812387884 812568009 812747777 812954605 813215494 813545644 813853502 814103782 814345598 814592779 814844906
2268.1 814844906 815101564 815367341 815610290 815782130 815906703 816057920 816289067 816581190 816856682 817093670
$$ packed form
2121.2G93819726L5405M0531J5378K146K145p450K0087P7128J02699M0293m5240k7419
2145.7G94075429L8207O5446Q0347J09971J31249J69694K51234L45349L97027L71277
2166.1G96035230L43859L94702M93110N66840N73694N51284N41866N10156M65929M56572
2186.5H00933242M99308N55754N29527M20451L54708L81171M28379M69089N03420M77016
2206.9H05552065M04776L89575M28558M66108M81963M51148L87549L26038L11017L41177
2227.3H09539974M00007M19259L24666K12073J74225K06768K81275L18706K84314K26617
2247.7H12387884J80125J79768K06828K60889L30150L07858K50280K41816K47181K52127
2268.1H14844906K56658K65777K42949J71840J24573J51217K31147K92123K75492K36988
$$ plain form
2288.5 817093670 817331791 817610741 817940414 818290472 818625152 818918467 819178641 819460094 819866598 820439160
2308.9 820439160 821029961 821470976 821778595 822178543 822849870 823598921 824122906 824471712 824823499 825181961
2329.3 825181961 825407505 825448453 825474560 825551927 825610101 825537622 825017571 823794901 822555244 822295964
2349.7 822295964 823244393 824830949 826253653 827168941 827420235 827025890 826192141 825044334 823629260
2368 823629260 822060883 820487678 819061518 817791462 816595852 815473020 814478755 813674748 813101709
2386.4 813101709 812751651 812534988 812325239 812068582 811795294 811544359 811338365 811131179 810827434 810421765
2406.8 810421765 809976578 809543788 809142768 808758080 808323264 807786942 807177663 806557119 805985272 805439115
2427.2 805439115 804884434 804337859 803749561 803091526 802428722 801787317 801164210 800554931 799893200 799163043
$$ packed form
2288.5H17093670K38121K78950L29673L50058L34680K93315K60174K81453M06504N72562
2308.9H20439160N90801M41015L07619L99948O71327P49051N23985L48806L51787L58462
2329.3H25181961K25544M0948K6107P7367N8174p2479n20051j222670j239657k59280
2349.7H22295964R48429J586556J422704R15288K51294l94345q33749j147807j415074
2368H23629260j568377j573205j426160j270056j195610j122832r94265q04007n73039
2386.4H13101709l50058k16663k09749k56657k73288k50935k05994k07186l03745m05669
2406.8H10421765m45187m32790m01020l84688m34816n36322o09279o20544n71847n46157
2427.2H05439115n54681n46575n88298o58035o62804o41405o23107o09279o61731p30157
$$ plain form
2447.6 799163043 798450351 797804534 797200620 796603680 795993567 795375764 794744909 794124663 793566704 793036699
2467.9 793036699 792485714 791898131 791297972 790740669 790221393 789717913 789219558 788712442 788194597 787677288
2488.3 787677288 787217081 786847830 786525190 786199272 785837829 785432696 785022736 784678459 784415066 784151316
2508.7 784151316 783827960 783456683 783065796 782665849 782271624 781874895 781404972 780848861 780257642 779648721
2529.1 779648721 779051483 778490424 777890205 777172089 776387572 775615275 774891734 774235129 773608148 772943974
2549.5 772943974 772211969 771445572 770721197 770066381 769430101 768749475 768004537 767238557 766508877 765863240
2569.9 765863240 765309393 764759719 764123499 763405323 762680590 762023151 761467099 760997832 760534108 760001481
2590.3 760001481 759415090 758846879 758374095 758016288 757676244 757236719 756671488 756018162 755343914 754693508
$$ packed form
2447.6G99163043p12692o45817o03914n96940o10113o17803o30855o20246n57959n30005
2467.9G93036699n50985n87583o00159n57303n19276n03480m98355n07116n17845n17309
2488.3G87677288m60207l69251l22640l25918l61443m05133m09960l44277k63393k63750
2508.7G84151316l23356l71277l90887l99947l94225l96729m69923n56111n91219o08921
2529.1G79648721n97238n61059o00219p18116p84517p72297p23541o56605o26981o64174
2549.5G72943974p32005p66397p24375o54816o36280o80626p44938p65980p29680o45637
2569.9G65863240n53847n49674o36220p18176p24733o57439n56052m69267m63724n32627
2590.3G60001481n86391n68211m72784l57807l40044m39525n65231o53326o74248o50406
$$ plain form
2610.7 754693508 754033029 753289998 752413154 751393497 750302315 749243677 748234034 747182548 746004522
2629.1 746004522 744694889 743314266 741958976 740655065 739381075 738118470 736796796 735406280
2645.4 735406280 734017611 732666671 731403351 730238378 729041219 727747500 726431370 725161731
2661.7 725161731 723979235 722865760 721765578 720627904 719427824 718228579 717126608 716149628
2678 716149628 715229332 714273989 713246822 712161362 711067557 710032523 709062457 708062112 706958055
2696.4 706958055 705774069 704541028 703306377 702130675 700960040 699701369 698370159 697042882
2712.7 697042882 695761740 694555998 693449616 692382216 691287279 690156519 689024210 687984765
2729 687984765 687065959 686205208 685379326 684545219 683644176 682736874 681899250 681098759 680317044 679551959
$$ packed form
2610.7G54693508o60479p43031q76844j019657j091182j058638j009643j051486j178026
2629.1G46004522j309633j380623j355290j303911j273990j262605j321674j390516
2645.4G35406280j388669j350940j263320j164973j197159j293719j316130j269639
2661.7G25161731j182496j113475j100182j137674j200080j199245j101971r76980
2678G16149628r20296r55343j027167j085460j093805j035034r70066j000345j104057
2696.4G06958055j183986j233041j234651j175702j170635j258671j331210j327277
2712.7F97042882j281142j205742j106382j067400j094937j130760j132309j039445
2729F87984765r18806q60751q25882q34107r01043r07302q37624q00491p81715p65085
$$ plain form
2749.4 679551959 678725839 677833438 677017570 676359415 675772667 675156295 674496412 673812628 673113167 672380269
2769.8 672380269 671608090 670826614 670002639 669043899 667980492 666903973 665800035 664647937 663442016
2788.2 663442016 662121654 660665393 659121215 657521307 655862272 654134154 652312458 650374472
2804.5 650374472 648351610 646266818 644096971 641861320 639595926 637258589 634804904 632247388
2820.8 632247388 629594564 626864910 624082804 621221185 618229330 615097761 611829579 608412981
2837.1 608412981 604837775 601069212 597038329 592711270 588181257 583671629 579440296 575633645
2853.4 575633645 572233498 569088459 565911889 562410116 558411717 553820014 548618913 542916656
2869.7 542916656 536852658 530523956 524075747 517805755 512045383 506991506 502728641 499299467
$$ packed form
2749.4F79551959q26120q92401q15868o58155n86748o16372o59883o83784o99461p32898
2769.8F72380269p72179p81476q23975r58740j063407j076519j103938j152098j205921
2788.2F63442016j320362j456261j544178j599908j659035j728118j821696j937986
2804.5F50374472k022862k084792k169847k235651k265394k337337k453685k557516
2820.8F32247388k652824k729654k782106k861619k991855l131569l268182l416598
2837.1F08412981l575206l768563m030883m327059m530013m509628m231333l806651
2853.4E75633645l400147l145039l176570l501773l998399m591703n201101n702257
2869.7E42916656o063998o328702o448209o269992n760372n053877m262865l429174
$$ plain form
2886.1 499299467 496702820 494834304 493523955 492584586 491791785 490964919 490020961 488897860 487521023
2904.4 487521023 485810906 483688235 481067896 477855712 473997802 469613314 465037942 460608214
2920.7 460608214 456547946 453048319 450323105 448588103 448007882 448753446 450952291 454496861 459133625
2939.1 459133625 464639157 470762640 477248996 483925432 490715474 497567385 504351795 511014223
2955.4 511014223 517640233 524221122 530593514 536591053 542133510 547252536 552062869 556674778
2971.7 556674778 561142981 565499663 569788456 573956847 577809870 581257105 584412217 587353110
2988 587353110 590025961 592319667 594185650 595690787 596865654 597697198 598216116 598402262 598202407
3006.4 598202407 597706676 597012043 596049488 594734728 593090415 591210485 589150190 586931467 584586680
$$ packed form
2886.1D99299467k596647j868516j310349r39369p92801q26866r43958j123101j376837
2904.4D87521023j710117k122671k620339l212184l857910m384488m575372m429728
2920.7D60608214m060268l499627k725214j735002n80221P45564K198845L544570M636764
2939.1D59133625N505532O123483O486356O676436O790042O851911O784410O662428
2955.4E11014223O626010O580889O372392N997539N542457N119026M810333M611909
2971.7E56674778M468203M356682M288793M168391L853023L447235L155112K940893
2988E87353110K672851K293706J865983J505137J174867Q31544N18918J86146j99855
3006.4E98202407m95731o94633r62555j314760j644313j879930k060295k218723k344787
$$ plain form
3024.7 584586680 582120776 579566240 576975465 574328125 571527421 568579972 565645218 562721670
3041.1 562721670 559664965 556462169 553214788 550008893 546784520 543485761 540184617 536877692
3057.4 536877692 533536911 530231893 527006090 523811400 520532548 517120361 513700187 510398984
3073.7 510398984 507255077 504164577 500900030 497479677 494078398 490712821 487382114 484078318
3090 484078318 480696261 477247238 473927826 470815182 467699051 464400232 461082518 457956374 454921693
3108.4 454921693 451787323 448665410 445728600 442845523 439836174 436635435 433316499 430090517
3124.7 430090517 427059621 424138308 421185553 418156177 415199608 412422210 409656376 406732321
3141 406732321 403767914 400931090 398214579 395630747 393159777 390580088 387801260 385024875 382370532
$$ packed form
3024.7E84586680k465904k554536k590775k647340k800704k947449k934754k923548
3041.1E62721670l056705l202796l247381l205895l224373l298759l301144l306925
3057.4E36877692l340781l305018l225803l194690l278852l412187l420174l301203
3073.7E10398984l143907l090500l264547l420353l401279l365577l330707l303796
3090D84078318l382057l449023l319412l112644l116131l298819l317714l126144l034681
3108.4D54921693l134370l121913k936810k883077l009349l200739l318936l225982
3124.7D30090517l030896k921313k952755l029376k956569k777398k765834k924055
3141D06732321k964407k836824k716511k583832k470970k579689k778828k776385k654343
$$ plain form
3159.4 382370532 379802972 377298325 374809504 372335821 369937539 367601037 365292758 363030672
3175.7 363030672 360795856 358546972 356320977 354170918 352076262 350003839 347942114 345890671
3192 345890671 343865722 341882557 339958578 338111460 336324394 334538937 332737476 330927193 329159200
3210.3 329159200 327501863 325892657 324282050 322708726 321160287 319607943 318102151 316690028
3226.7 316690028 315350533 314083636 312836856 311435103 309911102 308501869 307231337 306034833
3243 306034833 304944009 303854257 302625746 301411241 300393552 299429566 298338681 297212571 296168327
3261.3 296168327 295189232 294291437 293535411 292880923 292124361 291146904 290062755 289044052 288182348
3279.7 288182348 287414283 286636561 285845786 285104036 284462690 283833474 283098578 282276332 281402618 280544579
$$ packed form
3159.4C82370532k567560k504647k488821k473683k398282k336502k308279k262086
3175.7C63030672k234816k248884k225995k150059k094656k072423k061725k051443
3192C45890671k024949j983165j923979j847118j787066j785457j801461j810283j767993
3210.3C29159200j657337j609206j610607j573324j548439j552344j505792j412123
3226.7C16690028j339495j266897j246780j401753j524001j409233j270532j196504
3243C06034833j090824j089752j228511j214505j017689r63986j090885j126110j044244
3261.3B96168327r79095q97795p56026o54488p56562r77457j084149j018703q61704
3279.7B88182348p68065p77722p90775p41750o41346o29216p34896q22246q73714q58039
$$ plain form
3300.1 280544579 279859304 279388189 278883636 278085530 277034611 275943458 274981230 274154603 273367673
3318.4 273367673 272596449 271883726 271184564 270354748 269413143 268542141 267789572 267139494 266570210 265883178
3338.8 265883178 264973670 263998389 263061166 262284338 261751592 261123359 260151088 259128541 258349299
3357.2 258349299 257731229 257047623 256351203 255884737 255493909 254797280 253789395 252822608 252118886
3375.5 252118886 251556963 250991464 250363469 249730349 249259710 249083668 249139845 249015138 248464152 247900873
3395.9 247900873 247772545 247815818 247481450 246856555 246446088 246307567 246204644 246060044 245811597 245488733
3416.3 245488733 245326951 245331883 245308891 245329455 245570362 245952740 246250942 246562243 246996298 247231275
3436.7 247231275 247127518 247026965 247212112 247629076 248071164 248439759 248834461 249323234 249901086 250585258
$$ packed form
3300.1B80544579o85275m71115n04553p98106j050919j091153r62228q26627p86930
3318.4B73367673p71224p12723o99162q29816r41605q71002p52569o50078n69284o87032
3338.8B65883178r09508r75281r37223p76828n32746o28233r72271j022547p79242
3357.2B58349299o18070o83606o96420m66466l90828o96629j007885r66787p03722
3375.5B52118886n61923n65499o27995o33120m70639j76042N6177j24707n50986n63279
3395.9B47900873j28328M3273l34368o24895m10467j38521j02923j44600k48447l22864
3416.3B45488733j61782M932k2992K0564K40907L82378K98202L11301M34055K34977
3436.7B47231275j03757j00553J85147M16964M42088L68595L94702M88773N77852O84172
$$ plain form
3457.1 250585258 251321584 251938611 252564728 253524214 254623920 255358249 255681485 256028205 256677419
3475.5 256677419 257650137 258651644 259333611 259949833 260814279 261702776 262515306 263448954 264466852
3493.8 264466852 265508682 266566694 267606080 268594921 269429535 270197362 271099329 272162914 273369610
3512.2 273369610 274539471 275490701 276443154 277672380 279093981 280303210 281209826 282139540 283292413
3530.6 283292413 284691364 286254048 287708968 289003581 290513366 292278737 293895006 295178890
3546.9 295178890 296510547 298070759 299712718 301481992 303460449 305655241 307954073 310111433
3563.2 310111433 312074870 314278722 316944599 319648713 322245777 324965209 327910930 331110120
3579.5 331110120 334550053 338022858 341257900 344321430 347681731 351224273 354751498 358458757
$$ packed form
3457.1B50585258P36326O17027O26117R59486J099706P34329L23236L46720O49214
3475.5B56677419R72718J001507O81967O16222Q64446Q88497Q12530R33648J017898
3493.8B64466852J041830J058012J039386R88841Q34614P67827R01967J063585J206696
3512.2B73369610J169861R51230R52453J229226J421601J209229R06616R29714J152873
3530.6B83292413J398951J562684J454920J294613J509785J765371J616269J283884
3546.9B95178890J331657J560212J641959J769274J978457K194792K298832K157360
3563.2C10111433J963437K203852K665877K704114K597064K719432K945721L199190
3579.5C31110120L439933L472805L235042L063530L360301L542542L527225L707259
$$ plain form
3595.8 358458757 362414986 366384357 370328218 374296695 378131777 381975412 386041820 390239537
3612.1 390239537 394564360 398833632 403013796 407529354 412069708 416221499 419983655 423876584
3628.5 423876584 428527713 433186859 437627405 441997230 446287781 450611055 454985291 459229797
3644.8 459229797 463351965 467789859 472523034 476844639 480889171 485290051 489748776 493726075
3661.1 493726075 497482777 501351237 505115211 508751750 512588620 516109288 519315422 522834182
3677.4 522834182 526329279 529643595 532982826 536367655 539648831 542467594 544956028 547496438
3693.7 547496438 550063908 552544415 554834068 557021618 559315324 561648667 563818455 565667450
3710 565667450 567377031 569425344 571630955 573687851 575533211 577270269 578933120 580568850 582408607
$$ packed form
3595.8C58458757L956229L969371L943861L968477L835082L843635M066408M197717
3612.1C90239537M324823M269272M180164M515558M540354M151791L762156L892929
3628.5D23876584M651129M659146M440546M369825M290551M323274M374236M244506
3644.8D59229797M122168M437894M733175M321605M044532M400880M458725L977299
3661.1D93726075L756702L868460L763974L636539L836870L520668L206134L518760
3677.4E22834182L495097L314316L339231L384829L281176K818763K488434K540410
3693.7E47496438K567470K480507K289653K187550K293706K333343K169788J848995
3710E65667450J709581K048313K205611K056896J845360J737058J662851J635730J839757
$$ plain form
3728.4 582408607 584305942 585991859 587371171 588737249 590316594 591750741 592617452 593378544 594831228
3746.7 594831228 596138418 597003639 598263562 599903226 601312697 602395236 603576720 604892612
3763.1 604892612 606119812 607265770 608300805 609348178 610534012 611739755 612890840 613937855
3779.4 613937855 614921808 615826488 616691411 617662072 618706405 619756341 620735466 621653199 622655451
3797.7 622655451 623508334 624208570 625105262 625809729 626434684 627443254 628623009 629549205 630230367
3816.1 630230367 631040514 631687641 632325292 633203447 633959770 634630024 635325372 636137307 637126863 637881041
3836.5 637881041 638251603 638761640 639450014 640210390 641077399 641895592 642298102 642078042 642346859 643411458
3856.9 643411458 644376516 645056844 645539463 646073759 646639347 647000849 647381067 647859216 648443401 649126410
$$ packed form
3728.4E82408607J897335J685917J379312J366078J579345J434147Q66711P61092J452684
3746.7E94831228J307190Q65221J259923J639664J409471J082539J181484J315892
3763.1F04892612J227200J145958J035035J047373J185834J205743J151085J047015
3779.4F13937855R83953R04680Q64923R70661J044333J049936R79125R17733J002252
3797.7F22655451Q52883P00236Q96692P04467O24955J008570J179755R26196O81162
3816.1F30230367Q10147O47127O37651Q78155P56323O70254O95348Q11935R89556P54178
3836.5F37881041L70562N10037O88374P60376Q67009Q18193M02510k20060K68817J064599
3856.9F43411458R65058O80328M82619N34296N65588L61502L80218M78149N84185O83009
$$ plain form
3877.3 649126410 649647593 650176167 650758386 651203394 651727378 652209878 652494788 652904928 653464198 653895199
3897.7 653895199 654181361 654436171 654695392 655097783 655597389 656026900 656412840 656806409 657133102 657351375
3918.1 657351375 657534242 657710850 657933533 658296466 658712983 659035921 659301639 659585178 659859419 660137236
3938.5 660137236 660420954 660679042 660927892 661157489 661368251 661616564 661900163 662148476 662361801 662589610
3958.9 662589610 662797809 662993729 663259566 663630724 663995326 664187968 664286792 664477050 664740086 664965928
3979.3 664965928 665202916 665471733 665676951 665818870 665934026 666082919 666351259 666656673 666843116
3997.6 666843116
$$ packed form
3877.3F49126410N21183N28574N82219M45008N23984M82500K84910M10140N59270M31001
3897.7F53895199K86162K54810K59221M02391M99606M29511L85940L93569L26693K18273
3918.1F57351375J82867J76608K22683L62933M16517L22938K65718K83539K74241K77817
3938.5F60137236K83718K58088K48850K29597K10762K48313K83599K48313K13325K27809
3958.9F62589610K08199J95920K65837L71158L64602J92642R8824J90258K63036K25842
3979.3F64965928K36988K68817K05218J41919J15156J48893K68340L05414J86443
3997.6F66843116
##END=$$ End of the data block
