##TITLE=$$ Begin of the data block
##JCAMP-DX=5.00 $$ ACD/SpecManager v 10.08
##SPECTROMETER/DATA SYSTEM=Alpha
##DATE=23 Dec 2014 14:28:26
##DATA TYPE=INFRARED SPECTRUM
##DATA CLASS=XYDATA
##ORIGIN=
##OWNER=
##NPOINTS=1765
##FIRSTX=399.76428223
##LASTX=3997.64306641
##MAXX=3997.64306641
##MINX=399.76428223
##MAXY=0.82805568
##MINY=0.17304754
##XFACTOR=1.0000000000
##YFACTOR=1.000000000000000e-9
##FIRSTY=0.50753891
##DELTAX=2.03961372
##XUNITS=1/CM
##YUNITS=ARBITRARY UNITS
##XYDATA=(X++(Y..Y))
399.8E07538915o032825n024552l494442j214772R90659K476483K516449J381040R3042
$$ 507538915 501506090 496481538 492987096 491772324 492762983 495239466 497755915 499136955 499229997
418.1D99229997j381546j875013k181470l216029l753215l689766l478586k951473
$$ 499229997 497848451 495973438 493791968 490575939 486822724 483132958 479654372 476702899
434.4D76702899j986355k62052J998335L845215M812271M891991M122794L019899J914054
$$ 476702899 474716544 474454492 476452827 480298042 485110313 490002304 494125098 497144997 499059051
452.8D99059051Q51929k31236j514345j999974j966715k437353l244341l706038l956139
$$ 499059051 499910980 499679744 498165399 496165425 494198710 491761357 488517016 484810978 480854839
471.2D80854839l996223l199339k316952j828521j399011r25958m11719k3484j7613
$$ 480854839 476858616 473659277 471342325 469513804 468114793 467188835 466777116 466753632 466736019
489.5D66736019m31955j165122j909077k233893k113700k102732k388120k861738l530860
$$ 466736019 466304064 465138942 463229865 460995972 458882272 456779540 454391420 451529682 447998822
507.9D47998822l925294m138321m490912m851937n104840m904926m196137l237962
$$ 447998822 444073528 439935207 435444295 430592358 425487518 420582592 416386455 413148493
524.2D13148493k104044q66324J83642J100093K265006L866464N443722O171703N664796
$$ 413148493 411044449 410178125 410361767 411461860 413726866 417593330 423037052 429208755 434873551
542.5D34873551M167199K310246N93007q35687j886695k588362l232449m067123n006671
$$ 434873551 439040750 441350996 441944003 441108316 439221621 436633259 433400810 429333687 424327016
560.9D24327016o043851p152588q006841q129328o941915m409253j409620J381665
$$ 424327016 418283165 411130577 403123736 394994408 388052493 383643240 382233620 383615285
577.2C83615285L948808O247371P846296Q274645P621169O104618M070610K137154
$$ 383615285 387564093 393811464 401657760 409932405 417553574 423658192 427728802 429865956
593.5D29865956P85798J13815m5717j11252k80022k68877P2569O50704J365810K128214
$$ 429865956 430651754 430765569 430719852 430608600 430328578 430059701 430132270 430782974 432148784 434276998
613.9D34276998K771765L243536L677428M121452M407466M432350M198402L594250
$$ 434276998 437048763 440292299 443969727 448091179 452498645 456930995 461129397 464723647
630.2D64723647K837836K235920J875639J785636J806467J648128J281202R99004R33915
$$ 464723647 467561483 469797403 471673042 473458678 475265145 476913273 478194475 479193479 480127394
648.6D80127394J027584J321972J546025J392007J062602P64519O78479J092524K189070
$$ 480127394 481154978 482476950 484022975 485414982 486477584 487242103 487920582 489013106 491202176
667D91202176K548188J128435Q34137J213044J578331J983970K176941J898944J211882
$$ 491202176 493750364 494878799 495712936 496925980 498504311 500488281 502665222 504564166 505776048
685.3E05776048M50551o3717l16262n94974j180768k286851l611178m312574l952980
$$ 505776048 506226599 506162882 505846620 505251646 504070878 501784027 498172849 493860275 489907295
703.7D89907295k819419j286596K60531J490981K571553L793448N137533O417811P189870
$$ 489907295 487087876 485801280 486061811 487552792 490124345 493917793 499055326 505473137 512663007
722E12663007P247269O801128O068230N430043N070090M764199M175902L013372J408816
$$ 512663007 519910276 526711404 532779634 538209677 543279767 548043966 552219868 555233240 556642056
740.4E56642056j23799j215995k018809k904058m060864n293786o194711o359577n674065
$$ 556642056 556518257 555302262 553283453 550379395 546318531 541024745 534830034 528470457 522796392
758.7E22796392m370272k745628j058102P82252L065288N692661Q240997J0244012
$$ 522796392 518426120 515680492 514622390 515404642 518469930 524162591 532403588 542647600
775.1E42647600J1159539J0676027R187639P550418O462932N973756N600929N001009
$$ 542647600 553807139 564483166 573670805 581221223 587684155 593657911 599258840 604259849
791.4F04259849M349649M021287M319310N070448N609452N374372M287243K897144
$$ 604259849 608609498 612630785 616950095 622020543 627629995 633004367 637291610 640188754
807.7F40188754J888334J616359J847863J919866J350224K00212j095831k093196k686143
$$ 640188754 642077088 643693447 645541310 647461176 648811400 649011612 647915781 645822585 643136442
826F43136442l168404l966332n227268o520927p172644o848216n887627m956365m470170
$$ 643136442 639968038 636001706 630774438 624253511 617080867 610232651 604345024 599388659 594918489
844.4E94918489m411935m577577m765749m864157m984796n222559m926562k723455
$$ 594918489 590506554 585928977 581163228 576299071 571314275 566091716 561165154 558441699
860.7E58441699J774191P000864J1179924J3888478J5015245J4015138J1030555P193267
$$ 558441699 560215890 567216754 578396678 592285156 607300401 621315539 632346094 639539361
877F39539361L534675M04656k302230m698455o606221p730127p852494p132054o129682
$$ 639539361 643074036 643478692 641176462 636478007 629871786 622141659 614289165 607157111 601027429
895.4F01027429n398750n317331n855083o626487p411301q247912r246766j0461271
$$ 601027429 595628679 590311348 584456265 577829778 570418477 562170565 552923799 542462528
911.7E42462528j1697471j2456179j2105525j0344326p574022m700243k490104j055389
$$ 542462528 530765057 518308878 506203353 495859027 488285005 483584762 481094658 480039269
928D80039269M6015J324981K867848M342407N502849O308943O376327M859507J436948
$$ 480039269 480085284 481410265 484278113 488620520 494123369 500432312 506808639 511668146 513105094
946.4E13105094l062307p508159j1283934j4172614j6210794j7627418j8617243j9360483
$$ 513105094 510042787 502534628 491250694 477078080 460867286 443239868 424622625 405262142
962.7D05262142k0081609k0849168k1505535k1893352k1978855k1625281k0635098
$$ 405262142 385180533 364331365 342825830 320932478 298953623 277328342 256693244
977B56693244j9028544j6841978j4151395j1266395q500904o041303l949553k261564
$$ 256693244 237664700 220822722 206671327 195404932 186904028 180862725 176913172 174651608
993.3A74651608r81659p3671M80741P11337O79329L69474j78173o98850r28521p56338
$$ 174651608 173669949 173596278 174077019 174788356 175467685 175837159 175658986 174960136 174031615 173275277
1013.7A73275277k27734N45546J370445K096474K755359L371045L797933L951252L869533
$$ 173275277 173047543 173593089 174963534 177060008 179815367 183186412 186984345 190935597 194805130
1032A94805130L466204K686784J726776R70021O52269P65890J149922J746759K726704
$$ 194805130 198271334 200958118 202684894 203654915 204307184 205073074 206222996 207969755 210696459
1050.4B10696459M151687N753994P193982Q488447R818733J1098966J1427372R126425
$$ 210696459 214848146 220602140 227796122 236284569 246103302 257202268 268629640 277756065
1066.7B77756065L103376n079806j1219710j2229860r030953m668489j062796J525000
$$ 277756065 280859441 275779635 264559925 252330065 243299112 238630623 237567827 239092827
1083B39092827L409788M808158N878493O703585P084251O697267N477518L776073K128810
$$ 239092827 242502615 247310773 253189266 259892851 266977102 273674369 279151887 282927960 285056770
1101.4B85056770J128048J179188K170712L495246M490823M844963M624188L991902
$$ 285056770 286184818 287364006 289534718 293029964 297520787 302365750 306989938 310981840
1117.7C10981840L106892K298743J937478K317161L405392M634738N066573L960848
$$ 310981840 314088732 316387475 318324953 320642114 324047506 328682244 333748817 337709665
1134C37709665J324058k214581n680591q149296r267509r258985q469999p126630n397111
$$ 337709665 339033723 336819142 331138551 322989255 313721746 304462761 295992762 288866132 283469021
1152.4B83469021l518283j659036J76549K017766L957302O113291Q456856J0777652
$$ 283469021 279950738 278291702 278468251 280486017 284443319 290556610 299013466 309791118
1168.7C09791118J2879699J4575094J5704573J6239851J6300738J5999198J5352279
$$ 309791118 322670817 337245911 352950484 369190335 385491073 401490271 416842550
1183D16842550J4369965J2973785J1101604Q825838O396592M257172K808839K100617
$$ 416842550 431212515 444186300 455287904 464113742 470510334 474767506 477576345 479676962
1199.3D79676962J890272J988381K347916K965838L853142M896164N729079N991161
$$ 479676962 481567234 483555615 485903531 488869369 492722511 497618675 503347754 509338915
1215.6E09338915N509079M339397K796888J228035r9063j047015j695157k139985k361834
$$ 509338915 514847994 519187391 521984279 523212314 523113251 522066236 520371079 518231094 515869260
1234E15869260k338827k076030j576721q51155L3260R02355J601517K102911K424300
$$ 515869260 513530433 511454403 509877682 509026527 509059787 509962142 511563659 513666570 516090870
1252.3E16090870K498448K236068J720011J205743J006305J284361J894951K476453
$$ 516090870 518589318 520825386 522545397 523751140 524757445 526041806 527936757 530413210
1268.6E30413210K609075K102494J169324K05815m97282q65817r86874j041532j188159
$$ 530413210 533022285 535124779 536294103 536499918 536002636 535136819 534149945 533108413 531920254
1287E31920254j421869j627147j785934j996815k249479k409935k422989k345621k282202
$$ 531920254 530498385 528871238 527085304 525088489 522839010 520429075 518006086 515660465 513378263
1305.4E13378263k219379j983703j606643j370311j374602j548469j877069k427638
$$ 513378263 511158884 509175181 507568538 506198227 504823625 503275156 501398087 498970449
1321.7D98970449l348649m615724n830407o479293o332487n481273m191428k808154
$$ 498970449 495621800 491006076 485175669 478696376 472363889 466882616 462691188 459883034
1338D59883034j531631m50015K50876N33522M70072J74731j69367n30690q88139j131415
$$ 459883034 458351403 457901388 458152264 458685786 459155858 459330589 459161222 458630532 457742393 456610978
1358.4D56610978j263321j349747j140475p24256l96997M4018O07073J061768J229465
$$ 456610978 455347657 453997910 452857435 452133179 451736182 451780200 452387273 453449041 454678506
1376.7D54678506J275450J425415J943082L030359M420698M820675L876775K745688
$$ 454678506 455953956 457379371 459322453 462352812 466773510 471594185 475470960 478216648
1393.1D78216648J453906P1824r69231j410127j521319j828372k011359k048105k143949
$$ 478216648 479670554 479742378 478773147 477363020 475841701 474013329 472001970 469953865 467809916
1411.4D67809916j948834j396775j029015q52227k51710M21851Q49724J200676J540989
$$ 467809916 465861082 464464307 463435292 462583065 462331355 462753206 463602930 464803606 466344595
1429.8D66344595J831204K047211K350092K435535K106875J993328J794309J296162
$$ 466344595 468175799 470223010 472573102 475008637 477115512 479108840 480903149 482199311
1446.1D82199311M57913m12464q87513j079560j831472k394497o75231J101672K847135
$$ 482199311 482657224 482244760 481357247 480277687 478446215 476051718 475376487 476478159 479325294
1464.5D79325294M570067N767107P815659J1386455J2202084J0409712R350837Q917272
$$ 479325294 483895361 489662468 497478127 508864582 521066666 531476378 540827215 549744487
1480.8E49744487Q581698P738769P276892P308066O745637N345464M917383N244612
$$ 549744487 558326185 566064954 573341846 580649912 587395549 592741013 597658396 602903008
1497.1F02903008M639447L761828L402293L834009M402876L010750K126932K185702
$$ 602903008 607542455 611304283 614706576 618540585 622943461 625954211 628081143 630266845
1513.4F30266845K348304K492964K413750K371550J925587J388192J191378J120567
$$ 630266845 632615149 635108113 637521863 639893413 641819000 643207192 644398570 645519137
1529.7F45519137J256228J234889J099646J148224Q56876j89423m04418r0420J38163
$$ 645519137 646775365 648010254 649109900 650258124 651115000 650925577 650521159 650430739 650568902
1548.1F50568902J30773K3604L4153J35839l77297j439989p48694l99590n06818p47800
$$ 650568902 650699675 650723279 650757432 650893271 650515974 649075985 648327291 647927701 647420883 646673083
1568.5F46673083j039207n99742k75910q41319j191735j077414j210034j267969j245082
$$ 646673083 645633876 645034134 644758224 643916905 642725170 641647756 640437722 639169753 637924671
1586.8F37924671j315713j594007j993894k411604k629459k642989k753973l000856
$$ 637924671 636608958 635014951 633021057 630609453 627979994 625337005 622583032 619582176
1603.2F19582176l321051l757894m282475m317820l832042m136741n255998m379332
$$ 619582176 616261125 612503231 608220756 603902936 600070894 595934153 590678155 586298823
1619.5E86298823l697812m498780m409671l879070l589928k718449k265870l107191
$$ 586298823 582601011 578102231 573692560 569813490 566223562 563505113 561239243 558132052
1635.8E58132052k820015j317441l71456L01719P48634J000166J284420K050042L047646
$$ 558132052 555312037 553994596 553623140 553924859 554673493 555673659 556958079 559008121 562055767
1654.1E62055767K859473L058672L747105M405797M598796M455090N320966O288409
$$ 562055767 564915240 567973912 571721017 576126814 580725610 585180700 590501666 596790075
1670.5E96790075N561471N492986N837321N358755N307317O236553P618428O112992
$$ 596790075 602351546 607844532 613681853 619040608 624347925 630584478 638202906 644315898
1686.8F44315898M820943M941345M678905N179405N608022M869044M392445L234744
$$ 644315898 649136841 654078186 658757091 663936496 669544518 674413562 678806007 682040751
1703.1F82040751K689600K820790K752244K794802K782584K567231K071798J347542
$$ 682040751 684730351 687551141 690303385 693098187 695880771 698448002 700519800 701867342
1719.4G01867342J250744J660049K085328K170741K101362J992584K079188K044082
$$ 701867342 703118086 704778135 706863463 709034204 711135566 713128150 715207338 717251420
1735.7G17251420J936674K161086K182066K103448K299309K715170L189981L261686
$$ 717251420 719188094 721349180 723531246 725634694 727934003 730649173 733839154 737100840
1752G37100840K843141K630472K490223K319753K444506K344131K111614J955688J684666
$$ 737100840 739943981 742574453 745064676 747384429 749828935 752173066 754284680 756240368 757925034
1770.4G57925034J355409J141608J224995J430630J396716J067996P96020Q03471J070499
$$ 757925034 759280443 760422051 761647046 763077676 764474392 765542388 766338408 767141879 768212378
1788.8G68212378J374245J390099R74059O94096O65963P59184R09150J017690J033425
$$ 768212378 769586623 770976722 771950781 772644877 773310840 774070024 774979174 775996864 777030289
1807.1G77030289Q74043N83887M29570O08743Q82387R85622Q68380O60301M94420M94003
$$ 777030289 777904332 778488219 778917789 779526532 780408919 781394541 782262921 782923222 783417642 783911645
1827.5G83911645O33002O69420O08623M81724K73168J83463L33727N33521N18799L27766
$$ 783911645 784544647 785214067 785822690 786304414 786577582 786761045 787094772 787628293 788147092 788474858
1847.9G88474858J37627k801r895J85549M09127M58419L27408J91391J60515J60456
$$ 788474858 788612485 788609684 788599789 788785338 789194465 789652884 789980292 790171683 790332198 790492654
1868.3G90492654J92880L27409M05371K90513J47462J42574L00884N29111O48737N29408
$$ 790492654 790685534 791012943 791418314 791708827 791856289 791998863 792299747 792828858 793477595 794007003
1888.7G94007003K29657M0352R7514K70903L92258L81827K05219o080p1823K0146J60694
$$ 794007003 794236660 794277012 794374526 794645429 795037687 795419514 795624733 795618653 795546830 795566976 795727670
1911.1G95727670K67089K89201J53423j1266j3589R9420K37823K94268J81615N96p4804
$$ 795727670 795994759 796283960 796437383 796426117 796412528 796511948 796749771 797044039 797225654 797226250 797151446
1933.6G97151446J4663J99974L26097K87652R0360o1512j8477J45316K98440L64662
$$ 797151446 797166109 797366083 797692180 797979832 798070192 798008680 797990203 798135519 798433959 798798621
1954G98798621L02970J44839M0710R8050K72691L66092K57194Q5056R775K5690J12772
$$ 798798621 799101591 799246430 799287140 799385190 799657881 800023973 800281167 800366223 800375998 800401688 800514460
1976.4H00514460K15888K22623J38462K6524l4035M709R8884J23680N8889k6762j33515
$$ 800514460 800730348 800952971 801091433 801117957 801083922 801088631 801187515 801311195 801370084 801343322 801209807
1998.8H01209807j72257q8573k2769q2850k03073l14653l70562l69251l73840m18484
$$ 801209807 801037550 800948977 800926208 800843358 800640285 800325632 799955070 799585819 799211979 798793495
2019.2G98793495n24223o94871p23720m33385j94013k46942l65734m42505m90546n09620
$$ 798793495 798269272 797574401 796850681 796417296 796223283 795976341 795610607 795168102 794677556 794167936
2039.6G94167936m68791l43680k22683k05874k34783k35439k03788j25646j3948O0201
$$ 794167936 793699145 793355465 793132782 792926908 792692125 792456686 792252898 792127252 792113304 792173505
2060G92173505O3777M6909L0875L6061O9379R1076O8963J9431j4424r835L8445R9063
$$ 792173505 792237282 792284191 792315066 792351127 792420506 792511582 792580545 792599976 792585552 792575717 792614162 792713225
2084.5G92713225J37925J36495R9301P3552J05918J50323J73032J92880K00212J81973
$$ 792713225 792851150 792987645 793086946 793160498 793266416 793416739 793589771 793782651 793982863 794164836
2104.9G94164836J36257J13427J25349J18792Q8692N3942L1173M0054M8876L1054P153
$$ 794164836 794301093 794414520 794539869 794658661 794747353 794801295 794832468 794872522 794921398 794952452 794959605
2127.3G94959605j0193k1219j4543K8669P7248Q2314L3796j4603o259M3035R4771J15454
$$ 794959605 794949412 794928193 794913650 794942319 795019567 795101881 795135677 795121074 795114815 795157850 795252621 795368075
2151.8G95368075R6798Q3864J53065K69413L41773L74496L91543M01318M35591M86254
$$ 795368075 795464873 795548737 795701802 795971215 796312988 796687484 797079027 797480345 797915936 798402190
2172.2G98402190N22852N57125N71191N42343N05090M82141M67360M94063N42343N25713
$$ 798402190 798925042 799482167 800053358 800595701 801100791 801582932 802050292 802544355 803086698 803612411
2192.6H03612411M41253L58880L49700M05610M63605M89056M70519M38631M27961M21047
$$ 803612411 804053664 804412544 804762244 805167854 805631459 806120515 806591034 807029665 807457626 807878673
2213H07878673M31597M65870M62234M08888L33905L11375L59297L88741L83199L44753
$$ 807878673 808310270 808776140 809238374 809647262 809981167 810292542 810651839 811040580 811423779 811768532
2233.4H11768532K47776J68681J91510K70069L13639K92421K36273J81794J79529K37167
$$ 811768532 812016308 812184989 812376499 812646568 812960207 813252628 813488901 813670695 813850224 814087391
2253.8H14087391K94685L10481K76685K30431K22743K58863K84791K94804K89083J97768
$$ 814087391 814382076 814692557 814969242 815199673 815422416 815681279 815966070 816260874 816549957 816747725
2274.2H16747725R5129J27494K23577K78354L11136K86877K02954J77324K53797L27050
$$ 816747725 816842854 816970348 817193925 817472279 817783415 818070292 818273246 818450570 818704367 819031417
2294.6H19031417L20733L07500K97726K55644K69532M06563N48423N34057L95000L24250
$$ 819031417 819352150 819659650 819957376 820213020 820482552 820889115 821437538 821971595 822366595 822690845
2315H22690845M45961O45996P06076N68927M03702L61025L50416K01642j4782l7431
$$ 822690845 823136806 823782802 824488878 825057805 825461507 825822532 826172948 826374590 826359808 826322377
2335.4H26322377J16288J33217q3864n11765j168013j194000k24948R30071J481831
$$ 826322377 826438665 826571882 826488018 825976253 824808240 823614240 823389292 824319363 825801194
2353.7H25801194J291811Q06391J56284l70801o50942r70364j336693j580596j598478
$$ 825801194 827093005 827899396 828055680 827684879 827033937 826063573 824726880 823146284 821547806
2372.1H21547806j369238j189768j189053j151919r89199p75516n38468l12269k21133
$$ 821547806 820178568 818988800 817799747 816647828 815658629 814883113 814344645 814032376 813811243
2390.4H13811243k51711k80380k85268k69890k34246k32816k92778l68237m17114m32372
$$ 813811243 813559532 813279152 812993884 812723994 812489748 812256932 811964154 811595917 811178803 810746431
2410.8H10746431m28617m05311m20213n04434n91457o18637n75602n36561n29766n43475
$$ 810746431 810317814 809912503 809492290 808987856 808396399 807777762 807202160 806665599 806135833 805592358
2431.2H05592358o01113o57558o62208o36518o13391o21915o56843o97196p34329p06494
$$ 805592358 804991245 804333687 803671479 803034961 802421570 801799655 801142812 800445616 799711287 799004793
2451.6G99004793n99325n50389o15120o61313o43254o00814n65768n51462n27680n51045
$$ 799004793 798405468 797855079 797239959 796578646 795935392 795334578 794768810 794217348 793689668 793138623
2472G93138623n98609n79179n47528n23507m74930m56214m81546m84586m42624l94165
$$ 793138623 792540014 791960835 791413307 790889800 790414870 789958656 789477110 788992524 788549900 788155735
2492.4G88155735l76821l91960l90053l47733l35098l32117k93314k88904l26812l63767
$$ 788155735 787778914 787386954 786996901 786649168 786314070 785981953 785688639 785399735 785072923 784709156
2512.8G84709156l82901l85105l76165l81589m53890n57184o01887n98968n76376n70953
$$ 784709156 784326255 783941150 783564985 783183396 782729506 782172322 781570435 780971467 780395091 779824138
2533.2G79824138o59108p54536p50184p14361o98388o83486o69718o93083p46429p63178
$$ 779824138 779165030 778410494 777660310 776945949 776247561 775564075 774894357 774201274 773454845 772691667
2553.6G72691667p19666o69480o65664o88673p16090p41958p25150o47307n47230n23746
$$ 772691667 771972001 771302521 770636857 769948184 769232094 768490136 767764986 767117679 766570449 766046703
2574G66046703o24716p16985o94513o28054n79775n15401m55141n01573n90265n67436
$$ 766046703 765421987 764705002 764010489 763382435 762802660 762287259 761832118 761330545 760740280 760172844
2594.4G60172844m60088l65615l68953m77314n68926o15537o58632o70254o87063p80761
$$ 760172844 759712756 759347141 758978188 758500874 757931948 757316411 756657779 755987525 755300462 754519701
2614.8G54519701q97169r99928j076817j051605r95755j048625j160323j272261j378954
$$ 754519701 753622532 752622604 751545787 750494182 749498427 748449802 747289479 746017218 744638264
2633.2G44638264j391589j310111j234352j232028j335383j420736j390576j330376
$$ 744638264 743246675 741936564 740702212 739470184 738134801 736714065 735323489 733993113
2649.5G33993113j256108j174689j200258j281858j307547j277447j198172j143396
$$ 733993113 732737005 731562316 730362058 729080200 727772653 726495206 725297034 724153638
2665.8G24153638j135469j142680j168430j153350j083493j000881r36449r51230j027644
$$ 724153638 723018169 721875489 720707059 719553709 718470216 717469335 716532886 715581656 714554012
2684.1G14554012j076579j069308j016378r90868j029312j081348j137972j218736
$$ 714554012 713477433 712408125 711391747 710400879 709371567 708290219 707152247 705933511
2700.5G05933511j289785j257538j184047j205861j287818j339913j314520j221955
$$ 705933511 704643726 703386188 702202141 700996280 699708462 698368549 697054029 695832074
2716.8F95832074j111389j060903j090824j119912j101434j031339r33469q47756p79331
$$ 695832074 694720685 693659782 692568958 691449046 690347612 689316273 688382804 687535048 686755717
2735.1F86755717q03590r07421r21726q60870q30293q06034p96020q40365q58605p74861
$$ 686755717 685952127 685044706 684122980 683262110 682431817 681625783 680829763 679989398 679130793 678355932
2755.5F78355932o56187n99265o21021o36339o33657o96123p79092p95424p91967q35061
$$ 678355932 677699745 677100480 676479459 675843120 675209463 674513340 673734248 672938824 672146857 671311796
2775.9F71311796r13561j009643j107931j164794j175284j191855j271248j420319
$$ 671311796 670398235 669388592 668280661 667115867 665940583 664748728 663477480 662057161
2792.2F62057161j568436j641512j655519j697362j779854j896441k041519k127349
$$ 662057161 660488725 658847213 657191694 655494332 653714478 651818037 649776518 647649169
2808.6F47649169k153754k193630k240062k329409k477288k594054k665996k722264
$$ 647649169 645495415 643301785 641061723 638732314 636255026 633660972 630994976 628272712
2824.9F28272712k793312k918064l043592l141761l265441l407120l565550l777445
$$ 628272712 625479400 622561336 619517744 616375983 613110542 609703422 606137872 602360427
2841.2F02360427m039764m333258m545748m531324m271030l820598l341258l095508
$$ 602360427 598320663 593987405 589441657 584910333 580639303 576818705 573477447 570381939
2857.5E70381939l206729l560067m036903m621029n227447n708277o068825o379962
$$ 570381939 567175210 563615143 559578240 554957211 549729764 544021487 537952662 531572700
2873.8E31572700o526232o319344n766928n034268m235030l425836k648175j928002
$$ 531572700 525046468 518727124 512960196 507925928 503690898 500265062 497616887 495688885
2890.1D95688885j326531r15765p57337q28326r84102j139343j350105j703888k149254
$$ 495688885 494362354 493446589 492689252 491860926 490876824 489737481 488387376 486683488 484534234
2908.5D84534234k632797l241897l914266m375071m519939m456282m162758l569484
$$ 484534234 481901437 478659540 474745274 470370203 465850264 461393982 457231224 453661740
2924.8D53661740k725691j694858n17905P83295K181619L540486M682243N551487O138236
$$ 453661740 450936049 449241191 448723286 449506581 451688200 455228686 459910929 465462416 471600652
2943.2D71600652O471455O649375O771952O853223O813556O702959O652594O600678
$$ 471600652 478072107 484721482 491493434 498346657 505160213 511863172 518515766 525116444
2959.5E25116444O395101O017089N577803N191445M865646M625977M497230M410743
$$ 525116444 531511545 537528634 543106437 548297882 553163528 557789505 562286735 566697478
2975.8E66697478M351378M207015L858030L483534L225445K976537K670884K291262
$$ 566697478 571048856 575255871 579113901 582597435 585822880 588799417 591470301 593761563
2992.1E93761563J872063J542509J255571R01759N15521J28507k04146m24444o36280
$$ 593761563 595633626 597176135 598431706 599333465 599848986 599977493 599773347 599348903 598712623
3010.5E98712623r64820j332283j625359j869500k073050k214789k354681k482594
$$ 598712623 597747803 596415520 594790161 592920661 590847611 588632822 586278141 583795547
3026.8E83795547k531111k557695k626836k786159k956152k944589k896249l016770
$$ 583795547 581264436 578706741 576079905 573293746 570337594 567393005 564496756 561479986
3043.1E61479986l180743l262758l258586l252148l280580l283620l334046l402173
$$ 561479986 558299243 555036485 551777899 548525751 545245171 541961551 538627505 535225332
3059.4E35225332l332854l200113l150881l257036l441512l483832l357947l202856
$$ 535225332 531892478 528692365 525541484 522284448 518842936 515359104 512001157 508798301
3075.7E08798301l127277l208697l343403l403872l408969l376632l372223l418713
$$ 508798301 505671024 502462327 499118924 495715052 492306083 488929451 485557228 482138515
3092.1D82138515l388435l253430l139258l175139l310472l307164l136217l062725
$$ 482138515 478750080 475496650 472357392 469182253 465871781 462564617 459428400 456365675
3108.4D56365675l170491l140062k921909k866536k997071l198594l380626l325254
$$ 456365675 453195184 450055122 447133213 444266677 441269606 438071012 434690386 431365132
3124.7D31365132l080368k901584k923637l035218k959460k746135k746701k958238
$$ 431365132 428284764 425383180 422459543 419424325 416464865 413718730 410972029 408013791
3141D08013791l008217k876401k774477k609551k460837k595186k819836k826423k693325
$$ 408013791 405005574 402129173 399354696 396745145 394284308 391689122 388869286 386042863 383349538
3159.4C83349538k558768k472669k463311k461970k424389k366811k310693k280682
$$ 383349538 380790770 378318101 375854790 373392820 370968431 368601620 366290927 364010245
3175.7C64010245k272964k258062k229184k171666k102911k076179k087176k070456
$$ 364010245 361737281 359479219 357250035 355078369 352975458 350899279 348812103 346741647
3192C46741647j987547j935512j960188j929551j827181j773208j775176j814454j794190
$$ 346741647 344754100 342818588 340858400 338928849 337101668 335328460 333553284 331738830 329944640
3210.3C29944640j658409j577586j578391j581162j586557j576870j533985j457632
$$ 329944640 328286231 326708645 325130254 323549092 321962535 320385665 318851680 317394048
3226.7C17394048j364857j247346j197189j373947j534403j440942j303911j196712
$$ 317394048 316029191 314781845 313584656 312210709 310676306 309235364 307931453 306734741
3243C06734741j106382j173585j292676j222342j037240r69321j060009j126438j055330
$$ 306734741 305628359 304454774 303162098 301939756 300902516 299933195 298873186 297746748 296691418
3261.3B96691418r62526r01699p58529o16043p48218r99182j061708r92715q98451
$$ 296691418 295728892 294827193 294068664 293452621 292704403 291705221 290643513 289650798 288752347
3279.7B88752347q39233q25435q00788p35164o33151o07490o93202p97242q93980q71241
$$ 288752347 287913114 287087679 286286891 285551727 284918576 284311086 283617884 282820642 281926662 281055421
3300.1B81055421o43999m43458n57512q98242j122982j094997r27001p91788p44879
$$ 281055421 280411422 279967964 279410452 278512210 277389228 276294231 275367230 274575442 273830563
3318.4B73830563p44850p45773p39843q22752r32932r13203q13693o62833n28008o43313
$$ 273830563 273085713 272339940 271600097 270777345 269844413 268931210 268117517 267454684 266926676 266283363
3338.8B66283363q80718r31770q84115p75040o11871o99222r71437j027226q27372
$$ 266283363 265402645 264470875 263586760 262811720 262199849 261500627 260529190 259501964 258674592
3357.2B58674592o37621o27637o38217m78357m07099p04378j074285j034379o92755
$$ 258674592 258036971 257409334 256771117 256292760 255885661 255181283 254106998 253072619 252379864
3375.5B52379864n01483n58794o97851o76423m62577j55300Q8900q7037n45174o15359
$$ 252379864 251878381 251319587 250621736 249945313 249482736 249327436 249416336 249329299 248784125 248168766
3395.9B48168766j97365N1677k71619o36696m77299j67281q2195j22368k32324k50563
$$ 248168766 247971401 248023078 247751459 247114763 246637464 246470183 246387988 246265620 246033296 245782733
3416.3B45782733r3758m5449j08167L6046K75552L39642K44394K94715M52563K56911
$$ 245782733 245688975 245643526 245535359 245571405 245846957 246186599 246430993 246725708 247178271 247435182
3436.7B47435182j06647q2314K20373M10736M01303L69012M87298N66974N63920O73681
$$ 247435182 247328535 247246221 247466594 247877330 248278633 248647645 249134943 249701917 250265837 250939518
3457.1B50939518P46638N81205N83440R60141J100958P10010K88636L16292O76512
$$ 250939518 251686156 252267361 252850801 253810942 254911900 255621910 255910546 256226838 256903350
3475.5B56903350J055867J039326O67810O19323Q71777Q81344P81715Q75652J017719
$$ 256903350 257959217 258998543 259666353 260285676 261157453 262038797 262820512 263696164 264713883
3493.8B64713883J111776J087099J031191J007020Q45432P33465Q72523J126587J304746
$$ 264713883 265825659 266912758 267943949 268950969 269796401 270529866 271402389 272528976 273833722
3512.2B73833722J162916Q88557R42468J254499J458854J265168R42111R38326J163810
$$ 273833722 274996638 275885195 276827663 278082162 279541016 280806184 281748295 282686621 283850431
3530.6B83850431J361788J493692J447022J321703J520664J762867J617819J299471
$$ 283850431 285212219 286705911 288152933 289474636 290995300 292758167 294375986 295675457
3546.9B95675457J347005J604080J709223J808554J988828K161801K241582K149730
$$ 295675457 297022462 298626542 300335765 302144319 304133147 306294948 308536530 310686260
3563.2C10686260K020061K299846K733499K734273K655089K766669K920627L161908
$$ 310686260 312706321 315006167 317739666 320473939 323129028 325895697 328816324 331978232
3579.5C31978232L457963L533632L258735L036886L398687L633648L588855L721446
$$ 331978232 335436195 338969827 342228562 345265448 348664135 352297783 355886638 359608084
3595.8C59608084L937364L957063L970891L991335L817439L805966M008859M180104
$$ 359608084 363545448 367502511 371473402 375464737 379282176 383088142 387097001 391277105
3612.1C91277105M395544M368514M243284M492194M526257M258365L908485L895193
$$ 391277105 395672649 400041163 404284447 408776641 413302898 417561263 421469748 425364941
3628.5D25364941M537970M649788M479766M373163M305750M349113M379630M249752
$$ 425364941 429902911 434552699 439032465 443405628 447711378 452060491 456440121 460689873
3644.8D60689873M106819M415721M758239M319787M007518M367799M441887L998279
$$ 460689873 464796692 469212413 473970652 478290439 482297957 486665756 491107643 495105922
3661.1D95105922L809899L899008L738702L613770L915310L671586L291369L464877
$$ 495105922 498915821 502814829 506553531 510167301 514082611 517754197 521045566 524510443
3677.4E24510443L445566L306150L309667L362835L312826K841055K476633K574027
$$ 524510443 527956009 531262159 534571826 537934661 541247487 544088542 546565175 549139202
3693.7E49139202K606511K467572K263368K201557K350509K370715K118468J737953
$$ 549139202 551745713 554213285 556476653 558678210 561028719 563399434 565517902 567255855
3710E67255855J700699K110004K198160K060592J919568J761436J585365J579225J868784
$$ 567255855 568956554 571066558 573264718 575325310 577244878 579006314 580591679 582170904 584039688
3728.4E84039688J933694J675487J359820J369238J623511J494229Q83877P58827J507998
$$ 584039688 585973382 587648869 589008689 590377927 592001438 593495667 594379544 595138371 596646369
3746.7E96646369J369237Q51453J223266J620054J369715J029253J114309J249253
$$ 596646369 598015606 598867059 600090325 601710379 603080094 604109347 605223656 606472909
3763.1F06472909J219035J217067J113057J072168J181841J210451J170755J044810
$$ 606472909 607691944 608909011 610022068 611094236 612276077 613486528 614657283 615702093
3779.4F15702093R38713Q90970R12428J009345J043201J037717J001537R77337J039922
$$ 615702093 616640806 617531776 618444204 619453549 620496750 621534467 622536004 623513341 624553263
3797.7F24553263Q05199O07968Q95142P72655O87599R96650J098275Q88824P57933
$$ 624553263 625358462 625966430 626861572 627634227 628321826 629318476 630416751 631305575 632063508
3816.1F32063508R19759O60003N26785P82192P65562P57694P98643Q73089R60052O62804
$$ 632063508 632983267 633643270 634170055 634952247 635717809 636475503 637274146 638147235 639107287 639770091
3836.5F39770091L02672M96745O99222P44164Q60274Q91507N18441j98722J56999J017570
$$ 639770091 640072763 640569508 641268730 642012894 642873168 643764675 644283116 644084394 644241393 645258963
3856.9F45258963R60350O55770M59850N44608O33418M16935M00841N44906O56485O83725
$$ 645258963 646219313 646875083 647334933 647879541 648512959 648929894 649330735 649875641 650532126 651215851
3877.3F51215851M68612N22733O53386M56929M45187M19676K66254M24207N79595M51744
$$ 651215851 651684463 652207196 652860582 653317511 653762698 654182374 654448628 654872835 655452430 655904174
3897.7F55904174K94089K07186K01106M06265N08189L92378L55780L74556K89142K07662
$$ 655904174 656198263 656405449 656606555 657012820 657521009 657913387 658269167 658643723 658932865 659140527
3918.1F59140527K29359K62022K59042K96712L84271L92556L19660K67744K45988K46167
$$ 659140527 659369886 659631908 659890950 660187662 660571933 660964489 661284149 661551893 661797881 662044048
3938.5F62044048K44975K16902K11537K53915L06011L27706K80738K00867J97530K55645
$$ 662044048 662289023 662505925 662717462 662971377 663277388 663605094 663885832 664086699 664284229 664539874
3958.9F64539874K41518K35080L17395L37303K53379J93179K05219K07543J60217J33097
$$ 664539874 664781392 665016472 665333867 665671170 665924549 666117728 666322947 666530490 666690707 666823804
3979.3F66823804K16723K90692K39789J81318J53243J45197J94430K49863K28226
$$ 666823804 667040527 667331219 667571008 667752326 667905569 668050766 668245196 668495059 668723285
3997.6F68723285
$$ 668723285
##END=$$ End of the data block
