##TITLE=$$ Begin of the data block
##JCAMP-DX=5.00 $$ ACD/SpecManager v 10.08
##SPECTROMETER/DATA SYSTEM=Alpha
##DATE=23 Dec 2014 14:28:26
##DATA TYPE=INFRARED SPECTRUM
##DATA CLASS=XYDATA
##ORIGIN=
##OWNER=
##NPOINTS=1765
##FIRSTX=399.76428223
##LASTX=3997.64306641
##MAXX=3997.64306641
##MINX=399.76428223
##MAXY=0.82913053
##MINY=0.17319345
##XFACTOR=1.0000000000
##YFACTOR=1.000000000000000e-9
##FIRSTY=0.50792497
##DELTAX=2.03961372
##XUNITS=1/CM
##YUNITS=ARBITRARY UNITS
##XYDATA=(X++(Y..Y))
399.8E07924974o136775n167812l576964j256466J028627K622545K758205J692712
416.1D99889046J92910j776516k355486k437443l180086l518492l457040l526956l143966
434.4D76685971j937181k43991J916229L954530M892290M826665M159897L156781K009184
452.8D99420375R23842j54436j506477k056092j865536k103091l151923m116804m374116
471.2D81015742m059434l009409k112686j861573j586735j037538m77195m5508L4034
489.5D66859698l59744j006454j727730k196103k192527k282590k594858k891124l432214
507.9D48176354l941506m221886m424960m662871m997581m955024m254281l190250
524.2D13527995j998156q40932J46896J127839K312898L799111N359173O325990N858808
$$ plain form
399.8 507924974 501788199 496620387 493043423 491786957 492815584 495438129 498196334 499889046
416.1 499889046 500081956 498305440 495949954 493512511 490332425 486813933 483356893 479829937 476685971
434.4 476685971 474748790 474504799 476421028 480375558 485267848 490094513 494254410 497411191 499420375
452.8 499420375 500344217 500189781 498683304 496627212 494761676 492658585 489506662 485389858 481015742
471.2 481015742 476956308 473946899 471834213 469972640 468385905 467348367 466871172 466825664 466859698
489.5 466859698 466499954 465493500 463765770 461569667 459377140 457094550 454499692 451608568 448176354
507.9 448176354 444234848 440012962 435588002 430925131 425927550 420972526 416718245 413527995
524.2 413527995 411529839 410688907 410835803 411963642 414276540 418075651 423434824 429760814 435619622
542.5D35619622M110337K241373O05076q72910j875460k595961l386825m116923m865050
560.9D24863279o024957p214337p930518q109212p078290m524081j398176J469880
577.2C84053588L971100O130695P759065Q460551P872045O068558L820896J934379
593.5D30070877Q45820L66956N4627k34246m09484l30388O4939P45684J528919K225339
613.9D34929043K744496L144383L623277M146546M455150M481166M251212L646910
630.2D65422183K836079K173513J784891J706898J852184J832426J483500J045376
646.6D80137050Q19206R47208J283764J480729J382500J080543P22348P08521J224905
664.9D89786774K266616K567946J139433P67558J125306J585037K063453K207875J833260
$$ plain form
542.5 435619622 439729959 441971332 442576408 441703498 439828038 437232077 433845252 429728329 424863279
560.9 424863279 418838322 411623985 403693467 395584255 388505965 383981884 382583708 384053588
577.2 384053588 388024688 394155383 401914448 410374999 418247044 424315602 428136498 430070877
593.5 430070877 430916697 431283653 431338280 431104034 430694550 430364162 430429101 431174785 432703704 434929043
613.9 434929043 437673539 440817922 444441199 448587745 453042895 457524061 461775273 465422183
630.2 465422183 468258262 470431775 472216666 473923564 475775748 477608174 479091674 480137050
646.6 480137050 480956256 481903464 483187228 484667957 486050457 487131000 487853348 488561869 489786774
664.9 489786774 492053390 494621336 495760769 496528327 497653633 499238670 501302123 503509998 505343258
683.3E05343258J159251M78208m2677l04103n64754j199424k288759l536462m310698
701.6D94733840m060805k858877j250714K44975J471371K600401L840983N176395O447822
720E06345391P245720P311165O837487O060779N398810N064905M799783M202426K970755
738.3E56237221J375139m5181j116574k009868k972782m194081n409002o214082o376863
756.7E29273927n692661m328549k769768j171827P65026L164887N780399Q281112J0221779
775.1E43524325J1086047J0633051R164572P542789O559968O125211N662978M943729
791.4F05242670M265904M021227M353583N043984N556822N345642M328013K999544
807.7F41157389J967966J596272J696050J773000J362205K99811j033604k080917k725184
$$ plain form
683.3 505343258 506502509 506980717 506938040 506633937 506069183 504869759 502581000 499044538 494733840
701.6 494733840 490673035 487814158 486563444 486808419 488279790 490880191 494721174 499897569 506345391
720 506345391 513591111 520902276 527739763 533800542 539199352 544264257 549064040 553266466 556237221
738.3 556237221 557612360 557567179 556450605 554440737 551467955 547273874 541864872 535650790 529273927
756.7 529273927 523581266 519252717 516482949 515311122 516076148 519241035 525021434 533302546 543524325
775.1 543524325 554610372 565243423 574407995 581950784 588510752 594635963 600298941 605242670
791.4 605242670 609508574 613529801 617883384 622927368 628484190 633829832 638157845 641157389
807.7 641157389 643125355 644721627 646417677 648190677 649552882 649852693 648819089 646738172 644012988
826F44012988l262580m072428n303978o560565p198035o884456n950093n031347m495919
844.4E95253587m358828m547954m799366m831850m884005n167305m964889k805829
860.7E58893561J757026P059217J1231362J3886810J4964819J3940215J0952115P131576
877F39816701L513337L96072k328932m749775o677449p760941p851899p160247o170868
895.4F01025999n427897n335629n863130o623745p415832q268296r278834j0509670
911.7E42302966j1725485j2423039j2038886j0304272p575930m706978k484352j046330
928D79997694N7489J329810K869784M357815N515158O287337O310940M777252J396775
946.4E12900054l061354p515728j1304766j4211774j6262114j7614722j8541068j9331396
$$ plain form
826 644012988 640750408 636677980 631374002 624813437 617615402 610730946 604780853 599749506 595253587
844.4 595253587 590894759 586346805 581547439 576715589 571831584 566664279 561699390 558893561
860.7 558893561 560650587 567709804 578941166 592827976 607792795 621733010 632685125 639816701
877 639816701 643330038 643726110 641397178 636647403 629969954 622209013 614357114 607196867 601025999
895.4 601025999 595598102 590262473 584399343 577775598 570359766 562091470 552812636 542302966
911.7 542302966 530577481 518154442 506115556 495811284 488235354 483528376 481044024 479997694
928 479997694 480055183 481384993 484254777 488612592 494127750 500415087 506726027 511503279 512900054
946.4 512900054 509838700 502322972 491018206 476806432 460544318 442929596 424388528 405057132
962.7D05057132k0115107k0885378k1551848k1944046k1976262k1579266k0594716
977B56410509j8989578j6800612j4124527j1237264q425295n927652l883198k273634
993.3A74748749j032070j34140M78670P79793P03394L27081j85058o46651q78617p31647
1013.7A73429504k36049M83736J295522K098516K823934L409341L798976L961235L869281
1032A94933996L410160K624288J741737J038716O94170P57486J142561J748905K717212
1050.4B10809231M133314N719438P164970Q465394R786815J1064395J1402875R127945
1066.7B77674377L101379n091370j1189967j2145311q941814m627526j062482J521945
1083B39239231L397703M753962N825847O703228P094592O703764N495578L790528K151549
$$ plain form
962.7 405057132 384942025 364056647 342504799 320560753 298584491 277005225 256410509
977 256410509 237420931 220620319 206495792 195258528 186833233 180905581 177022383 174748749
993.3 174748749 173716679 173582539 174061209 174841002 175544396 175871477 175686419 175039768 174161151 173429504
1013.7 173429504 173193455 173677191 174972713 177071229 179895163 183304504 187103480 191064715 194933996
1032 194933996 198344156 200968444 202710181 203748897 204443067 205200553 206343114 208092019 210809231
1050.4 210809231 214942545 220661983 227826953 236292347 246079162 257143557 268546432 277674377
1066.7 277674377 280775756 275684386 264494419 252349108 243407294 238779768 237717286 239239231
1083 239239231 242636934 247390896 253216743 259919971 267014563 273718327 279213905 283004433 285155982
1101.4B85155982J155346J167149K137124L479600M480928M842371M620224L965527
1117.7C11004251L102333K334773J969457K343952L427595M620165N036414L934651
1134C37773591J284510k231836n649716q121371r273440r271770q459717p107497n394131
1152.4B83548623l504753j609504K35468K046257L946454O078839Q429259J0777831
1168.7C09948474J2870968J4543712J5685975J6238392J6303122J5996635J5352398
1183D16939676J4398515J3028711J1123598Q788436O353468M250169K836555K118647
1199.3D79837775J880855J989871K352595K960980L852159M888743N718172N986929
1215.6E09468079N515456M349589K786040J209915r3162j026988j688123k143681k341985
$$ plain form
1101.4 285155982 286311328 287478477 289615601 293095201 297576129 302418500 307038724 311004251
1117.7 311004251 314106584 316441357 318410814 320754766 324182361 328802526 333838940 337773591
1134 337773591 339058101 336826265 331176549 323055178 313781738 304509968 296050251 288942754 283548623
1152.4 283548623 280043870 278434366 278669834 280716091 284662545 290741384 299170643 309948474
1168.7 309948474 322819442 337363154 353049129 369287521 385590643 401587278 416939676
1183 416939676 431338191 444366902 455490500 464278936 470632404 474882573 477719128 479837775
1199.3 479837775 481718630 483708501 486061096 489022076 492874235 497762978 503481150 509468079
1215.6 509468079 514983535 519333124 522119164 523329079 523235917 522208929 520520806 518377125 516035140
1234E16035140k298952k062797j586139q44300L1113Q84116J618266K119601K387345
1252.3E16283393K458811K244591J767159J256287J008987J240552J866937K483666
1268.6E30610383K626359K113283J184404K37524m68254q62300j011491j067341j182556
1287E32180011j384079j601160j808226k029002k250492k389670k402544k351939k300501
1305.4E13662398k210558j972079j616180j376569j372397j556635j894832k426356
1321.7D99236792l344446m640430n839825o452411o302983n465955m182755k781481
1338D60226506j501381m54158K15650M88489M43638J81526j45138n02467q79824j151174
1358.4D56921667j275212j347720j146108p27237m02838K3127O06805J079738J214385
$$ plain form
1234 516035140 513736188 511673391 510087252 509242952 509274065 510158181 511776447 513896048 516283393
1252.3 516283393 518742204 520986795 522753954 524010241 525019228 526259780 528126717 530610383
1268.6 530610383 533236742 535350025 536534429 536771953 536303699 535441399 534429908 533362567 532180011
1287 532180011 530795932 529194772 527386546 525357544 523107052 520717382 518314838 515962899 513662398
1305.4 513662398 511451840 509479761 507863581 506487012 505114615 503557980 501663148 499236792
1321.7 499236792 495892346 491251916 485412091 478959680 472656697 467190742 463007987 460226506
1338 460226506 458725125 458270967 458486617 458975106 459418744 459600270 459455132 458952665 458072841 456921667
1358.4 456921667 455646455 454298735 453152627 452425390 452022552 452045679 452652484 453732222 454946607
1376.7D54946607J251549J419544J943946L024459M397809M802734L870964K742440
1393.1D78400052J456678N4568r88722j385421j504630j850784k005010k006978k120495
1411.4D68049258j926452j350254r85861q42601k61694L98070Q11845J218676J600475
1429.8D66711462J812607J978844K321064K441228K116293K026647J850396J328051
1446.1D82586592M32790m62562r12845j099229j851231k356917o15209J138747K869010
1464.5D79729146M594147N777448P797927J1362344J2171447J0359049R327233Q957863
1480.8E50076604Q624971P731318P277549P352709O768227N342245M937768N275905
1497.1F03387296M649639L762365L404617L835738M394591L003597K138853K206921
$$ plain form
1376.7 454946607 456198156 457617700 459561646 462586105 466983914 471786648 475657612 478400052
1393.1 478400052 479856730 479911298 478922576 477537155 476032525 474181741 472176731 470169753 468049258
1411.4 468049258 466122806 464772552 463786691 462944090 462682396 463080466 463892311 465110987 466711462
1429.8 466711462 468524069 470502913 472823977 475265205 477381498 479408145 481258541 482586592
1446.1 482586592 483019382 482556820 481643975 480544746 478693515 476336598 475721389 476860136 479729146
1464.5 479729146 484323293 490100741 497898668 509261012 521432459 531791508 541118741 550076604
1480.8 550076604 558701575 566432893 573710442 581063151 587831378 593173623 598111391 603387296
1497.1 603387296 608036935 611799300 615203917 619039655 623434246 626437843 628576696 630783617
1513.4F30783617K360881K518535K442479K331078J875698J391590J191735J124561
1529.7F46020174J298785J290560J131237J175820Q56638k42114m15027o7234J60158
1548.1F51208997J47939K5987K9028J62601l14653j432240p71999m09127n19216p66992
1568.5F47360325j051366o06418k93970q60632j200258j087547j195609j228094j229763
1586.8F38606668j322985j608193k018690k423287k617359k613008k710521k976000
1603.2F20316625l331423l754556m251540m291534l804923m112780n249738m380107
1619.5E87140024l693283m489303m393696l847778l560066k703667k263725l095329
1635.8E59093177k772033j253784l02612L58998P60198R57310J248002K054513L086149
$$ plain form
1513.4 630783617 633144498 635663033 638105512 640436590 642312288 643703878 644895613 646020174
1529.7 646020174 647318959 648609519 649740756 650916576 651773214 651531100 651116073 651048839 651208997
1548.1 651208997 651356936 651382923 651411951 651574552 651259899 649827659 649055660 648646533 648127317 647360325
1568.5 647360325 646308959 645702541 645408571 644547939 643347681 642260134 641064525 639836431 638606668
1586.8 638606668 637283683 635675490 633656800 631233513 628616154 626003146 623292625 620316625
1603.2 620316625 616985202 613230646 608979106 604687572 600882649 596769869 591520131 587140024
1619.5 587140024 583446741 578957438 574563742 570715964 567155898 564452231 562188506 559093177
1635.8 559093177 556321144 555067360 554764748 555123746 555883944 556841254 558089256 560143769 563229918
1654.1E63229918K880633L069163L760218M433632M645229M481375N300045O264746
1670.5E98064959N572319N493045N832016N388618N348205O233633P592201O125927
1686.8F45650923M818380M909754M643619N115509N514085M824221M398644L258229
1703.1F83133364K729296K840758K736807K786219K789259K532661K004504J346826
1719.4G02899694J285911J688540K091110K149343K076209J979172K088785K058745
1735.7G18317509J924812K137661K155006K071500K293706K736926L199220L246069
1752G38082409K815425K604068K476692K327561K469659K366304K123178J964807J700878
1770.4G58930981J366615J133144J205206J413107J392722J066804Q01862Q20636J076818
$$ plain form
1654.1 563229918 566110551 569179714 572939932 577373564 582018793 586500168 591800213 598064959
1670.5 598064959 603637278 609130323 614962339 620350957 625699162 631932795 639524996 645650923
1686.8 645650923 650469303 655379057 660022676 665138185 670652270 675476491 679875135 683133364
1703.1 683133364 685862660 688703418 691440225 694226444 697015703 699548364 701552868 702899694
1719.4 702899694 704185605 705874145 707965255 710114598 712190807 714169979 716258764 718317509
1735.7 718317509 720242321 722379982 724534988 726606488 728900194 731637120 734836340 738082409
1752 738082409 740897834 743501902 745978594 748306155 750775814 753142118 755265296 757230103 758930981
1770.4 758930981 760297596 761430740 762635946 764049053 765441775 766508579 767310441 768131077 769207895
1788.8G69207895J382947J405895R65714O82473O66857P61807R15885J037419J049101
1807.1G78075993Q57532N50985M25816O43551R14812R81152Q64447O91652N08428M63545
1827.5G84977913O04331O56128O12498N03838K78949J64450L31044N30660M98951L32057
1847.9G89490819J39594j4067O020K14041M20510M76480L32236J37568R7930J61946
1868.3G91463077K49922L61204M01795K93732J59025J47641K97666N17487O48975N39959
1888.7G95080483K29239M5360J01268K58267L88324L73602J80721l457k5868P5042
1909.1G96702981J96040K68578K64883J37568k8730l1233J14501K50220K73168J62781
1929.5G98310757K6047l7849K0146J91033L10540K66970O9558o5028R179J80065L15667
$$ plain form
1788.8 769207895 770590842 771996737 772962451 773644924 774311781 775073588 775989473 777026892 778075993
1807.1 778075993 778933525 779484510 779910326 780553877 781468689 782449841 783314288 784005940 784514368 784977913
1827.5 784977913 785582244 786238372 786850870 787354708 787633657 787798107 788129151 788659811 789158762 789490819
1847.9 789490819 789630413 789616346 789622366 789836407 790256917 790733397 791065633 791203201 791301131 791463077
1868.3 791463077 791712999 792074203 792475998 792769730 792928755 793076396 793374062 793891549 794540524 795080483
1888.7 795080483 795309722 795355082 795456350 795714617 796102941 796476543 796657264 796653807 796627939 796702981
1909.1 796702981 796899021 797167599 797432482 797570050 797541320 797510087 797624588 797874808 798147976 798310757
1929.5 798310757 798336804 798298955 798319101 798510134 798820674 799087644 799157202 799092174 799101353 799281418 799597085
1951.9G99597085L61681K77996J18255N3883J28984K95758M04895K89380P2241l2604
1972.3H01567554J848J27197K24232K06471J18494J1146j8835M5001J30177J30176
1992.7H02543461K7657n2691r5665j19925r2446m6373q5652j92344l03626l86000l87311
2015.2H00809085l49104l76701n13971p28846p60257m26054j82271k55227l51668m18365
2035.6G96446621m90546m99725m46260l71158k73645k12312k22266k31266j90675j03652
2056G93405116o080M6074O2943P7069O2406N4657P4029P8499M9532M589j5497L934
2080.4G93897271M5061R4831J25230J19686J19447J13965J19328J63257K06530K15709
2100.8G95220315J89543J56403J23679J16051J38282J33634Q5473L6240J7762K9504
$$ plain form
1951.9 799597085 799958766 800236762 800355017 800408900 800537884 800833642 801238537 801527917 801600158 801567554
1972.3 801567554 801569402 801696599 801920831 802127302 802245796 802256942 802238107 802283108 802413285 802543461
1992.7 802543461 802571118 802518427 802422762 802302837 802210391 802164018 802078366 801886022 801582396 801196396 800809085
2015.2 800809085 800459981 800083280 799569309 798840463 798080206 797654152 797471881 797216654 796864986 796446621
2035.6 796446621 795956075 795456350 795010090 794638932 794365287 794152975 793930709 793699443 793508768 793405116
2056 793405116 793399036 793445110 793508053 793585122 793647528 793702185 793776214 793854713 793904245 793908834 793893337 793897271
2080.4 793897271 793942332 794037163 794162393 794282079 794401526 794515491 794634819 794798076 795004606 795220315
2100.8 795220315 795409858 795566261 795689940 795805991 795944273 796077907 796163380 796199620 796217382 796246886
2121.2G96246886M2081L5882J6868j132j6272j4544M2260R8944Q9466K7359k3544l815
2145.7G96540439M8518P8142R1612J05739J26123J87815K73525L38138L77058L73960
2166.1G98541069L69787M30942N01573N29110N51105N70595N49853M88639M52280M73440
2186.5H03458393N30243N57065M86254L95775L82304M21405M60088M87745M99845M64439
2206.9H08143556L96252L73423M07815M69923N18143M91619M05014L16024L03089L60847
2227.3H12185705M05490M06921L25143J95384J58012K24471K88964L06546K91825K54035
2247.7H15042496J99079J91033K36571K80678K98918K63094K21014K24233K50280K69771
2268.1H17477167K79367K83539K38001J66059J53422J87397K40088K94566K74360K04325
$$ plain form
2121.2 796246886 796288967 796324849 796341717 796340585 796324313 796309769 796352029 796450973 796540439 796567798 796544254 796540439
2145.7 796540439 796588957 796667099 796758711 796864450 796990573 797178388 797451913 797790051 798167109 798541069
2166.1 798541069 798910856 799341798 799843371 800372481 800923586 801494181 802044034 802532673 802984953 803458393
2186.5 803458393 803988636 804545701 805031955 805427730 805810034 806231439 806691527 807179272 807679117 808143556
2206.9 808143556 808539808 808913231 809321046 809790969 810309112 810800731 811205745 811521769 811824858 812185705
2227.3 812185705 812591195 812998116 813323259 813518643 813676655 813901126 814190090 814496636 814788461 815042496
2247.7 815042496 815241575 815432608 815669179 815949857 816248775 816511869 816732883 816957116 817207396 817477167
2268.1 817477167 817756534 818040073 818278074 818444133 818597555 818784952 819025040 819319606 819593966 819798291
2288.5H19798291J92940K62976L45409L54766L12508K78711K61783K91229M06623N23567
2308.9H23028803N00142L74139L09646M03583N92053O86228N77808L73542K67625K77817
2329.3H27391386K03371J9491j3769Q5414O6876j24216m89652j063645j085043j65165
2349.7H24825048R07481J348257J145840P32601J71303l19183o62505r81748j262009
2368H25905085j446784j469016j295805j135647j113534j107276r98676p92980n34475
2386.4H16010892k93254j94967k30313k79307l01540k90811k39849k22445k99632l88026
2406.8H13270748m17710m24385m17828l79265l98218n17249o21498o28650n79119n49674
2427.2H08337152n41627n51105n98073o55591o71030o43491o18279o26266o76930p29025
$$ plain form
2288.5 819798291 819991231 820254207 820599616 820954382 821266890 821545601 821807384 822098613 822505236 823028803
2308.9 823028803 823528945 823903084 824212730 824616313 825208366 825894594 826472402 826845944 827113569 827391386
2329.3 827391386 827594757 827614248 827600479 827685893 827752769 827628553 827138901 826075256 824990213 824825048
2349.7 824825048 825732529 827080786 828226626 828959227 829130530 828811347 828148842 827167094 825905085
2368 825905085 824458301 822989285 821693480 820557833 819444299 818337023 817338347 816545367 816010892
2386.4 816010892 815717638 815522671 815292358 815013051 814711511 814420700 814180851 813958406 813658774 813270748
2406.8 813270748 812853038 812428653 812010825 811631560 811233342 810716093 810094595 809465945 808886826 808337152
2427.2 808337152 807795525 807244420 806646347 805990756 805319726 804676235 804057956 803431690 802754760 802025735
2447.6H02025735p18534o33955n60999n73754o09279o17980o36638o31749n78761n35667
2467.9G95928419n28813n57959n67973n55157n52535n31674n15222n13911m99666m65274
2488.3G90640235m15444l73245l47674l48866l79204l88205l65794l29197k83300k73824
2508.7G87135482l23534l92080m08768l78907l49343l57330m44769n45025n89371o10471
2529.1G82735884o06000n90146o50883p34925p45535p41362p18892o35981o08743p08818
2549.5G75994599p95007p72476o93917o22869o16074o72280p35998p57635p23362o43551
2569.9G68961430n56231n55098o50167p22170o98746o33537n64874m86135m65393n25475
2590.3G63103604n73337n49078m45604l35395l46542m79042o22690o85573o66320o51240
$$ plain form
2447.6 802025735 801307201 800673246 800112247 799538493 798929214 798311234 797674596 797042847 796464086 795928419
2467.9 795928419 795399606 794841647 794273674 793718517 793165982 792634308 792119086 791605175 791105509 790640235
2488.3 790640235 790224791 789851546 789503872 789155006 788775802 788387597 788021803 787692606 787409306 787135482
2508.7 787135482 786811948 786419868 786011100 785632193 785282850 784925520 784480751 783935726 783346355 782735884
2529.1 782735884 782129884 781539738 780888855 780153930 779408395 778667033 777948141 777312160 776703417 775994599
2549.5 775994599 775199592 774427116 773733199 773110330 772494256 771821976 771085978 770328343 769604981 768961430
2569.9 768961430 768405199 767850101 767199934 766477764 765779018 765145481 764580607 764094472 763629079 763103604
2590.3 763103604 762530267 761981189 761535585 761200190 760853648 760374606 759751916 759066343 758400023 757748783
2610.7G57748783o76752p45654q72194j005054j065731j031101r96232j062512j173079
2629.1G49120474j269758j350522j363814j309275j254738j255810j338184j408338
2645.4G38570035j382351j325250j267791j206994j207173j251638j272499j262546
2661.7G28393793j198232j108885j100898j180946j226604j154006j046956r91046
2678G19386220r61781r72628j047611j111925j090586j007021r39667r64880j070380
2696.4G10219741j178742j255154j267970j223564j194537j203835j249373j305103
2712.7G00341463j301169j219750j103520j053035j113415j179993j137197r97424
2729F91235960q95799q68678q43405q45731q95858q99434q39054p94232p62761p76350
$$ plain form
2610.7 757748783 757072031 756326377 755454183 754449129 753383398 752352297 751356065 750293553 749120474
2629.1 749120474 747850716 746500194 745136380 743827105 742572367 741316557 739978373 738570035
2645.4 738570035 737187684 735862434 734594643 733387649 732180476 730928838 729656339 728393793
2661.7 728393793 727195561 726086676 724985778 723804832 722578228 721424222 720377266 719386220
2678 719386220 718424439 717451811 716404200 715292275 714201689 713194668 712255001 711290121 710219741
2696.4 710219741 709040999 707785845 706517875 705294311 704099774 702895939 701646566 700341463
2712.7 700341463 699040294 697820544 696717024 695663989 694550574 693370581 692233384 691235960
2729 691235960 690340161 689471483 688628078 687782347 686886489 685987055 685148001 684353769 683591008 682814658
2749.4F82814658q58367q71539p73430o77109o28292o01173o05881o44564o93560p45058
2769.8F75715685p72059p87437q49307r56416j050651j088381j097440j130998j198352
2788.2F66784644j313209j478434j586199j572490j574516j686692j830876j977265
2804.5F53764963k090096k114237k146244k217352k261937k361536k508998k587437
2820.8F35477126k638340k700806k756476k846122l007949l200531l344178l442645
2837.1F11540079l575265l785849m052341m325569m538714m557014m275203l821909
2853.4E78608215l429234l221810l239334l510594m039824m695892n291939n749047
2869.7E45430541o090462o348252o485224o353379n850315n082070m234553l428757
$$ plain form
2749.4 682814658 681956291 681084752 680311322 679634213 679005921 678404748 677798867 677154303 676460743 675715685
2769.8 675715685 674943626 674156189 673306882 672350466 671299815 670211434 669113994 667982996 666784644
2788.2 666784644 665471435 663993001 662406802 660834312 659259796 657573104 655742228 653764963
2804.5 653764963 651674867 649560630 647414386 645197034 642935097 640573561 638064563 635477126
2820.8 635477126 632838786 630137980 627381504 624535382 621527433 618326902 614982724 611540079
2837.1 611540079 607964814 604178965 600126624 595801055 591262341 586705327 582430124 578608215
2853.4 578608215 575178981 571957171 568717837 565207243 561167419 556471527 551179588 545430541
2869.7 545430541 539340079 532991827 526506603 520153224 514302909 509220839 504986286 501557529
2886.1E01557529k669454j952499j357913r57519p93844q35508r60797j126498j380682
2904.4D89522815j730144k133191k618104l224880l867030m379242m611373m520893
2920.7D62437958m144133l529578k690464j670689n54949P36386K192616L550381M669100
2939.1D60996628N541384O143898O515860O714076O811053O858587O819636O740987
2955.4E13142109O715298O654501O412208O023645N626440N266011M923642M665195
2971.7E59429049M543901M471838M390717M230678L922701L575504L265619K973378
2988E90803385K699792K352894J922786J574039J267731R09985N76496K19166j80841
3006.4F02145433m60743o55532r43065j297712j605094j848161k043247k190471k318382
$$ plain form
2886.1 501557529 498888075 496935576 495577663 494620144 493826300 492990792 492029995 490903497 489522815
2904.4 489522815 487792671 485659480 483041376 479816496 475949466 471570224 466958851 462437958
2920.7 462437958 458293825 454764247 452073783 450403094 449848145 450584531 452777147 456327528 460996628
2939.1 460996628 466538012 472681910 479197770 485911846 492722899 499581486 506401122 513142109
2955.4 513142109 519857407 526511908 532924116 538947761 544574201 549840212 554763854 559429049
2971.7 559429049 563972950 568444788 572835505 577066183 580988884 584564388 587830007 590803385
2988 590803385 593503177 595856071 597778857 599352896 600620627 601530612 602107108 602326274 602145433
3006.4 602145433 601684690 601029158 600086093 598788381 597183287 595335126 593291879 591101408 588783026
3024.7E88783026k447367k533257k580106k653182k806842k963781k970875k919972
3041.1E66907644k990722l167987l307343l284633l221095l253459l298939l346681
3057.4E41036785l385127l342748l245294l180921l274441l459572l511668l387689
3073.7E14249325l190637l093242l232182l418743l436685l407657l393888l350646
3090D87725645l386944l454775l341436l138513l145545l319770l330827l148973l062815
3108.4D58396047l171682l162652k948404k894342l070533l277212l375739l292143
3124.7D33203340l120512k984375k979040l042013k944558k761424k757072k916337
3141D09698009k985596k901554k791822k629280k490610k614022k855360k874315k721578
$$ plain form
3024.7 588783026 586335659 583802402 581222296 578569114 575762272 572798491 569827616 566907644
3041.1 566907644 563916922 560748935 557441592 554156959 550935864 547682405 544383466 541036785
3057.4 541036785 537651658 534308910 531063616 527882695 524608254 521148682 517637014 514249325
3073.7 514249325 511058688 507965446 504733264 501314521 497877836 494470179 491076291 487725645
3090 487725645 484338701 480883926 477542490 474403977 471258432 467938662 464607835 461458862 458396047
3108.4 458396047 455224365 452061713 449113309 446218967 443148434 439871222 436495483 433203340
3124.7 433203340 430082828 427098453 424119413 421077400 418132842 415371418 412614346 409698009
3141 409698009 406712413 403810859 401019037 398389757 395899147 393285125 390429765 387555450 384833872
3159.4C84833872k581119k507419k487719k461552k436161k400875k345682k314776
3175.7C65298569k306521k276718k218068k167821k124011k089203k093971k100378
3192C47921878k067774k009929j949966j888632j816780j783043j809299j834661j770258
3210.3C30991536j681953j658380j603335j552374j587838j596421j530230j472681
3226.7C18308324j400143j261115j211048j385122j539171j479715j342893j193523
3243C07495594j076162j110673j236111j236021j104295j035423j095146j148253j081944
3261.3B97371566r69916q91984p70479o48380p62850j004159j089275j020640r13590
3279.7B89300293q59380q36670p79033o90758o03140o08176p30663q65758r43661q85576
$$ plain form
3159.4 384833872 382252753 379745334 377257615 374796063 372359902 369959027 367613345 365298569
3175.7 365298569 362992048 360715330 358497262 356329441 354205430 352116227 350022256 347921878
3192 347921878 345854104 343844175 341894209 340005577 338188797 336405754 334596455 332761794 330991536
3210.3 330991536 329309583 327651203 326047868 324495494 322907656 321311235 319781005 318308324
3226.7 318308324 316908181 315647066 314436018 313050896 311511725 310032010 308689117 307495594
3243 307495594 306419432 305308759 304072648 302836627 301732332 300696909 299601763 298453510 297371566
3261.3 297371566 296401650 295509666 294739187 294090807 293327957 292323798 291234523 290213883 289300293
3279.7 289300293 288440913 287604243 286825210 286134452 285531312 284923136 284192473 283326715 282383054 281497478
3300.1B81497478o60479m65154n54860q55237j063258j053452r12726q15868q21174
3318.4B74295270q16106p31677p01457q47668r63956r12458q35359o91205n28991o50019
3338.8B66616374q84652r04232q61734p94083o22958o76811r57966r99838p95454o69986
3359.2B58448660o91652o77258n12510m52161o96331r86517r73820p27714n96463o14316
3379.6B51519918o47693o09279m50268k05353q792j34498m90412n29885j48699N6177
3400B48351216l14399o75381m23207p7963r1568k06053k89828k91466j53617m8428
3420.4B45779306j6973R1240K61486L53291K79755K89678M05491K19166j04353o6399
3440.8B47491688K29939M35084M46320L60742L84420M88386N80028O84231P43628O54429
$$ plain form
3300.1 281497478 280836999 280371845 279816985 278961748 277898490 276845038 275932312 275116444 274295270
3318.4 274295270 273479164 272747487 272046030 271198362 270234406 269321948 268486589 267795384 267266393 266616374
3338.8 266616374 265731722 264827490 263965756 263171673 262548715 261871904 260913938 259914100 259118646 258448660
3359.2 258448660 257757008 257079750 256567240 256115079 255418748 254432231 253458411 252730697 252134234 251519918
3379.6 251519918 250872225 250262946 249812678 249607325 249598533 249464035 248973623 248443738 248295039 248351216
3400 248351216 248036817 247361436 246938229 246860266 246768698 246562645 246272817 245981351 245827734 245779306
3420.4 245779306 245762333 245853573 246115059 246468350 246748105 247037783 247443274 247662440 247558087 247491688
3440.8 247491688 247721627 248156711 248603031 248963773 249348193 249836579 250416607 251100838 251844466 252498895
3461.2B52498895O76691R71377J058311O99907L56108M10408O94066R97305R92566
3479.6B59355634O54161O03676Q50141Q75920P93517R09269J055091J086087J046508
3497.9B67230004J064092J052052Q35538O98477Q53955J104534J282454J216083R82404
3516.3B76319593R75549J246602J469016J264721R12279R22471J178712J425713J576007
3534.6B87290663J477390J323342J528025J771122J634628J326471J373738J611740
3551B99337119J694292J818865K051354K208471K217919K115577K055287K371610K755344
3569.3C18625838K713769K612680K751619K994239L272266L529846L545255L238857
3585.6C43284369L046065L430784L661990L630102L788650M007905M006982L979773
$$ plain form
3461.2 252498895 253175586 254146963 255205274 255905181 256261289 256671697 257365763 258363068 259355634
3479.6 259355634 260009795 260613471 261463612 262339532 263133049 264042318 265097409 266183496 267230004
3497.9 267230004 268294096 269346148 270181686 270880163 271734118 272838652 274121106 275337189 276319593
3516.3 276319593 277295142 278541744 280010760 281275481 282187760 283110231 284288943 285714656 287290663
3534.6 287290663 288768053 290091395 291619420 293390542 295025170 296351641 297725379 299337119
3551 299337119 301031411 302850276 304901630 307110101 309328020 311443597 313498884 315870494 318625838
3569.3 318625838 321339607 323952287 326703906 329698145 332970411 336500257 340045512 343284369
3585.6 343284369 346330434 349761218 353423208 357053310 360841960 364849865 368856847 372836620
3601.9C72836620L959030L815799L869057M089177M234046M400461M345984M269272
3618.3D05819446M603147M582107M198224L857940L979147M676550M668206M424721
3634.6D40809488M316807M260302M365384M470527M329235M130930M407465M741549
3650.9D75831687M334450M044891M406541M498840M029512L753692L842831L764450
3667.2E08506894L617704L871858L642082L240049L458143L477990L345192L387451
3683.5E36547363L394663L226340K791941K567709K623438K557040K449453K333104
3699.8E58491051K244175K307653K333582K140760J785338J737356K165318K233862
3716.2E75439095K016008J857460J755774J602054J583755J833856J874864J699686
$$ plain form
3601.9 372836620 376795650 380611449 384480506 388569683 392803729 397204190 401550174 405819446
3618.3 405819446 410422593 415004700 419202924 423060864 427040011 431716561 436384767 440809488
3634.6 440809488 445126295 449386597 453751981 458222508 462551743 466682673 471090138 475831687
3650.9 475831687 480166137 484211028 488617569 493116409 497145921 500899613 504742444 508506894
3667.2 508506894 512124598 515996456 519638538 522878587 526336730 529814720 533159912 536547363
3683.5 536547363 539942026 543168366 545960307 548528016 551151454 553708494 556157947 558491051
3699.8 558491051 560735226 563042879 565376461 567517221 569302559 571039915 573205233 575439095
3716.2 575439095 577455103 579312563 581068337 582670391 584254146 586088002 587962866 589662552
3732.5E89662552J477420J419306J580000J459062R23574Q31544J477600J257598P87318
3750.8F00875974J275837J688361J418531J066447J120090J252711J193583J112223
3767.1F11003757J032590J093150J249015J296878J234829J033664Q77440Q30054R09090
3785.5F20560467J053572J077235J034379R53316R67086J087248Q29279N94259Q50439
3803.9F29007280P27534O82235J037002J124024Q46445O99044R19342O65009N43773
3822.2F36251688Q81076Q83043P70807O85453P88987J015723P62343L56078N19395
3840.6F42914593O83069O88255P78914P77483M00364k52426K64228J175523J074552
3858.9F48504555P53701N02229M92811N46515L52919M11987N88894O55949O80626N35011
$$ plain form
3732.5 589662552 591139972 592559278 594139278 595598340 596521914 597353458 598831058 600088656 600875974
3750.8 600875974 602151811 603840172 605258703 606325150 607445240 608697951 609891534 611003757
3767.1 611003757 612036347 613129497 614378512 615675390 616910219 617943883 618821323 619651377 620560467
3785.5 620560467 621614039 622691274 623725653 624678969 625646055 626733303 627562582 628156841 629007280
3803.9 629007280 629734814 630417049 631454051 632578075 633424520 634123564 635042906 635707915 636251688
3822.2 636251688 637132764 638015807 638786614 639472067 640261054 641276777 642039120 642395198 642914593
3840.6 642914593 643597662 644285917 645064831 645842314 646242678 645990252 646254480 647430003 648504555
3858.9 648504555 649258256 649760485 650253296 650799811 651152730 651564717 652153611 652809560 653490186 654025197
3879.3F54025197O05881O25968L75331M18603M11809K32517L98934O07670M78148K63393
3899.7F58443451J71840K10285M24028N24580M52876M28439L98099K83956J97888J97053
3920.1F61732495K05517K17080L12507M25279L84450K99752L16381L00944K50340K45750
3940.5F64690495K47240K58863K56538K40684K89440L00228K26975K11656K66969K57492
3960.9F67246580K10047K25723K71499K88188K23935J47700K08020K67685J93238K36333
3981.3F69518948L24905J88171O4791J45554K41399K45810K23755J95802
3997.6F71149135
$$ plain form
3879.3 654025197 654631078 655257046 655632377 656050980 656462789 656695306 657094240 657701910 658180058 658443451
3899.7 658443451 658615291 658825576 659249604 659774184 660227060 660655499 661053598 661337554 661535442 661732495
3920.1 661732495 661938012 662155092 662467599 662892878 663277328 663577080 663893461 664194405 664444745 664690495
3940.5 664690495 664937735 665196598 665453136 665693820 665983260 666283488 666510463 666722119 666989088 667246580
3960.9 667246580 667456627 667682350 667953849 668242037 668465972 668613672 668821692 669089377 669282615 669518948
3981.3 669518948 669843853 670032024 670096815 670242369 670483768 670729578 670953333 671149135
3997.6 671149135
##END=$$ End of the data block
