##TITLE=$$ Begin of the data block
##JCAMP-DX=5.00 $$ ACD/SpecManager v 10.08
##SPECTROMETER/DATA SYSTEM=Alpha
##DATE=23 Dec 2014 14:28:26
##DATA TYPE=INFRARED SPECTRUM
##DATA CLASS=XYDATA
##ORIGIN=
##OWNER=
##NPOINTS=1765
##FIRSTX=399.76428223
##LASTX=3997.64306641
##MAXX=3997.64306641
##MINX=399.76428223
##MAXY=0.84557062
##MINY=0.26219952
##XFACTOR=1.0000000000
##YFACTOR=1.000000000000000e-9
##FIRSTY=0.55569655
##DELTAX=2.03961372
##XUNITS=1/CM
##YUNITS=ARBITRARY UNITS
##XYDATA=(X++(Y..Y))
$$ plain form
399.8 555696547 548899591 543622136 541248739 542024016 543910086 545008063 545604944 547143519 549673557
418.1 549673557 549637556 546244740 542592108 540128350 538542032 536429167 532969832 528942466 526436329
436.5 526436329 527282596 531030118 535392344 538593292 541394591 545206130 549600244 552365720 552200258
454.8 552200258 550365090 548818648 548245549 547160387 544120252 539618015 535602272 533363283 531887054
473.2 531887054 529362142 525773823 522797644 521978676 522864521 523373067 522357941 520912230 520505369
491.5 520505369 521022260 520834029 518747747 515395164 512268841 510357022 509003460 506320417 501819491
509.9 501819491 497018039 493400306 490683734 487116814 482069016 477241069 474553496 474313676 475171894
528.3 475171894 475501835 475237250 476327300 480612367 487302095 493531317 497302949 499190271 500875056
$$ packed form
399.8E55696547o796956n277455k373397P75277J886070J097977N96881J538575K530038
418.1E49673557l6001l392816l652632k463758j586318k112865l459335m027366k506137
436.5E26436329Q46267L747522M362226L200948K801299L811539M394114K765476j65462
454.8E52200258j835168j546442n73099j085162l040135m502237m015743k238989j476229
473.2E31887054k524912l588319k976179q18968Q85845N08546j015126j445711m06861
491.5E20505369N16891j88231k086282l352583l126323j911819j353562k683043m500926
509.9E01819491m801452l617733k716572l566920n047798m827947k687573k39820Q58218
528.3D75171894L29941k64585J090050M285067O689728O229222L771632J887322J684785
$$ plain form
546.6 500875056 502654016 503046274 500847757 496841818 492952079 489973009 486784250 481760114 474613696
565 474613696 466848046 460350722 455820143 452986777 451577932 452106804 455724090 462506294 470657289
583.3 470657289 477908492 483429402 487868935 491930395 495158553 496422023 495601326 494199634 493869960
601.7 493869960 494732261 495629936 495556742 495052427 495752424 498410642 502099454 505275965 507540166
620 507540166 510122240 514261603 519530296 524061501 526567578 527809680 529569626 532536387 535589576
638.4 535589576 537115991 537017763 537039876 538749874 541678786 543804765 543982983 543425441 544177055
656.8 544177055 546573877 548872173 549533427 549485803 550885975 553829014 555792749 556884229 557242930
675.1 557242930 557488799 559174776 562281966 564851761 565305710 564341307 563993037 565005183 565831482
$$ packed form
546.6E00875056J778960L92258k198517m005939l889739k979070l188759n024136p146418
565D74613696p765650o497324m530579k833366j408845N28872L617286O782204Q150995
583.3D70657289P251203N520910M439533M061460L228158J263470q20697j401692l29674
601.7D93869960Q62301Q97675p3194n04315O99997K658218L688812L176511K264201
620E07540166K582074M139363N268693M531205K506077J242102J759946K966761L053189
638.4E35589576J526415r8228K2113J709998K928912K125979J78218n57542P51614
656.8E44177055K396822K298296O61254m7624J400172K943039J963735J091480L58701
675.1E57242930K45869J685977L107190K569795M53949r64403l48270J012146Q26299
$$ plain form
693.5 565831482 564475775 560782909 556670666 553871691 552264392 550590873 548314512 546724856
709.8 546724856 547743678 551693857 556907117 561536431 565444350 570149183 576858699 584659576
726.1 584659576 591099620 595031023 597898304 601620018 606223404 609872401 610954583 609811425
742.4 609811425 608273685 607394636 606108546 602604628 596754134 590393722 585444510 582184076 579364002
760.8 579364002 576122105 573503435 573677897 577692151 584393263 591659665 598641455 606326878 615619123
779.1 615619123 625518620 633747280 639048815 642437339 646130860 651193500 656492710 660369337
795.4 660369337 662939310 666004479 670768321 676281512 680338621 681851447 682117045 683317423 685913265
813.8 685913265 688230693 688444495 686674714 684822679 684153557 683585048 680936694 675522268 668948412
$$ packed form
693.5E65831482j355707l692866m112243k798975j607299j673519k276361j589656
709.8E46724856J018822L950179N213260M629314L907919M704833O709516P800877
726.1E84659576O440044L931403K867281L721714M603386L648997J082182j143158
742.4F09811425j537740q79049j286090l503918n850494o360412m949212l260434k820074
760.8E79364002l241897k618670J74462M014254O701112P266402O981790P685423R292245
779.1F15619123R899497Q228660N301535L388524L693521N062640N299210L876627
795.4F60369337K569973L065169M763842N513191M057109J512826K65598J200378K595842
813.8F85913265K317428K13802j769781j852035o69122n68509k648354n414426o573856
$$ plain form
832.2 668948412 663362741 659168303 654918551 649369121 643175542 638173163 635178506 632929504
848.5 632929504 629465461 624259889 618468881 613565266 610300779 609030962 610569715 615892887
864.8 615892887 625229180 637724578 651151776 662492692 670140862 674908280 678015172 679039598
881.1 679039598 676668525 670742452 663001955 655813217 650126159 644903064 638837159 632106721
897.4 632106721 625998318 621162593 616572797 610426247 601970673 592154384 582375586 572964609
913.7 572964609 563276410 553059340 543489993 536529899 533060610 532038152 531717062 531452298 532049596
932.1 532049596 534517348 538774908 543691635 548249125 552145243 555008531 555546999 552018821 543558955
950.5 543558955 530996978 516291320 501008034 485352695 468671381 450629801 431727290
$$ packed form
832.2F68948412n585671m194438m249752n549430o193579n002379k994657k249002
848.5F32929504l464043n205572n791008m903615l264487j269817J538753N323172
864.8F15892887R336293J2495398J3427198J1340916P648170M767418L106892J024426
881.1F79039598k371073n926073p740497p188738n687058n223095o065905o730438
897.4F32106721o108403m835725m589796o146550q455574r816289r778798r410977
913.7E72964609r688199j0217070r569347o960094l469289j022458l21090k64764N97298
932.1E32049596K467752M257560M916727M557490L896118K863288N38468l528178q459866
950.5E43558955j2561977j4705658j5283286j5655339j6681314j8041580j8902511
$$ plain form
964.7 431727290 412771940 394112259 375523657 356724799 337982804 320274323 304680020
979 304680020 291712821 281327784 273289025 267451376 263820022 262268364 262199521 262809962 263642251
997.4 263642251 264717966 266154945 267732620 268879026 269119501 268576384 267912358 267758280 268302232
1015.7 268302232 269373357 270769984 272641271 275362462 278976500 282962590 286667168 289883018
1032 289883018 292738616 295269370 297262460 298472941 298948497 299195439 299940318 301629722 304306060
1050.4 304306060 307919651 312570095 318498611 325938731 334827334 344673485 354436040 362201780
1066.7 362201780 365273714 361771971 352851391 342412353 334183037 329755723 328935951 330690920
1083 330690920 333844721 337675571 342218727 347774655 354132324 360337794 365209192 368216425 369765669
$$ packed form
964.7D31727290j8955350j8659681j8588602j8798858j8741995j7708481j5594303
979C04680020j2967199j0385037q038759n837649l631354j551658o8843O10441Q32289
997.4B63642251J075715J436979J577675J146406K40475n43117o64026j54078N43952
1015.7B68302232J071125J396627J871287K721191L614038L986090L704578L215850
1032B89883018K855598K530754J993090J210481M75556K46942P44879J689404K676338
1050.4C04306060L613591M650444N928516P440120Q888603R846151R762555P765740
1066.7C62201780L071934l501743q920580j0439038q229316m427314q19772J754969
1083C30690920L153801L830850M543156N555928O357669O205470M871398L007233J549244
$$ plain form
1101.4 369765669 370783359 372042000 373833865 376253307 379457742 383452237 387786806 391619027
1117.7 391619027 394262075 395822555 397185624 399376094 402834296 407172829 411484122 414859056
1134 414859056 416561484 415835023 412124813 405674845 397639364 389498800 382301271 376318604 371439517
1152.4 371439517 367667586 365244269 364482224 365476459 368048579 372021943 377601027 385235131 395074517
1170.7 395074517 406675339 419196188 431929410 444783211 458011925 471453935 484324455
1185 484324455 495688021 505139589 512900472 519282937 524280429 527706683 529730141 531165361
1201.3 531165361 532980323 535583854 538774729 542239726 546052933 550600946 555940747 561345696
1217.7 561345696 565688670 568337321 569539309 569959164 569952250 569316030 567780077 565624297 563615561
$$ packed form
1101.4C69765669J017690J258641J791865K419442L204435L994495M334569L832221
1117.7C91619027K643048J560480J363069K190470L458202M338533M311293L374934
1134D14859056J702428p26461l710210o449968q035481q140564p197529n982667m879087
1152.4C71439517l771931k423317p62045R94235K572120L973364N579084P634104R839386
1170.7C95074517J1600822J2520849J2733222J2853801J3228714J3442010J2870520
1185D84324455J1363566R451568P760883O382465M997492L426254K023458J435220
1201.3E31165361J814962K603531L190875L464997L813207M548013N339801N404949
1217.7E61345696M342974K648651J201988M19855o914o36220j535953k155780k008736
$$ plain form
1236 563615561 562325776 561633229 561055958 560550869 560698986 562035680 564388394 566934705 568921745
1254.4 568921745 570273340 571454585 572856665 574386656 575787187 577147722 578877449 581223607
1270.7 581223607 583760738 585594237 586158395 585694253 585021377 584724784 584609807 584087729 582944810
1289 582944810 581578851 580422163 579362988 577887893 575735927 573260307 571068883 569396317 567908645
1307.4 567908645 566220701 564385712 562785029 561700165 560879052 559677660 557607591 554537952
1323.7 554537952 550595760 546029150 541009665 535756350 530836761 526976168 524535418 523328841
1340 523328841 522883117 522786140 522858918 523079813 523343921 523374081 522845030 521752298 520548761 519603014
1360.4 519603014 518773794 517874420 516973078 516207397 516044080 516764045 517941773 518933594 519669354
$$ packed form
1236E63615561j289785o92547n77271n05089J48117J336694K352714K546311J987040
1254.4E68921745J351595J181245J402080J529991J400531J360535J729727K346158
1270.7E81223607K537131J833499N64158m64142o72876k96593j14977n22078j142919
1289E82944810j365959j156688j059175j475095k151966k475620k191424j672566j487672
1307.4E67908645j687944j834989j600683j084864q21113j201392k070069l069639
1323.7E54537952l942192m566610n019485n253315m919589l860593k440750j206577
1340E23328841m45724r6977P2778K20895K64108L0160n29051j092732j203537r45747
1360.4E19603014q29220q99374r01342p65681j63317P19965J177728R91821P35760
$$ plain form
1378.8 519669354 520508230 522095084 525053799 529338479 533638120 536921978 539453626 541186333
1395.1 541186333 541684270 540905237 539474547 538015246 536444187 534803391 533118129 531155348 529198825
1413.5 529198825 527865708 527038515 526160181 525503218 525268257 525402367 526217699 527668178 529318690
1431.8 529318690 530992210 532670438 534177482 535727203 537551641 539195895 540149748 540160179 539545298
1450.2 539545298 538940430 538468599 536986530 533902407 532295406 532836437 535000443 538306177 542567670
1468.5 542567670 548789322 558164835 568253398 576783776 584293067 591366231 598384380 605292499
1484.9 605292499 612340868 619129360 624479890 628566623 632937849 637952864 642167270 645399213
1501.2 645399213 648625970 652782023 657318473 659832060 661601663 663793862 666521609 669628441
$$ packed form
1378.8E19669354Q38876J586854K958715M284680M299641L283858K531648J732707
1395.1E41186333M97937p79033j430690j459301j571059j640796j685262j962781j956523
1413.5E29198825j333117q27193q78334o56963k34961J34110Q15332J450479J650512
1431.8E29318690J673520J678228J507044J549721J824438J644254R53853J0431o14881
1450.2E39545298o04868m71831j482069l084123j607001N41031K164006L305734M261493
1468.5E42567670O221652R375513J0088563Q530378P509291P073164P018149O908119
1484.9F05292499P048369O788492N350530M086733M371226N015015M214406L231943
1501.2F45399213L226757M156053M536450K513587J769603K192199K727747L106832
$$ plain form
1517.5 669628441 672681212 675330520 676995575 678117990 679357350 680949152 682892799 684458435
1533.8 684458435 685628831 687399507 689511836 690031230 689463913 688920319 688809037 689087033 689613104
1552.2 689613104 690569282 691965163 692273021 689808547 688333333 688090444 688130915 687772036 686607182
1570.5 686607182 685872138 685783923 685000956 683563709 682314813 681108832 680002272 678949714 677681804
1588.9 677681804 676016271 674072266 672041595 670076847 668126702 665834785 663035393 660032392
1605.2 660032392 657079875 653923631 650583804 647450209 643799245 638865411 635037601 632301927
1621.5 632301927 628757179 624828219 621144176 617868960 615891993 614703894 612403512 609597385
1637.8 609597385 608160257 607995629 608815134 609926522 610712945 611893952 614148617 616652846 618348062
$$ packed form
1517.5F69628441L052771K649308J665055J122415J239360J591802J943647J565636
1533.8F84458435J170396J770676K112329N19394n67317n43594j11282K77996N26071
1552.2F89613104R56178J395881L07858k464474j475214k42889M0471l58879j164854
1570.5F86607182p35044q8215p82967j437247j248896j205981j106560j052558j267910
1588.9F77681804j665533j944005k030671j964748j950145k291917k799392l003001
1605.2F60032392k952517l156244l339827l133595l650964m933834l827810k735674
1621.5F32301927l544748l928960l684043l275216j976967j188099k300382k806127
1637.8F09597385j437128j64628Q19505J111388P86423J181007K254665K504229J695216
$$ plain form
1656.2 618348062 620388269 623267829 626951993 631003499 635062575 639566123 644203246 648290515
1672.5 648290515 652859271 657925844 662606835 667311847 672609031 678323209 682769179 686609507
1688.8 686609507 690631032 694532275 698880374 703434408 707082093 709784746 711639762 713174701
1705.1 713174701 714618862 716159821 718091011 720346928 722554207 724017680 724673092 725505888 726665556
1723.5 726665556 728056371 729842484 732199848 734774113 736739099 737894535 739230692 740984857
1739.8 740984857 742963791 745194852 747671723 750229418 752616346 754853666 757232845 759804010
1756.1 759804010 762316763 764628828 766798556 768845141 770971835 773206234 775288224 776731014
1772.4 776731014 777568758 778530777 779749811 780880272 781780601 782630205 783637464 784963310 786333025
$$ packed form
1656.2F18348062K040207K879560L684164M051506M059076M503548M637123M087269
1672.5F48290515M568756N066573M680991M705012N297184N714178M445970L840328
1688.8F86609507M021525L901243M348099M554034L647685K702653J855016J534939
1705.1G13174701J444161J540959J931190K255917K207279J463473O55412Q32796J159668
1723.5G26665556J390815J786113K357364K574265J964986J155436J336157J754165
1739.8G40984857J978934K231061K476871K557695K386928K237320K379179K571165
1756.1G59804010K512753K312065K169728K046585K126694K234399K081990J442790
1772.4G76731014Q37744R62019J219034J130461R00329Q49604J007259J325846J369715
$$ plain form
1790.8 786333025 787171960 787643909 788371563 789359391 790239811 790847301 791426420 792207360 793130219 793919384
1811.2 793919384 794459939 794959664 795485914 796100020 796957612 797922730 798698366 799346864 799847841 800058782
1831.6 800058782 800360322 800796032 801083982 801403642 802059233 802720249 802914679 802845657 802789330 802884996
1852 802884996 803171039 803553343 803835750 803962171 804110706 804540753 805239499 805672646 805503070 805272579
1872.4 805272579 805376947 805731237 806155384 806483269 806717873 807012677 807498634 808029652 808334827 808494210
1892.8 808494210 808637917 808781743 808987021 809242547 809439838 809575319 809720874 809863567 809963644 810098708
1913.2 810098708 810352206 810556889 810636103 810784221 810914457 810895324 810867608 810902655 811023414 811217904
1933.6 811217904 811376512 811501443 811697006 811912000 811995924 812017322 812078834 812187135 812357962 812583327
$$ packed form
1790.8G86333025Q38935M71949P27654R87828Q80420O07490N79119P80940R22859P89165
1811.2G93919384N40555M99725N26250O14106Q57592R65118P75636O48498N00977K10941
1831.6H00058782L01540M35710K87950L19660O55591O61016J94430o9022n6327R5666
1852H02884996K86043L82304K82407J26421J48535M30047O98746M33147j69576k30491
1872.4H05272579J04368L54290M24147L27885K34604K94804M85957N31018L05175J59383
1892.8H08494210J43707J43826K05278K55526J97291J35481J45555J42693J00077J35064
1913.2H10098708K53498K04683P9214J48118J30236j9133k7716L5047J20759J94490
1933.6H11217904J58608J24931J95563K14994Q3924K1398O1512J08301J70827K25365
$$ plain form
1954 812583327 812826991 813064098 813268185 813415408 813594759 813829660 814005911 814108729 814161122 814179480
1974.4 814179480 814265251 814452231 814636707 814738870 814792931 814874411 815015972 815164030 815157712 815022051
1994.8 815022051 814947546 814972281 815025508 815014720 814895868 814695895 814481735 814316452 814203560 814036012
2015.2 814036012 813658655 813072622 812442064 811787069 811169505 810886800 810844064 810704172 810473740 810238659
2035.6 810238659 809940338 809529960 809101939 808774054 808564305 808399200 808183134 807945967 807818651 807839394
2056 807839394 807911217 807940125 807942271 807970047 808029532 808117151 808191121 808210075 808203459 808255434 808374941 808467865
2080.4 808467865 808514178 808565855 808640361 808740258 808850825 808943391 809036732 809147358 809289515 809475601 809665620
2102.9 809665620 809807539 809891284 809987843 810128689 810276330 810406685 810483038 810487211 810460448 810468316 810533822
$$ packed form
1954H12583327K43664K37107K04087J47223J79351K34901J76251J02818N2393J8358
1974.4H14179480Q5771J86980J84476J02163N4061Q1480J41561J48058o318j35661
1994.8H15022051p4505K4735N3227j0788j18852j99973k14160j65283j12892j67548
2015.2H14036012l77357n86033o30558o54995o17564k82705m2736j39892k30432k35081
2035.6H10238659k98321m10378m28021l27885k09749j65105k16066k37167j27316K0743
2056H07839394P1823K8908K146K7776N9485Q7619P3970J8954o616N1975J19507R2924
2080.4H08467865M6313N1677P4506R9897J10567R2566R3341J10626J42157J86086J90019
2102.9H09665620J41919Q3745R6559J40846J47641J30355P6353M173k6763P868O5506
$$ plain form
2125.3 810533822 810598075 810631633 810657918 810658276 810653567 810709596 810794711 810826957 810823798 810865760 810975075 811089277
2149.8 811089277 811156571 811234057 811362982 811525583 811732948 811988056 812271237 812565088 812878311 813283205
2170.2 813283205 813788712 814281225 814710915 815120518 815560758 816036284 816518664 816988587 817409158 817768633
2190.6 817768633 818144798 818584025 818988860 819305062 819601238 819950163 820373058 820815861 821198165 821511745
2211 821511745 821847737 822264194 822696328 823076189 823394716 823667884 823952198 824283779 824603438 824851096
2231.4 824851096 825070441 825307965 825559497 825824440 826059997 826240122 826430202 826677024 826946080 827189267
2251.8 827189267 827386141 827551305 827739537 827994347 828287840 828541577 828717530 828860760 829062760 829345524
2272.2 829345524 829602063 829752088 829838336 829957008 830173194 830478728 830796540 831065238 831312060 831598639
$$ packed form
2125.3H10533822O4253L3558K6285L58m709N6029Q5115L2246l159M1962J09315J14202
2149.8H11089277O7294P7486J28925J62601K07365K55108K83181K93851L13223M04894
2170.2H13283205N05507M92513M29690M09603M40240M75526M82380M69923M20571L59475
2190.6H17768633L76165M39227M04835L16202K96176L48925M22895M42803L82304L13580
2211H21511745L35992M16457M32134L79861L18527K73168K84314L31581L19659K47658
2231.4H24851096K19345K37524K51532K64943K35557J80125J90080K46822K69056K43187
2251.8H27189267J96874J65164J88232K54810K93493K53737J75953J43230K02000K82764
2272.2H29345524K56539J50025Q6248J18672K16186L05534L17812K68698K46822K86579
$$ plain form
2292.5 831598639 831947386 832325041 832687438 833017468 833376884 833892703 834563434 835237741 835784674 836199582
2312.9 836199582 836694300 837492168 838488936 839375496 839993477 840497553 841137171 841867745 842303216 842317283
2333.3 842317283 842293441 842420340 842542112 842428148 841615915 839921951 838604033 838815808 840402782
2351.7 840402782 842505991 844292700 845365703 845570624 845101655 844132006 842682600 840900779 838945210
2370.1 838945210 836914361 834992588 833284080 831725836 830313087 829132974 828277469 827774823 827485979
2388.4 827485979 827219725 826962531 826769412 826605618 826421082 826169312 825841665 825507104 825227678 824968755
2408.8 824968755 824655712 824260533 823814631 823389947 823009014 822612882 822128117 821565926 821021020 820562899
2429.2 820562899 820156753 819692850 819112778 818490386 817935467 817450702 816942573 816337645 815662146 815013170
$$ packed form
2292.5H31598639L48747L77655L62397L30030L59416N15819O70731O74307N46933M14908
2312.9H36199582M94718P97868R96768Q86560O17981N04076O39618P30574M35471J4067
2333.3H42317283k3842J26899J21772j13964q12233j693964j317918K11775J586974
2351.7H40402782K103209J786709J073003K04921m68969r69649j449406j781821j955569
2370.1H38945210k030849j921773j708508j558244j412749j180113q55505n02646k88844
2388.4H27485979k66254k57194j93119j63794j84536k51770l27647l34561k79426k58923
2408.8H24968755l13043l95179m45902m24684l80933l96132m84765n62191n44906m58121
2429.2H20562899m06146m63903n80072o22392n54919m84765n08129o04928o75499o48976
$$ plain form
2449.6 815013170 814480007 814048946 813605249 813065588 812480628 811959982 811498284 811025083 810511470 809969366
2470 809969366 809460163 809023976 808623433 808194280 807710946 807203352 806739509 806368589 806030452 805624485
2490.4 805624485 805167317 804792583 804551840 804329932 804045737 803707242 803363144 803089917 802903831 802702546
2510.8 802702546 802361429 801905096 801483333 801195085 800970256 800634146 800115585 799543381 799068451 798665881
2531.2 798665881 798197567 797564209 796822190 796147108 795621157 795138955 794573128 793920815 793264151 792697251
2551.6 792697251 792213202 791678250 790994346 790250003 789633155 789203703 788837194 788342118 787664592 786970794
2572 786970794 786417127 785963714 785454929 784821332 784166634 783613861 783191621 782839358 782422245 781896591
2592.4 781896591 781425655 781131268 780894279 780541301 780017316 779410541 778865039 778420210 777957618 777325928
$$ packed form
2449.6H15013170n33163m31061m43697n39661n84960n20646m61698m73201n13613n42104
2470H09969366n09203m36187m00543m29153m83334n07594m63843l70920l38137m05967
2490.4H05624485m57168l74734k40743k21908k84195l38495l44098k73227j86086k01285
2510.8H02702546l41117m56333m21763k88248k24829l36110n18561n72204m74930m02570
2531.2G98665881m68314o33358p42019o75082n25951m82202n65827o52313o56664n66900
2551.6G92697251m84049n34952o83904p44343o16848m29452l66509m95076o77526o93798
2572G86970794n53667m53413n08785o33597o54698n52773m22240l52263m17113n25654
2592.4G81896591m70936k94387k36989l52978n23985o06775n45502m44829m62592o31690
$$ plain form
2612.8 777325928 776548922 775775850 775048018 774273932 773369014 772324681 771230757 770210385 769262135
2631.1 769262135 768274069 767157793 765964329 764811635 763746619 762741446 761673570 760445237
2647.4 760445237 759175539 758061230 757109821 756157875 755075097 753915489 752821624 751854718 750953197
2665.8 750953197 749972343 748884261 747833669 746921480 746107101 745293140 744415998 743491948 742611527
2684.1 742611527 741821766 741029859 740146339 739199579 738238513 737294614 736369133 735415697 734383702
2702.5 734383702 733269095 732141614 731083214 730085075 729037702 727885604 726743877 725745320 724870682
2720.9 724870682 724020660 723129869 722201228 721320450 720558822 719850123 719095170 718304753 717540741 716852486
2741.2 716852486 716221929 715546668 714791894 714054406 713398874 712776542 712145448 711493433 710839868 710247159
$$ packed form
2612.8G77325928p77006p73072p27832p74086r04918j044333j093924j020372r48250
2631.1G69262135r88066j116276j193464j152694j065016j005173j067876j228333
2647.4G60445237j269698j114309r51409r51946j082778j159608j093865r66906r01521
2665.8G50953197r80854j088082j050592r12189q14379q13961q77142r24050q80421
2684.1G42611527p89761p91907q83520r46760r61066r43899r25481r53436j031995
2702.5G34383702j114607j127481j058400r98139j047373j152098j141727r98557q74638
2720.9G24870682q50022q90791r28641q80778p61628p08699p54953p90417p64012o88255
2741.2G16852486o30557o75261p54774p37488o55532o22332o31094o52015o53565n92709
$$ plain form
2761.6 710247159 709709048 709195375 708679557 708077371 707368672 706626832 705882549 705109537 704260349 703291893
2782 703291893 702253103 701262593 700313270 699239731 697959006 696564913 695161939 693778574 692355573
2800.4 692355573 690786123 689063251 687283516 685519278 683752120 681890845 679873109 677740991
2816.7 677740991 675593913 673452139 671234131 668893218 666455567 663946331 661366582 658729672
2833 658729672 656012595 653129876 650035143 646755993 643310249 639662683 635801196 631847978 628087461
2851.4 628087461 624763370 621861458 619200051 616513312 613498926 610049546 606165648 601800025
2867.7 601800025 597014070 591930509 586637855 581283271 576129079 571430326 567310393 563830376
2884 563830376 561038792 558943093 557476997 556473792 555713117 555026174 554341733 553647757 552844763
$$ packed form
2761.6G10247159n38111n13673n15818o02186p08699p41840p44283p73012q49188r68456
2782G03291893j038790r90510r49323j073539j280725j394093j402974j383365j423001
2800.4F92355573j569450j722872j779735j764238j767158j861275k017736k132118
2816.7F77740991k147078k141774k218008k340913k437651k509236k579749k636910
2833F58729672k717077k882719l094733l279150l445744l647566l861487l953218l760517
2851.4F28087461l324091k901912k661407k686739l014386l449380l883898m365623
2867.7F01800025m785955n083561n292654n354584n154192m698753m119933l480017
2884E63830376k791584k095699j466096j003205p60675o86943o84441o93976q02994
$$ plain form
2902.4 552844763 551754057 550314605 548528433 546332538 543667734 540508270 536894381 533062756
2918.7 533062756 529347181 526007771 523226261 521125436 519800484 519376993 520058155 521949351 524951875
2937 524951875 528904617 533567846 538693786 544137180 549708307 555287659 560925961 566611648 572282910
2955.4 572282910 577893555 583398640 588725388 593719959 598325253 602663934 606836379 610827863
2971.7 610827863 614620686 618306696 621996641 625603557 628888071 631759882 634304345 636626720
2988 636626720 638842702 640888512 642590880 643956482 644960463 645596862 645991385 646121502 645926237
3006.4 645926237 645516515 644984066 644217849 643083811 641640186 640048683 638348877 636487544 634460330
3024.7 634460330 632297099 630102336 627936840 625704288 623289824 620761454 618308902 615871072
$$ packed form
2902.4E52844763j090706j439452j786172k195895k664804l159464l613889l831625
2918.7E33062756l715575l339410k781510k100825j324952m23491O81162J891196L002524
2937E24951875L952742M663229N125940N443394N571127N579352N638302N685687N671262
2955.4E72282910N610645N505085N326748M994571M605294M338681M172445L991484
2971.7F10827863L792823L686010L689945L606916L284514K871811K544463K322375
2988F36626720K215982K045810J702368J365602J003981O36399L94523J30117j95265
3006.4F45926237m09722n32449p66217j134038j443625j591503j699806j861333k027214
3024.7F34460330k163231k194763k165496k232552k414464k528370k452552k437830
$$ plain form
3041.1 615871072 613267720 610498965 607660949 604884446 602158487 599371254 596542239 593690455
3057.4 593690455 590843379 588081419 585360289 582631350 579873860 577002704 574070692 571238220
3073.7 571238220 568569601 565980136 563251674 560338140 557412326 554536879 551723599 548933327
3090 548933327 546028137 543060482 540217042 537546217 534887493 532076776 529262364 526652575 524110198
3108.4 524110198 521426797 518778086 516371012 514020026 511488259 508693874 505739212 502903819
3124.7 502903819 500330508 497899592 495410055 492821306 490317315 488032848 485782355 483293355
3141 483293355 480668664 478190005 475902647 473777533 471760631 469602406 467177838 464738548 462475717
3159.4 462475717 460299999 458145767 456019670 453930289 451910853 449944526 447990298 446040779
$$ packed form
3041.1F15871072k603352k768755k838016k776503k725959k787233k829015k851784
3057.4E93690455k847076k761960k721130k728939k757490k871156k932012k832472
3073.7E71238220k668619k589465k728462k913534k925814k875447k813280k790272
3090E48933327k905190k967655k843440k670825k658724k810717k814412k609789k542377
3108.4E24110198k683401k648711k407074k350986k531767k794385k954662k835393
3124.7E02903819k573311k430916k489537k588749k503991k284467k250493k489000
3141D83293355k624691k478659k287358k125114k016902k158225k424568k439290k262831
3159.4D62475717k175718k154232k126097k089381k019436j966327j954228j949519
$$ plain form
3175.7 446040779 444111019 442224443 440350384 438465804 436625957 434856415 433103561 431351572
3192 431351572 429631561 427950561 426312506 424701810 423085690 421486974 419952959 418425590 416875154
3210.3 416875154 415396094 414006323 412664711 411345154 410000622 408624440 407268733 405977130
3226.7 405977130 404781848 403736621 402738869 401493043 400045007 398747861 397645891 396616936
3243 396616936 395648509 394653469 393528968 392399907 391448617 390593529 389631569 388627797 387739599
3261.3 387739599 386914790 386091083 385353535 384750158 384086370 383222491 382269293 381338775 380489379 379721105
3281.7 379721105 378988355 378279626 377635390 377086520 376528531 375882387 375147104 374233961 373274535 372620106
3302.1 372620106 372240186 371728063 370872796 369801253 368712425 367726743 366819590 365928143 365066111
$$ packed form
3175.7D46040779j929760j886576j874059j884580j839847j769542j752854j751989
3192D31351572j720011j681000j638055j610696j616120j598716j534015j527369j550436
3210.3D16875154j479060j389771j341612j319557j344532j376182j355707j291603
3226.7D05977130j195282j045227r97752j245826j448036j297146j101970j028955
3243C96616936r68427r95040j124501j129061r51290q55088r61960j003772q88198
3261.3C87739599q24809q23707p37548o03377o63788q63879r53198r30518q49396p68274
3281.7C79721105p32750p08729o44236n48870n57989o46144p35283r13143r59426o54429
3302.1C72620106l79920n12123q55267j071543j088828r85682r07153q91447q62032
$$ plain form
3320.5 365066111 364262611 363499701 362644792 361649543 360660285 359777749 359050035 358417869 357657194 356714755
3340.9 356714755 355702221 354636967 353652626 352904826 352120727 351027817 349851280 348857731 347987473
3359.2 347987473 347081453 346194446 345536113 344979495 344116747 342879355 341667354 340771407 340027690
3377.6 340027690 339269936 338494182 337726831 337063998 336645454 336505175 336319447 335759133 335088819 334786177
3398 334786177 334726781 334319413 333528608 332930982 332666337 332436800 332110822 331681341 331249803 331005663
3418.4 331005663 330884755 330735832 330686122 330857873 331113636 331250906 331405133 331735462 331943780 331845433
3438.8 331845433 331745774 331888616 332231134 332657516 333041608 333407968 333844781 334349483 334959924 335671604
3459.2 335671604 336287796 336913317 337905318 339061558 339771003 339964896 340229183 340883046 341847867
$$ packed form
3320.5C65066111q03500p62910q54909r95249r89258q82536p27714o32166p60675r42439
3340.9C56714755j012534j065254r84341p47800p84099j092910j176537r93549q70258
3359.2C47987473r06020q87007o58333n56618q62748j237392j212001q95947p43717
3377.6C40027690p57754p75754p67351o62833m18544j40279j85728n60314o70314l02642
3398C34786177n9396m07368p90805n97626k64645k29537l25978m29481m31538k44140
3418.4C31005663j20908j48923m9710J71751K55763J37270J54227L30329K08318r8347
3438.8C31845433r9659J42842L42518M26382L84092L66360M36813N04702O10441P11680
3459.2C35671604O16192O25521R92001J156240P09445J93893K64287O53863R64821
$$ plain form
3477.5 341847867 342806578 343435198 344017982 344900578 345815688 346569270 347396940 348391771 349467099
3495.9 349467099 350481838 351417571 352346987 353123397 353771836 354562312 355584532 356790841 357946157
3514.2 357946157 358865082 359771103 360924363 362289727 363472641 364280760 365074307 366172105 367546022
3532.6 367546022 369029105 370376438 371530801 372870535 374531329 376093119 377250761 378367305
3548.9 378367305 379722714 381187916 382747382 384491503 386443108 388538957 390580028 392424852
3565.2 392424852 394369543 396631330 398921221 401184708 403640836 406294793 409115970 412180632
3581.5 412180632 415359318 418300360 420984149 423916906 427013814 430069923 433317482 436858714
3597.9 436858714 440435827 443958879 447437286 450755984 454156965 457821608 461563706 465387344
$$ packed form
3477.5C41847867R58711O28620N82784Q82596R15110P53582Q27670R94831J075328
3495.9C49467099J014739R35733R29416P76410O48439P90476J022220J206309J155316
3514.2C57946157R18925R06021J153260J365364J182914Q08119P93547J097798J373917
3532.6C67546022J483083J347333J154363J339734J660794J561790J157642J116544
3548.9C78367305J355409J465202J559466J744121J951605K095849K041071J844824
3565.2C92424852J944691K261787K289891K263487K456128K653957K821177L064662
3581.5D12180632L178686K941042K683789K932757L096908L056109L247559L541232
3597.9D36858714L577113L523052L478407L318698L400981L664643L742098L823638
$$ plain form
3614.2 465387344 469116986 472729117 476623714 480557829 484322786 487816721 491163522 494998634
3630.5 494998634 498849452 502473652 506047010 509619057 513368368 517393768 521468341 525352240
3646.8 525352240 529119194 532847285 536264956 539422214 542920232 546620131 549942374 553134501
3663.1 553134501 556591451 559973001 563061059 566466928 569660664 572107375 574648857 577336788
3679.4 577336788 580002308 582955360 586174309 589214087 591450274 593220949 595253110 597495675
3695.8 597495675 599728107 601768613 603600681 605560958 607734323 609855473 611510813 612674892
3712.1 612674892 614124238 615930557 617810369 619634211 621293962 622653544 623917282 625582039
3728.4 625582039 627490222 629233897 630452752 631321192 632601380 634058714 634793520 635243058 636658132
$$ packed form
3614.2D65387344L729642L612131L894597L934115L764957L493935L346801L835112
3630.5D94998634L850818L624200L573358L572047L749311M025400M074573L883899
3646.8E25352240L766954L728091L417671L157258L498018L699899L322243L192127
3663.1E53134501L456950L381550L088058L405869L193736K446711K541482K687931
3679.4E77336788K665520K953052L218949L039778K236187J770675K032161K242565
3695.8E97495675K232432K040506J832068J960277K173365K121150J655340J164079
3712.1F12674892J449346J806319J879812J823842J659751J359582J263738J664757
3728.4F25582039J908183J743675J218855Q68440J280188J457334P34806M49538J415074
$$ plain form
3746.7 636658132 637813509 638042212 638737202 640145600 641362131 642191172 643151700 644302011 645393133
3765.1 645393133 646377444 647066832 647686779 648640573 649831891 650975049 651842892 652582884 653280675
3783.5 653280675 653934896 654697835 655640244 656734169 657779038 658741772 659834504 660595179 660981655
3801.8 660981655 661714733 662198901 662477911 663363993 664588869 665475070 666128218 667065680 667497456
3820.2 667497456 667664111 668361366 669086158 669795036 670569718 671459138 672568738 673350751 673448145 673469841
3840.6 673469841 673728168 674293697 675307393 676645160 677540958 676870584 676184773 677102327 678276539
3858.9 678276539 679078817 679439366 679811716 680409312 680701435 680893123 681232631 681745589 682476938 682991266
3879.3 682991266 683447063 683907270 684055030 684367776 684797585 684995115 685369790 686023295 686629653 687101960
$$ packed form
3746.7F36658132J155377K28703O94990J408398J216531Q29041R60528J150311J091122
3765.1F45393133R84311O89388O19947R53794J191318J143158Q67843P39992O97791
3783.5F53280675O54221P62939R42409J093925J044869R62734J092732P60675L86476
3801.8F60981655P33078M84168K79010Q86082J224876Q86201O53148R37462M31776
3820.2F67497456J66655O97255P24792P08878P74682Q89420J109600P82013R7394K1696
3840.6F73469841K58327N65529J013696J337767Q95798o70374o85811R17554J174212
3858.9F78276539Q02278L60549L72350N97596K92123J91688L39508N12958P31349N14328
3879.3F82991266M55797M60207J47760L12746M29809J97530L74675O53505O06358M72307
$$ plain form
3899.7 687101960 687266588 687026560 686952710 687223971 687558651 688034713 688609302 688941121 689073205 689342380
3920.1 689342380 689653754 689763725 689886212 690192044 690416276 690542519 690781891 691085160 691417694 691686094
3940.5 691686094 691833913 692098856 692432940 692597389 692660451 692808568 693101406 693425894 693649352 693783641
3960.9 693783641 693957627 694201112 694382608 694470406 694583058 694778204 695018232 695251226 695446193 695649028
3981.3 695649028 695852637 695968270 696050584 696238637 696490824 696671188 696825564 697039843
3997.6 697039843
$$ packed form
3899.7F87101960J64628k40028p3850K71261L34680M76062N74589L31819J32084K69175
3920.1F89342380L11374J09971J22487L05832K24232J26243K39372L03269L32534K68400
3940.5F91686094J47819K64943L34084J64449O3062J48117K92838L24488K23458J34289
3960.9F93783641J73986K43485J81496Q7798J12652J95146K40028K32994J94967K02835
3981.3F95649028K03609J15633Q2314J88053K52187J80364J54376K14279
3997.6F97039843
##END=$$ End of the data block
