##TITLE=$$ Begin of the data block
##JCAMP-DX=5.00 $$ ACD/SpecManager v 10.08
##SPECTROMETER/DATA SYSTEM=Alpha
##DATE=23 Dec 2014 14:28:26
##DATA TYPE=INFRARED SPECTRUM
##DATA CLASS=XYDATA
##ORIGIN=
##OWNER=
##NPOINTS=1765
##FIRSTX=399.76428223
##LASTX=3997.64306641
##MAXX=3997.64306641
##MINX=399.76428223
##MAXY=0.84578937
##MINY=0.26211569
##XFACTOR=1.0000000000
##YFACTOR=1.000000000000000e-9
##FIRSTY=0.55682862
##DELTAX=2.03961372
##XUNITS=1/CM
##YUNITS=ARBITRARY UNITS
##XYDATA=(X++(Y..Y))
399.8E56828618p351398n130768k023757O15776J620650J250208R13918J682877K343595
418.1E50749719l70085l686786m151106k868592j595855j882553l139615l767908k481461
436.5E26805758P92385L930747M570604L154695K688586L645361M135668K716780J94251
454.8E52634835j536309j825333q73625r24528k746999m458309m152953k361357j613379
473.2E32142043k677977l637731k883673p07686J037240Q18730q01027j698554r68396
491.5E20622969K06530j16885j996994l392816l059506j660824j131594k599716m507601
509.9E02363563m912198l780663k659082l293008m932851m971653k731234k9623R27150
528.3D75980401J28299m21762J048535M164934O542444O318778M013002J933425J535416
$$ plain form
399.8 556828618 549477220 544346452 542322695 542938471 544559121 545809329 546723247 548406124 550749719
418.1 550749719 550379634 546692848 542541742 539673150 538077295 536194742 533055127 529287219 526805758
436.5 526805758 527598143 531528890 536099494 539254189 541942775 545588136 549723804 552440584 552634835
454.8 552634835 551098526 549273193 548399568 547475040 544728041 540269732 536116779 533755422 532142043
473.2 532142043 529464066 525826335 522942662 522234976 523272216 524090946 523289919 521591365 520622969
491.5 520622969 520829499 520712614 518715620 515322804 512263298 510602474 509470880 506871164 502363563
509.9 502363563 497451365 493670702 491011620 487718612 482785761 477814108 475082874 475053251 475980401
528.3 475980401 476108700 475686938 476735473 480900407 487442851 493761629 497774631 499708056 501243472
546.6E01243472J633287L48329k155423l974170l901392l067672l317773n051613p043183
565D74713862p726461o594121m501432k616913j231312M89264L409774O560832Q044571
583.3D70548064P339894N640179M448623M021734L228545J377255o99163j352638k79814
601.7D94272679Q31217P79479j01417m67241P00593K615601L665716L282308K415180
620E07994115K629161M118145N231142M504502K527117J267612J770199K967000L036379
638.4E36045372J557708m3511N4240J755715K903521J985788J32441m48346Q22664
656.8E44765592K385318K280593O40571j52886J229227K897799J973509J038015L08335
675.1E57366073K97725J878143L286957K571464L82185r53019l06189J022578Q02457
$$ plain form
546.6 501243472 502876759 503225088 501069665 497095495 493194103 490126431 486808658 481757045 474713862
565 474713862 466987401 460393280 455891848 453274935 452043623 452532887 455942661 462503493 470548064
583.3 470548064 477887958 483528137 487976760 491998494 495227039 496604294 495905131 494552493 494272679
601.7 494272679 495103896 495883375 495781958 495314717 496015310 498630911 502296627 505578935 507994115
620 507994115 510623276 514741421 519972563 524477065 527004182 528271794 530041993 533008993 536045372
638.4 536045372 537603080 537559569 537613809 539369524 542273045 544258833 544391274 543942928 544765592
656.8 544765592 547150910 549431503 550072074 549919188 551148415 554046214 556019723 557057738 557366073
675.1 557366073 557663798 559541941 562828898 565400362 565782547 564829528 564523339 565545917 566348374
693.5E66348374j394808l753007m195809k744317j446903j654148k325833j570404
709.8E47263145J066447L996908N193770M566968L947794M823327O732583P725776
726.1E85316718O412923L986001K898514L686667M594981L694237J116812j119137
742.4F10587716j536071r83596j450002l590465n852043o296337m864097l224015k826750
760.8E79964340l262818k632797J19805L909469O637395P295370P103622P795155R277701
779.1F16207242R841383Q220911N315542L406226L660918M955828N251407L913165
795.4F60772622K611935L102004M781902N497098M026592J531362L09050J177371K569854
813.8F86379790K318919J86443j777947j876950p55072o02900k614379n376757o521761
$$ plain form
693.5 566348374 564953566 561200559 557004750 554260433 552813530 551159382 548833549 547263145
709.8 547263145 548329592 552326500 557520270 562087238 566035032 570858359 577590942 585316718
726.1 585316718 591729641 595715642 598614156 602300823 606895804 610590041 611706853 610587716
742.4 610587716 609051645 608068049 606618047 603027582 597175539 590879202 586015105 582791090 579964340
760.8 579964340 576701522 574068725 574188530 578097999 584735394 592030764 599134386 606929541 616207242
779.1 616207242 626048625 634269536 639585078 642991304 646652222 651608050 656859457 660772622
795.4 660772622 663384557 666486561 671268463 676765561 680792153 682323515 682632565 683809936 686379790
813.8 686379790 688698709 688885152 687107205 685230255 684475183 683872283 681257904 675881147 669359386
832.2F69359386n529881m209458m368902n696416o244838m957497k977669k295792
848.5F33078933l508091n204976n722761m803061l227950j279831J520336N256415
864.8F16109014R268701J2508154J3493716J1382222P607043M654706L036737J022637
881.1F79082930k416432o007314p785677p199586n680144n199969o052732o764174
897.4F31976902o173670m868090m556477o101906q432448r791613r750724r404897
913.7E72897077r735942j0273814r573162o955683l467560r61423k55227k83539N39898
932.1E31930625K428234M251421M961133M596948L888846K857625N41449l544092q488596
950.5E43423593j2580574j4724910j5347540j5732825j6707420j8017769j8851608
$$ plain form
832.2 669359386 663829505 659620047 655251145 649554729 643309891 638352394 635374725 633078933
848.5 633078933 629570842 624365866 618643105 613840044 610612094 609332263 610852599 616109014
864.8 616109014 625377715 637885869 651379585 662761807 670368850 675023556 678060293 679082930
881.1 679082930 676666498 670659184 662873507 655673921 649993777 644793808 638741076 631976902
897.4 631976902 625803232 620935142 616378665 610276759 601844311 592052698 582301974 572897077
913.7 572897077 563161135 552887321 543314159 536358476 532890916 531929493 531674266 531390727 531930625
932.1 531930625 534358859 538610280 543571413 548168361 552057207 554914832 555456281 551912189 543423593
950.5 543423593 530843019 516118109 500770569 485037744 468330324 450312555 431460947
964.7D31460947j8900842j8650442j8638641j8841803j8718004j7636240j5542238
979C04532737j2944609j0349334q002579n808830l605753j577586j28359O20157R22769
997.4B63658613J123458J385182J546473J191735K82317n44697p03543j82837N67436
1015.7B68324137J096368J397848J872778K689480L532201L934145L717125L227174
1032B89791256K858818K562672K012491J172006M43250K92003Q08686J719773K692968
1050.4C04353923L622114M666448N956948P451325Q868277R798050R698928P720828
1066.7C62136841L067225l473341q884758j0424555q226662m428715q24749J764297
1083C30705583L189683L873259M544794N540431O351382O173044M845798L040671J619578
$$ plain form
964.7 431460947 412560105 393909663 375271022 356429219 337711215 320074975 304532737
979 304532737 291588128 281238794 273236215 267427385 263821632 262244046 262115687 262735844 263658613
997.4 263658613 264782071 266167253 267713726 268905461 269187778 268643081 267939538 267756701 268324137
1015.7 268324137 269420505 270818353 272691131 275380611 278912812 282846957 286564082 289791256
1032 289791256 292650074 295212746 297225237 298397243 298840493 299132496 299941182 301660955 304353923
1050.4 304353923 307976037 312642485 318599433 326050758 334919035 344717085 354416013 362136841
1066.7 362136841 365204066 361730725 352845967 342421412 334194750 329766035 328941286 330705583
1083 330705583 333895266 337768525 342313319 347853750 354205132 360378176 365223974 368264645 369884223
1101.4C69884223J049757J203775J718730K402961L229380M022866M346580L836393
1117.7C91694665K645373J552373J372546K228886L445179M251360M250020L365279
1134D14805681J692265p34955l688842o399274p978261q128315p222921n963623m842699
1152.4C71539056l768593k403229p16418J011640K535462L916502N549222P632077
1168.7C85295719R840548J1591047J2505919J2733668J2870341J3250977J3448417
1183D71536636J2857318J1368752R449720P735908O379545N008101L430248K037346
1199.3E29803574J441538J792372K583325L190159L483057L830970M542708N331278
1215.6E55998981N411386M345537K605915J146674M23014L8266o04570j545786k165974
$$ plain form
1101.4 369884223 370933980 372137755 373856485 376259446 379488826 383511692 387858272 391694665
1117.7 391694665 394340038 395892411 397264957 399493843 402939022 407190382 411440402 414805681
1134 414805681 416497946 415762991 412074149 405674875 397696614 389568299 382345378 376381755 371539056
1152.4 371539056 367770463 365367234 364650816 365662456 368197918 372114420 377663642 385295719
1168.7 385295719 395136267 406727314 419233233 431966901 444837242 458088219 471536636
1183 471536636 484393954 495762706 505212426 512948334 519327879 524335980 527766228 529803574
1199.3 529803574 531245112 533037484 535620809 538810968 542294025 546124995 550667703 555998981
1215.6 555998981 561410367 565755904 568361819 569508493 569931507 569969773 569365203 567819417 565653443
1234E65653443j975178j272738p31528n89311m55678J88589J335800K340019K545833
1252.3E67039251J981199J347959J217425J447737J537264J356423J298844J720667
1268.6E78946769K366781K542556J845062N74886m59313o49214k68161j15693n41448
1287E84242225j162947j386284j147569j022160j451909k133668k449274k193212j703859
1305.4E69591343j508414j691163j831412j593113j074612q07703j196444k092242
1321.7E57796240l093958l919542m531503n040347n312264m959345l856421k404451
1338E24678409j176417m41432j03533P4506K43783K88307K4140n62906j137555j227319
1358.4E20659983r24289q02100r07421r03666p37846j42693P32839J188040R67443
$$ plain form
1234 565653443 563678265 562405527 561673999 561084688 560629010 560817599 562153399 564493418 567039251
1252.3 567039251 569020450 570368409 571585834 573033571 574570835 575927258 577226102 578946769
1268.6 578946769 581313550 583856106 585701168 586276054 585816741 585167527 584899366 584783673 584242225
1287 584242225 583079278 581692994 580545425 579523265 578071356 575937688 573488414 571295202 569591343
1305.4 569591343 568082929 566391766 564560354 562967241 561892629 561084926 559888482 557796240
1321.7 557796240 554702282 550782740 546251237 541210890 535898626 530939281 527082860 524678409
1338 524678409 523501992 523060560 522957027 523031533 523275316 523563623 523587763 523024857 521887302 520659983
1358.4 520659983 519735694 518933594 518026173 517122507 516384661 516241968 516974807 518162847 519130290
1376.7E19130290P19308Q56221J588464K924502M234373M263819L268718K523065J727104
1395.1E41235864N03183p48933j399636j474977j609802j628399j635432j944184j975596
1413.5E29322088j363397q53300q66652o41584k33889J71245Q53240J449168J649141
1431.8E29486060J655221J632393J537978J630545J852155J623034R24945j19n89490
1450.2E39752722n76377n08309j588523l124297j545906N96106K180100L289342M231989
1468.5E42706847O188870R365558J0119975Q565187P541418P116080P038712O865859
1484.9F05508506O952644O708920N373060M137755M362643M996061M265904L275276
1501.2F45580769L163397L996491M463435K635479J868724K209366K674877L031373
$$ plain form
1376.7 519130290 519849598 520705819 522294283 525218785 529453158 533716977 536985695 539508760 541235864
1395.1 541235864 541739047 540990114 539590478 538115501 536505699 534877300 533241868 531297684 529322088
1413.5 529322088 527958691 527105391 526238739 525597155 525363266 525534511 526387751 527836919 529486060
1431.8 529486060 531141281 532773674 534311652 535942197 537794352 539417386 540342331 540342212 539752722
1450.2 539752722 539176345 538668036 537079513 533955216 532409310 533005416 535185516 538474858 542706847
1468.5 542706847 548895717 558261275 568381250 576946437 584487855 591603935 598642647 605508506
1484.9 605508506 612461150 619170070 624543130 628680885 633043528 638039589 642305493 645580769
1501.2 645580769 648744166 652740657 657204092 659839571 661708295 663917661 666592538 669623911
1517.5F69623911L009737K666771J728416J169741J293719J637697J942158J542032
1533.8F84614182J113891J650274K033114O24538m47869m65036p4923K71618N03719
1552.2F89823508R26435J297772J29402k378047j276731j51754O4314l80039j169145
1570.5F86885715p11978r8646p98523j403630j207769j203060j135111j064420j255571
1588.9F78007007j657248j948237k030611j946807j948893k317131k797842k981245
1605.2F60378993k952695l163696l332853l132641l681839m963755l820956k707601
1621.5F32622957l502309l894329l657699l256202k004325j268506k334535k710581
1637.8F09994471j321018r7453Q07106J044333P69079J177609K178013K536774J837969
$$ plain form
1517.5 669623911 672633648 675300419 677028835 678198576 679492295 681129992 683072150 684614182
1533.8 684614182 685728073 687378347 689411461 690035999 689588130 689123094 689048171 689319789 689823508
1552.2 689823508 690749943 692047715 692177117 689799070 688522339 688370585 688434899 688054860 686885715
1570.5 686885715 686173737 686075091 685276568 683872938 682665169 681462109 680326998 679262578 678007007
1588.9 678007007 676349759 674401522 672370911 670424104 668475211 666158080 663360238 660378993
1605.2 660378993 657426298 654262602 650929749 647797108 644115269 639151514 635330558 632622957
1621.5 632622957 629120648 625226319 621568620 618312418 616308093 615039587 612705052 609994471
1637.8 609994471 608673453 608576000 609383106 610427439 611196518 612374127 614552140 617088914 618926883
1656.2F18926883K096891K888262L700197M069746M040599M450261M623175M105270
1672.5F48901284M586756N123615M700124M634381N210996N729556M532277L898263
1688.8F87317252M036546L866315M270971M450678L537417K658546J883209J552939
1705.1G13573873J482427J606405J941323K169371K080083J446545P93636R65118J229525
1723.5G27288306J407087J752078K294481K507269J926124J190246J347005J706123
1739.8G41418719J949370K232313K466143K525746K369404K290845K443075K583206
1756.1G60278821K514720K318621K167403K041161K123475K233327K060473J434326
1772.4G77172327Q62360R63151J215995J165628R39310Q64208J009225J311481J342595
$$ plain form
1656.2 618926883 621023774 623912036 627612233 631681979 635722578 640172839 644796014 648901284
1672.5 648901284 653488040 658611655 663311779 667946160 673157156 678886712 683418989 687317252
1688.8 687317252 691353798 695220113 699491084 703941762 707479179 710137725 712020934 713573873
1705.1 713573873 715056300 716662705 718604028 720773399 722853482 724300027 725093663 726058781 727288306
1723.5 727288306 728695393 730447471 732741952 735249221 737175345 738365591 739712596 741418719
1739.8 741418719 743368089 745600402 748066545 750592291 752961695 755252540 757695615 760278821
1756.1 760278821 762793541 765112162 767279565 769320726 771444201 773677528 775738001 777172327
1772.4 777172327 778034687 778997838 780213833 781379461 782318771 783182979 784192204 785503685 786846280
1790.8G86846280Q21471M91679P63357R88543Q55446O09934N89311P67410Q82208P52807
1811.2G94368446N66304N54502N61952O24061Q32081R40740P79450O23405M47809K13623
1831.6H00512373L45529M74870L29673L29793N99980O09040K21968k7180m9472R7335
1852H03443909K88844L79264K82407J10507J27375M36962P03215M17531j50502j92821
1872.4H05846691J17660L63946M45902L41535K12311K58804M70519N29885L10779J67250
1892.8H09065282J57833J78218K41936K48015J46031Q9884J34468J62720J25826J27435
1913.2H10677648J99079J67966J19627J85608J30058m173k980M4823J08480J87695
1933.6H11813831J72496J28508J84834K18153J32024Q0824P0035O7652J19269J95205
$$ plain form
1790.8 786846280 787667751 788159430 788922787 789911330 790766776 791376710 791966021 792733431 793615639 794368446
1811.2 794368446 794934750 795489252 796051204 796675265 797507346 798448086 799227536 799850941 800298750 800512373
1831.6 800512373 800857902 801332772 801662445 801992238 802592218 803201258 803423226 803396046 803346574 803443909
1852 803443909 803732753 804112017 804394424 804504931 804632306 805069268 805772483 806190014 806039512 805846691
1872.4 805846691 805964351 806328297 806774199 807115734 807328045 807586849 808057368 808587253 808898032 809065282
1892.8 809065282 809223115 809401333 809643269 809891284 810037315 810127199 810261667 810424387 810550213 810677648
1913.2 810677648 810876727 811044693 811164320 811349928 811479986 811475813 811472833 811517656 811626136 811813831
1933.6 811813831 811986327 812114835 812299669 812517822 812649846 812730670 812800705 812868357 812987626 813182831
1954H13182831K41935K20776J63614J52708K31623K76268J97828J12473O5148L0935
1974.4H14876139Q5473J83404J73628Q8930L3140N5850J40786J63555J5915j28031
1994.8H15688789q8692K4796O2287k981j09493j95384k03312j52767j10328j77026
2015.2H14735889l93986n92649o36697o55115o07967k81215k5391r7156k02060k57790
2035.6H10985863l41952m04298l90828l17156k31206k03908k26259k03013r1672L4809
2056H08610380O3300J4126n483K8967N5611Q7560J19984O8366k1338k384Q8989J13011
2080.4H09221089P3492L6121N0664J07586J22845R1791R0957J18077J47998J69576
2100.8H10230196J86562J90437J41740J00314J03236J01745P8857N6028M0889M1723
$$ plain form
1954 813182831 813424766 813645542 813809156 813961864 814193487 814469755 814667583 814780056 814845204 814876139
1974.4 814876139 814961612 815145016 815318644 815407574 815440714 815496564 815637350 815800905 815816820 815688789
1994.8 815688789 815600097 815624893 815687180 815684199 815574706 815379322 815176010 815023243 814912915 814735889
2015.2 814735889 814341903 813749254 813112557 812457442 811849475 811568260 811542869 811445713 811243653 810985863
2035.6 810985863 810643911 810239613 809848785 809531629 809300423 809096515 808870256 808667243 808575571 808610380
2056 808610380 808673680 808687806 808682323 808711290 808766901 808854461 808974445 809042811 809021473 809019089 809108078 809221089
2080.4 809221089 809294581 809330702 809381366 809488952 809611797 809703588 809794545 809912622 810060620 810230196
2100.8 810230196 810416758 810607195 810748935 810849249 810952485 811054230 811133087 811189115 811230004 811271727
2121.2H11271727N4061N2870L2663K4855L0399J1980J2577N3823P0214L8147N364J9312
2145.7H11677992P5698J18256R6798Q4638J27912J85132K26676K43485K70904K99930
2166.1H13407421L30448M11153M76480M69207M52042M47333M38034M35532M60982M65631
2186.5H17794263M12405L65853L83198M24803L97265L41832L46184L77059M06265M30823
2206.9H21679950M05609L31760L23176L93093M12583L77834L26395K70307K87891L41713
2227.3H25150311L15249K23398J91271K53082L01659K97546K61188K02358J72495K01941
2247.7H27570498K41518K42531K13862J79648J76907K52187L13461K52843J63436J51038
2268.1H29757929K25305K99573K61903J53005P7129R1791J99735L12090L23951K75970
$$ plain form
2121.2 811271727 811325788 811378658 811411321 811436176 811466575 811478555 811491132 811544955 811615169 811653316 811658680 811677992
2145.7 811677992 811753690 811871946 811968744 812053382 812181294 812366426 812593102 812836587 813107491 813407421
2166.1 813407421 813737869 814149022 814625502 815094709 815546751 815994084 816432118 816867650 817328632 817794263
2186.5 817794263 818206668 818572521 818955719 819380522 819777787 820119619 820465803 820842862 821249127 821679950
2206.9 821679950 822085559 822417319 822740495 823133588 823546171 823924005 824250400 824520707 824808598 825150311
2227.3 825150311 825465560 825688958 825880229 826133311 826434970 826732516 826993704 827196062 827368557 827570498
2247.7 827570498 827812016 828054547 828268409 828448057 828624964 828877151 829190612 829443455 829606891 829757929
2268.1 829757929 829983234 830282807 830544710 830697715 830774844 830866635 831066370 831378460 831702411 831978381
2288.5H31978381K57432K74897L27229L74675L59654L03269L40283N35488O91891O57200
2308.9H36100399N00024L60429M33087P18356R21249Q56817O34253N03242N79774O62208
2329.3H42269838M39048N1438o0677O0320R0360j13368p45177j595259j260876K09033
2349.7H39344680J532674K034426J719832J004398J53363m93765r38237j383960j719594
2368H41253817j881480j916051j784563j629949j536250j389265j138449p96616m57406
2386.4H28723788k68578k55168k73049k31444j86265j84417k31504k95460l18408k78354
2406.8H26201141k60830l18766l95357m35949m09007l52502l57985m68731n88775n70833
2427.2H22042406m51327m05073m67956n69105o34372n81324m86017m94241n92113o68824
$$ plain form
2288.5 831978381 832235813 832510710 832837939 833212614 833572268 833875537 834215820 834751308 835443199 836100399
2308.9 836100399 836600423 836960852 837393939 838112295 839033544 839890361 840524614 841027856 841607630 842269838
2329.3 842269838 842708886 842760324 842699647 842759967 842850327 842736959 841991782 840396523 839135647 839344680
2349.7 839344680 840877354 842911780 844631612 845636010 845789373 845295608 844357371 842973411 841253817
2368 841253817 839372337 837456286 835671723 834041774 832505524 831116259 829977810 829181194 828723788
2386.4 828723788 828455210 828200042 827926993 827695549 827509284 827324867 827093363 826797903 826479495 826201141
2406.8 826201141 825940311 825621545 825226188 824790239 824381232 824028730 823670745 823202014 822613239 822042406
2427.2 822042406 821591079 821186006 820718050 820148945 819514573 818933249 818447232 817952991 817360878 816692054
2447.6H16692054o45280n29110m47989m77433n39779n57006n08547m46260m50790n28574
2467.9H11561286n85913n52178m52578l67880l93629m94003n33700m62413l42309l21448
2488.3H07055235m18246m65989l81827k51294j97470k47001l37184l59177k84851j94490
2508.7H03917706j94848l21984m40955m33505l35991k76387l31163m56691n41389m94599
2529.1H00090194m21107m64201n94020o97553o71625n53489n17726n97060o65247o27458
2549.5G94280708n13792m65691n29707o45518p21991o47247m79341m14490n21004o59287
2569.9G88682640o62148n48244m64618n03183o08146o21140n21004m16696l74913m40061
2590.3G83522487n18322m65215l42488k96414l74794n03301n46754m66108l95656m82976
$$ plain form
2447.6 816692054 816046774 815517664 815069675 814592242 814052463 813495457 812986910 812540650 812089860 811561286
2467.9 811561286 810975373 810423195 809970617 809602737 809209108 808715105 808181405 807718992 807376683 807055235
2488.3 807055235 806636989 806171000 805789173 805537879 805340409 805093408 804756224 804397047 804112196 803917706
2508.7 803917706 803722858 803400874 802959919 802526414 802190423 801914036 801582873 801126182 800584793 800090194
2529.1 800090194 799669087 799204886 798610866 797913313 797241688 796688199 796170473 795573413 794908166 794280708
2549.5 794280708 793766916 793301225 792771518 792126000 791404009 790756762 790277421 789862931 789341927 788682640
2569.9 788682640 788020492 787472248 787007630 786504447 785896301 785275161 784754157 784337461 783962548 783522487
2590.3 783522487 783004165 782538950 782196462 781900048 781525254 781021953 780475199 780009091 779613435 779130459
2610.7G79130459o84321q01385p74622p37667p67827q77857j027822j104653j065612
2629.1G71288693r82761r84788j100421j182318j154423j071572j004934j052678j178861
2647.4G61575937j208305j119852j037121j001954j036763j115799j089156r50992
2663.7G53015995q84950r82404j086056j043975r27091q30770q09252q82268r33647
2682.1G44635582q69393p75755p84457q97705r88662r80616r28044r18687r73880j056373
2702.5G35462010j106322j087248j043737j018167j038909j111805j108766r83715
2718.8G26963341q78453q76844r35912r37164q36134p36713p22409p83324q40008q08001
2739.2G18608379o84738n87940o36280p41899p53939o98745o49273n95749n88476o45400
$$ plain form
2610.7 779130459 778446138 777644753 776870131 776132464 775364637 774486780 773458958 772354305 771288693
2629.1 771288693 770305932 769321144 768220723 767038405 765883982 764812410 763807476 762754798 761575937
2647.4 761575937 760367632 759247780 758210659 757208705 756171942 755056143 753966987 753015995
2663.7 753015995 752131045 751148641 750062585 749018610 748091519 747260749 746451497 745569229 744635582
2682.1 744635582 743766189 742990434 742205977 741308272 740319610 739338994 738410950 737492263 736518383 735462010
2702.5 735462010 734355688 733268440 732224703 731206536 730167627 729055822 727947056 726963341
2718.8 726963341 726084888 725208044 724272132 723334968 722498834 721762121 721039712 720256388 719416380 718608379
2739.2 718608379 717923641 717335701 716699421 715957522 715203583 714504838 713855565 713259816 712671340 712025940
2759.6G12025940o31868n36085m69744n02825o15000p10488p44104p54118p83026q40366
2780G05438316r39369j015604j007438j020133j118541j235545j330912j386046j402676
2798.4F94982052j461625j585186j712978j800060j810849j786649j833558j946688
2814.7F81044459k035021k106250k188146k277017k377986k463997k533674k585530
2831F62476838k632380k754331k929508l074467l234625l444791l656089l852547l932118
2849.3F32965982l739536l346145k938330k667308k712488l043831l445446l910422
2865.7F07162476m436672m826248n079150n317688n407751n192816m745841m144907
2882E68011403l437042k739489k064586j439750j008928q02576p32184o96242o91294
$$ plain form
2759.6 712025940 711394072 710857987 710388243 709885418 709270418 708559930 707815826 707061708 706278682 705438316
2780 705438316 704498947 703483343 702475905 701455772 700337231 699101686 697770774 696384728 694982052
2798.4 694982052 693520427 691935241 690222263 688422203 686611354 684824705 682991147 681044459
2814.7 681044459 679009438 676903188 674715042 672438025 670060039 667596042 665062368 662476838
2831 662476838 659844458 657090127 654160619 651086152 647851527 644406736 640750647 636898100 632965982
2849.3 632965982 629226446 625880301 622941971 620274663 617562175 614518344 611072898 607162476
2865.7 607162476 602725804 597899556 592820406 587502718 582094967 576902151 572156310 568011403
2882 568011403 564574361 561834872 559770286 558330536 557321608 556519032 555786848 555090606 554399312
2900.3E54399312q19087j073063j407444j803875k193392k621233l152192l637910
2916.6E37691116l852904l733813l352106k801180k134025j330674m21345O44386J885057
2935E22594512L017783L902375M634083N178451N468190N562603N610705N675196N690873
2953.4E67334771N641878N576670N533278N405009N066871M654944M338980M122734
2969.7F07675135L977418L872275L780306L723204L619790L308535K910316K652943
2986F35519922K463698K246082K005816J684486J326561R90033O84023M35234J53779
3004.4F47509634j76250m21286n63383p50065j073062j415730j657486j805365j862228
3022.7F37784779j924097k088488k192735k179086k217114k389014k548397k509773
$$ plain form
2900.3 554399312 553580225 552507162 551099718 549295843 547102451 544481218 541329026 537691116
2916.6 537691116 533838212 530104399 526752293 523951113 521817088 520486414 520065069 520709455 522594512
2935 522594512 525612295 529514670 534148753 539327204 544795394 550357997 555968702 561643898 567334771
2953.4 567334771 572976649 578553319 584086597 589491606 594558477 599213421 603552401 607675135
2969.7 607675135 611652553 615524828 619305134 623028338 626648128 629956663 632866979 635519922
2986 635519922 637983620 640229702 642235518 643920004 645246565 646236598 646920621 647355855 647509634
3004.4 647509634 647333384 646912098 646348715 645598650 644525588 643109858 641452372 639647007 637784779
3022.7 637784779 635860682 633772194 631579459 629400373 627183259 624794245 622245848 619736075
3039F19736075k454876k583385k745450k802252k754569k737821k824425k863586k852142
3057.4E95117569k857506k797425k708614k691269k780139k918065k964437k882898
3073.7E72517216k707422k581060k696990k889932k925753k894163k840758k782106
3090E50199032k861023k959192k884626k719343k665162k783656k826452k639235k513647
3108.4E25346696k659082k712846k498031k402186k554417k775728k903402k820432
3124.7E04020572k611399k478629k508432k581775k513021k323032k275228k483845
3141D84245211k623528k485633k291739k130211k029329k202332k477348k442896k240450
3159.4D63321745k175510k193570k176284k102018k003431j948655j968413j997620
$$ plain form
3039 619736075 617281199 614697814 611952364 609150112 606395543 603657722 600833297 597969711 595117569
3057.4 595117569 592260063 589462638 586754024 584062755 581282616 578364551 575400114 572517216
3073.7 572517216 569809794 567228734 564531744 561641812 558716059 555821896 552981138 550199032
3090 550199032 547338009 544378817 541494191 538774848 536109686 533326030 530499578 527860343 525346696
3108.4 525346696 522687614 519974768 517476737 515074551 512520134 509744406 506841004 504020572
3124.7 504020572 501409173 498930544 496422112 493840337 491327316 489004284 486729056 484245211
3141 484245211 481621683 479136050 476844311 474714100 472684771 470482439 468005091 465562195 463321745
3159.4 463321745 461146235 458952665 456776381 454674363 452670932 450722277 448753864 446756244
3175.7D46756244j957566j885533j855940j848399j836539j827270j814186j744688
3192D31986123j650244j656562j694381j655817j599103j551658j514286j556188j575172
3210.3D17532712j471549j394153j372248j360088j380325j392811j371175j317591
3226.7D06472772j223087j074672j005143j196265j388877j312614j147687j031220
3243C97093207r55463r66638j093388j164436j021445q72612r44286j041145r78350
3261.3C88055444q60542p64072o74993o15269o79910q17537r26912r75520r14812q22723
3281.7C80003154p31736o50495o24270n78940n56409o35505p70211r18180r13500o66649
3302.1C72957259m25636m82768q21501j131267j163959r84997q41975q35061q65787
$$ plain form
3175.7 446756244 444798678 442913145 441057205 439208806 437372267 435544997 433730811 431986123
3192 431986123 430335879 428679317 426984936 425329119 423730016 422178358 420664072 419107884 417532712
3210.3 417532712 416061163 414667010 413294762 411934674 410554349 409161538 407790363 406472772
3226.7 406472772 405249685 404175013 403169870 401973605 400584728 399272114 398124427 397093207
3243 397093207 396137744 395171106 394077718 392913282 391891837 391019225 390074939 389033794 388055444
3261.3 388055444 387194902 386430830 385755837 385140568 384460658 383643121 382716209 381740689 380825877 380003154
3281.7 380003154 379271418 378620923 377996653 377417713 376861304 376225799 375455588 374537408 373623908 372957259
3302.1 372957259 372531623 372048855 371227354 370096087 368932128 367947131 367105156 366270095 365404308
3320.5C65404308q09580p51823q84861j021028r64701q82268p84248o59287p43359
3338.8C57903153r74834j080543j093388r73850p17074p75814j137435j226515r87649
3357.2C48936051p96854q19981q39323o77318o30587q94397j205564j196176q96215
3375.5C40979636p14153p42346q19445p87884o21676l94851j66297k44886o19650o70850
3395.9C35197598k74658p8410m45426q15153o11365k56568j79589k55763m03285m36366
3416.3C31441015k67982j61261j72019p3999J58548K84165J86503J95712L39270J82450
3436.7C32112402j36793j31458J49786L55721L65883L11166L72291M73469N21303O37203
3457.1C35030973P86960O98835O34879R45717J098692O77139K13414K88576O78092
$$ plain form
3320.5 365404308 364594728 363842905 362958044 361937016 360972315 360090047 359305799 358646512 357903153
3338.8 357903153 356928319 355847776 354754388 353780538 353063464 352287650 351150215 349923700 348936051
3357.2 348936051 348139197 347319216 346479893 345802575 345171988 344277591 343072027 341875851 340979636
3375.5 340979636 340265483 339523137 338703692 337915808 337294132 336899281 336732984 336488098 335868448 335197598
3395.9 335197598 334922940 334844530 334399104 333583951 332972586 332716018 332536429 332280666 331877381 331441015
3416.3 331441015 331173033 331011772 330839753 330765754 330924302 331208467 331394970 331590682 331929952 332112402
3436.7 332112402 331975609 331844151 331993937 332349658 332715541 333026707 333398998 333872467 334393770 335030973
3457.1 335030973 335817933 336516768 337151647 338097364 339196056 339873195 340086609 340375185 341053277
3475.5C41053277J014352R97096O07968N27531Q27074Q59797P42644Q60303J005114
3493.8C48495156J045107J008720R66847R19401P48068O79165Q56698J065254J203269
3512.2C56987685J121014Q97050R24200J184821J378328J180261Q15541Q26508J100808
3530.6C66416216J309544J425206J348585J242370J489371J720220J486390J082957
3546.9C77520859J102627J381546J554280J655490J757592J911848K061934K038925
3563.2C90985101J850397J943946K285629K319783K285362K454549K636998K841980
3579.5D09603745L126323L224194K916425K642364K970964L163933L102452L304571
3595.8D34054971L602564L575027L469735L486008L398508L445029L652036L725708
$$ plain form
3475.5 341053277 342067629 343064725 343672693 344200224 345027298 345887095 346629739 347490042 348495156
3493.8 348495156 349540263 350548983 351515830 352435231 353183299 353862464 354719162 355784416 356987685
3512.2 356987685 358108699 359005749 359929949 361114770 362493098 363673359 364488900 365315408 366416216
3530.6 366416216 367725760 369150966 370499551 371741921 373231292 374951512 376437902 377520859
3546.9 377520859 378623486 380005032 381559312 383214802 384972394 386884242 388946176 390985101
3563.2 390985101 392835498 394779444 397065073 399384856 401670218 404124767 406761765 409603745
3579.5 409603745 412730068 415954262 418870687 421513051 424484015 427647948 430750400 434054971
3595.8 434054971 437657535 441232562 444702297 448188305 451586813 455031842 458683878 462409586
3612.1D62409586L855645L798485L621400L899484L952325L701001L393829L333986
3628.5D91965741L931612L922760L677428L654003L629208L730595L937363M003346
3644.8E22452056L859282L743589L777504L498137L153562L468871L734470L364444
3661.1E51051915L195584L447413L360629L047526L390253L203034K444684K565802
3677.4E75706840K756595K737701K961695L118635K915978K280652J941860K121866
3693.7E96541822K241135K184689J937985J737535J973867K230287K106726J555980
3710F12510026J126945J568973J928865J894773J752257J576662J339138J312971J692474
3728.4F26703084J856744J663625J159549Q70168J380324J584411Q06093M42148J352965
$$ plain form
3612.1 462409586 466265231 470063716 473685116 477584600 481536925 485237926 488631755 491965741
3628.5 491965741 495897353 499820113 503497541 507151544 510780752 514511347 518448710 522452056
3644.8 522452056 526311338 530054927 533832431 537330568 540484130 543953001 547687471 551051915
3661.1 551051915 554247499 557694912 561055541 564103067 567493320 570696354 573141038 575706840
3677.4 575706840 578463435 581201136 584162831 587281466 590197444 592478096 594419956 596541822
3693.7 596541822 598782957 600967646 602905631 604643166 606617033 608847320 610954046 612510026
3710 612510026 613636971 615205944 617134809 619029582 620781839 622358501 623697639 625010610 626703084
3728.4 626703084 628559828 630223453 631383002 632253170 633633494 635217905 636023998 636466146 637819111
3746.7F37819111J056791J66058P52211J498043J255095Q56519J007795J138866J034439
3765.1F46584928R64880P09057O75380J021564J193106J096666Q78632Q05736P35104
3783.5F54665053O58989P71165R32574J066983J032054R48489J061141P06256L40402
3801.8F62183106P39992N31852L53753R24349J180709Q14974O25670R14574L94463
3820.2F68663442K03312P95364P93874O92189P03633Q80301J116633O90699Q2493J52707
3840.6F74774647L21746N44428R80139J261652P71045o84380n21183R73761J115561
3858.9F79537416P69019L84569M16279O13331K74361J86085L23594N29647P67112M62830
3879.3F84264243M14371M91977J55687L16859M43995K25126M62115P47681N87821K86042
$$ plain form
3746.7 637819111 638875902 639041960 639794171 641292214 642547309 643403828 644411623 645550489 646584928
3765.1 646584928 647549808 648258865 648934245 649955809 651148915 652245581 653124213 653929949 654665053
3783.5 654665053 655324042 656095207 657027781 658094764 659126818 660075307 661136448 661842704 662183106
3801.8 662183106 662923098 663454950 663808703 664733052 665913761 666728735 667354405 668268979 668663442
3820.2 668663442 668866754 669662118 670455992 671148181 671851814 672732115 673848748 674539447 674621940 674774647
3840.6 674774647 675096393 675640821 676620960 677882612 678653657 677969277 677448094 678421855 679537416
3858.9 679537416 680306435 680691004 681107283 681720614 681994975 682181060 682504654 683034301 683801413 684264243
3879.3 684264243 684678614 685170591 685326278 685643137 686087132 686312258 686774373 687522054 688109875 688395917
3899.7F88395917J431k09093K1815L59655M25636N26667N73635K92897O4194K45989
3920.1F90698743L73185K04265K03252L24308J68443P3493K36630K95639L36468L49284
3940.5F93263710J90615J65582J96218J08719J33395K12610K22922K55286K75016J99139
3960.9F95223212J80066K47538K13146J46449J78039J83463J30355J74105K65003L03983
3981.3F97245359K68996J24395L9518J31845J89066J14084J30117K77936
3997.6F98521316
$$ plain form
3899.7 688395917 688397348 688188255 688210070 688569725 688995361 689522028 690095663 690388560 690452754 690698743
3920.1 690698743 691071928 691276193 691479445 691803753 691972196 692045689 692282319 692577958 692914426 693263710
3940.5 693263710 693454325 693619907 693816125 693924844 694058239 694270849 694493771 694749057 695024073 695223212
3960.9 695223212 695403278 695650816 695863962 696010411 696188450 696371913 696502268 696676373 696941376 697245359
3981.3 697245359 697514355 697638750 697678268 697810113 697999179 698113263 698243380 698521316
3997.6 698521316
##END=$$ End of the data block
