##TITLE=$$ Begin of the data block
##JCAMP-DX=5.00 $$ ACD/SpecManager v 10.08
##SPECTROMETER/DATA SYSTEM=Alpha
##DATE=23 Dec 2014 14:28:26
##DATA TYPE=INFRARED SPECTRUM
##DATA CLASS=XYDATA
##ORIGIN=
##OWNER=
##NPOINTS=1765
##FIRSTX=399.76428223
##LASTX=3997.64306641
##MAXX=3997.64306641
##MINX=399.76428223
##MAXY=0.84630692
##MINY=0.26222378
##XFACTOR=1.0000000000
##YFACTOR=1.000000000000000e-9
##FIRSTY=0.55576456
##DELTAX=2.03961372
##XUNITS=1/CM
##YUNITS=ARBITRARY UNITS
##XYDATA=(X++(Y..Y))
399.8E55764556o818771n407215k397835P57873K171457J457989M75288J204371K400875
418.1E49608588K60294l100217m164636l440082j889825j771450l181219l837168k218485
436.5E26265800J150489L995538M512071L274203K814889L631234M088759K622962
452.8E52355945j62005j867533j635253o34552r78648k748847m256726l876566k195537
471.2E34000278j738847k820492l636181k977312q00132J078605Q57473q29399j775324
489.5E21358669j096249K19882J74463j733423l354251l080785j716495j313686k792240
507.9E06665885m581630m853070l674537k642333l386796n054473n061359k810716
524.2D74600971q6040R15796J60545l04878J164824M190534O533713O287008M026741
$$ plain form
399.8 555764556 548945785 543538570 541140735 541898608 544070065 545528054 546003342 547207713 549608588
418.1 549608588 549868882 546768665 542604029 539163947 537274122 535502672 532321453 528484285 526265800
436.5 526265800 527416289 531411827 535923898 539198101 542012990 545644224 549732983 552355945
452.8 552355945 552193940 550326407 548691154 548056602 547077954 544329107 540072381 536195815 534000278
471.2 534000278 532261431 529440939 525804758 522827446 522027314 523105919 523963392 523133993 521358669
489.5 521358669 520262420 520482302 520656765 518923342 515569091 512488306 510771811 509458125 506665885
507.9 506665885 502084255 497231185 493556648 490914315 487527519 482473046 477411687 474600971
524.2 474600971 474514931 475430727 475591272 475286394 476451218 480641752 487175465 493462473 497489214
542.5D97489214K068877J666725J692951L09050k259314l945172l796309k997727l267496
560.9D86960799n099655p080257p625460o477267m514694k836943j483172N40882L683150
579.3D56067383O707371P963448P126570N484700M496843M138589L187597J256108
595.6D96428609o92517j267910k19345R28939Q79734r6440n09083O74069K664983L746688
616E02537727L190816K274513K717316M273296N250156M507422K552330J177967J630008
634.3E30111551K966404L103674J606345P6413J41025J700341K873183K033233J18554
652.7E44730723n21660Q32677K478063K333641O51419j33872J298964L039897K055168
671E56765020J034260K72095K60770J820147L217757K592444M78447r10223l26335
$$ plain form
542.5 497489214 499558091 501224816 502917767 503226817 500967503 497022331 493226022 490228295 486960799
560.9 486960799 481861144 474780887 467155427 460678160 456163466 453326523 451843351 452384233 456067383
579.3 456067383 462774754 470738202 477864772 483349472 487846315 491984904 495172501 496428609
595.6 496428609 495736092 494468182 494248837 495177776 496057510 495961070 495451987 496126056 498791039 502537727
616 502537727 505728543 508003056 510720372 514993668 520243824 524751246 527303576 528481543 530111551
634.3 530111551 533077955 536181629 537787974 537864387 538005412 539705753 542578936 544612169 544730723
652.7 544730723 544209063 545041740 547519803 549853444 550504863 550370991 551669955 554709852 556765020
671 556765020 557799280 558071375 558332145 560152292 563370049 565962493 566440940 565530717 565204382
689.4E65204382J014948Q06033j472473l847658m176259k743900j556575j693607k278745
707.7E49256146j594722J053273M079640N292058M665017M002870M775345O662309
724.1E78191936P694244O400228M012227K963781L782988M703522L690660R68039j248837
742.4F11158788j511931q59142j391291l656209n969584o399035m882753l186286k848446
760.8E80454111l345728k666473K25305M074276O721020P292687P071674P784248R299814
779.1F16910934R834111Q153320N231976L362954L756702N137562N273641L792345
795.4F61453545K542436L133953M884302N529702L890276J375914L24428J301348K597809
813.8F87033713K244711J30832j794934j834154o67751o38604k799988n477905o472886
$$ plain form
689.4 565204382 566219330 567025363 565552890 561705232 557528973 554785073 553228498 551534891 549256146
707.7 549256146 547661424 548714697 552794337 558086395 562751412 566754282 571529627 578191936
724.1 578191936 585886180 592286408 596298635 599262416 603045404 607748926 611439586 612407625 611158788
742.4 611158788 609646857 608787715 607396424 603740215 597770631 591371596 586488843 583302557 580454111
760.8 580454111 577108383 574441910 574667215 578741491 585462511 592755198 599826872 607611120 616910934
779.1 616910934 626745045 634898365 640130341 643493295 647249997 652387559 657661200 661453545
795.4 661453545 663995981 667129934 672014236 677543938 681434214 682810128 683134556 684435904 687033713
813.8 687033713 689278424 689409256 687614322 685780168 685112417 684473813 681673825 676195920 669723034
832.2F69723034n524039m300297m429876n665601o196439m953384k975107k296030
848.5F33382261l567696n285084n732298m726768l144085j261532J509905N249560
864.8F16424263R263932J2530327J3505101J1340440P525086M549980K949894J018047
881.1F79107070k388179o077826p896662p203043n630493n209386o088078o776154
897.4F31837249o142259m827797m597485o183088q477152r818196r745002r339392
913.7E72706878r681582j0283411r581327o928027l444970r55998k37346k48790N52237
932.1E31897664K431154M276336M939258M518568L842116K843737N39839l537833q489847
950.5E43260992j2580514j4739812j5352845j5696555j6690404j8047064j8901497
$$ plain form
832.2 669723034 664198995 659898698 655468822 649803221 643606782 638653398 635678291 633382261
848.5 633382261 629814565 624529481 618797183 614070415 610926330 609664798 611174703 616424263
864.8 616424263 625688195 638218522 651723623 663064063 670589149 675139129 678089023 679107070
881.1 679107070 676718891 670641065 662744403 655541360 649910867 644701481 638613403 631837249
897.4 631837249 625694990 620867193 616269708 610086620 601609468 591791272 582046270 572706878
913.7 572706878 563025296 552741885 543160558 536232531 532787561 531831563 531594217 531345427 531897664
932.1 531897664 534328818 538605154 543544412 548062980 551905096 554748833 555288672 551750839 543260992
950.5 543260992 530680478 515940666 500587821 484891266 468200862 450153798 431252301
964.7D31252301j8944025j8650234j8601686j8807232j8694222j7615080j5522867
979C04416955j2924970j0342240q008301n787194l553480j519442n7548O56933Q71926
997.4B63752639J068473J392692J534760J132846K79785m89235o63251j52230N52952
1015.7B68409431J038015J379639J864284K668560L566175L979653L701866L196985
1032B89804608K855360K552658J999170J192480M57645K76625Q09133J723737K650857
1050.4C04322273L572195M660994N987197P504016Q893460R762556R637892P653147
1066.7C61993730L010660l465622q808375j0352134q187235m386872p93725J751363
1083C30761790L161967L850550M513800N500883O324499O187141M872084L029317J604736
$$ plain form
964.7 431252301 412308276 393658042 375056356 356249124 337554902 319939822 304416955
979 304416955 291491985 281149745 273141444 267354250 263800770 262281328 262223780 262880713 263752639
997.4 263752639 264821112 266213804 267748564 268881410 269161195 268671960 268008709 267856479 268409431
1015.7 268409431 269447446 270827085 272691369 275359929 278926104 282905757 286607623 289804608
1032 289804608 292659968 295212626 297211796 298404276 298861921 299138546 299947679 301671416 304322273
1050.4 304322273 307894468 312555462 318542659 326046675 334940135 344702691 354340583 361993730
1066.7 361993730 365004390 361538768 352730393 342378259 334191024 329804152 329010427 330761790
1083 330761790 333923757 337774307 342288107 347788990 354113489 360300630 365172714 368202031 369806767
1101.4C69806767J075029J237005J723260K394855L238290M029304M318565L777444
1117.7C91600519K594412J556992J418650K265096L450722M245072M240305L347098
1134D14718866J699061o98776l683447o436855q006275q108139p176816n938113m818320
1152.4C71551186l726155k378672p19279R93281K517373L925770N569786P635176R838969
1170.7C95207435J1588901J2482196J2699604J2865842J3268023J3462395J2836367
1185D84410763J1317104R454042P790982O411314M995585L379762J991570J454413
1201.3E31205535J845241K620339L198385L464580L828883M573405N333185N364060
1217.7E61433613M282058K581656J179039M59254L0637o28770j519859k116024j968026
$$ plain form
1101.4 369806767 370881796 372118801 373842061 376236916 379475206 383504510 387823075 391600519
1117.7 391600519 394194931 395751923 397170573 399435669 402886391 407131463 411371768 414718866
1134 414718866 416417927 415719151 412035704 405598849 397592574 389484435 382307619 376369506 371551186
1152.4 371551186 367825031 365446359 364727080 365720361 368237734 372163504 377733290 385368466 395207435
1170.7 395207435 406796336 419278532 431978136 444843978 458112001 471574396 484410763
1185 484410763 495727867 505181909 512972891 519384205 524379790 527759552 529751122 531205535
1201.3 531205535 533050776 535671115 538869500 542334080 546162963 550736368 556069553 561433613
1217.7 561433613 565715671 568297327 569476366 569935620 569966257 569337487 567817628 565701604 563733578
1236E63733578j280666p16269n76198m60624J80661J327992K331495K554297K006233
1254.4E69100499J372457J238346J468062J559556J369595J305461J721204K341687
1270.7E81476867K500415J814306N77211m46498o61016k67744q6903n29349j160205
1289E83217084j361012j127958j031578j469135k158761k477706k183199j656234j469493
1307.4E68282008j682460j849651j625360j103878q30948j213550k087892l077566
1323.7E54810703l911197m505337m997551n286872m952789l854394k398193j179516
1340E23724854m50253j02282Q0526K47001K88725K7836n58973j125395j207292r32693
1360.4E19992054q38876r21428r19879p92921j92880P01785J188755J000702P23124
$$ plain form
1236 563733578 562452912 561736643 561160445 560699821 560880482 562208474 564539969 567094266 569100499
1254.4 569100499 570472956 571711302 573179364 574738920 576108515 577413976 579135180 581476867
1270.7 581476867 583977282 585791588 586368799 585922301 585261285 584993541 584906638 584377289 583217084
1289 583217084 581856072 580728114 579696536 578227401 576068640 573590934 571407735 569751501 568282008
1307.4 568282008 566599548 564749897 563124537 562020659 561189711 559976161 557888269 554810703
1323.7 554810703 550899506 546394169 541396618 536109746 531156957 527302563 524904370 523724854
1340 523724854 523274601 523172319 523252845 523499846 523788571 523816407 523257434 522132039 520924747 519992054
1360.4 519992054 519153178 518231750 517311871 516518950 516326070 517027855 518216610 519217312 519940436
1378.8E19940436Q47816J612962K940714M211903M260480L284037K506793J690566
1395.1E41295707M67837p83205j402080j416266j534879j624823j680136j953661j952648
1413.5E29415846j358390q73387q71301o10411k10285J63913Q29041J433492J642763
1431.8E29561281J638890J627385J582444J670897J858413J620889R09507j8835n78642
1450.2E39872229n69343n81444j722157l068030j388967O25074K133191L273368M215657
1468.5E42789578O123424R316385J0149658Q623600P587313P132650P045924O867588
1484.9F05636120O917715O654918N373538M172921M366517M984140M278064L293932
1501.2F45677865L136456L856062M359246K775609K009690K254665K651632L009856
$$ plain form
1378.8 519940436 520788252 522401214 525341928 529553831 533814311 537098348 539605141 541295707
1395.1 541295707 541763544 540980339 539578259 538161993 536627114 535002291 533322155 531368494 529415846
1413.5 529415846 528057456 527184069 526312768 525702357 525492072 525655985 526485026 527918518 529561281
1431.8 529561281 531200171 532827556 534410000 536080897 537939310 539560199 540469706 540450871 539872229
1450.2 539872229 539302886 538721442 536999285 533931255 532542288 533167362 535300553 538573921 542789578
1468.5 542789578 548913002 558229387 568379045 577002645 584589958 591722608 598768532 605636120
1484.9 605636120 612553835 619208753 624582291 628755212 633121729 638105869 642383933 645677865
1501.2 645677865 648814321 652670383 657029629 659805238 661814928 664069593 666721225 669731081
1517.5F69731081K994596K637446J752258J208961J323819J668990J930058J550853
1533.8F84798062J168609J581549J832366O12438k97427l33608R239L20018N17785
1552.2F90209031Q60870J126945k1338k236724j098931r2447N2035m14729j175940
1570.5F87208772p13766j33216p87139j314342j141012j157939j099885j070261j298964
1588.9F78492248j689672j927197j987160j939356j956046k317011k811074k984047
1605.2F60880685k935529l145635l311515l131330l717184m943669l742218k727926
1621.5F33225679l573477l860474l585815l203392j955509j274169k384543k659380
1637.8F10728920j237274q9645P63118J041115Q57114J218140K119542K555370J951575
$$ plain form
1517.5 669731081 672725677 675363123 677115381 678324342 679648161 681317151 683247209 684798062
1533.8 684798062 685966671 687548220 689380586 689993024 689695597 689361989 689371228 689691246 690209031
1552.2 690209031 691069901 692196846 692175508 689938784 688839853 688747406 688799441 688384712 687208772
1570.5 687208772 686495006 686361790 685574651 684260309 683119297 681961358 680861473 679791212 678492248
1588.9 678492248 676802576 674875379 672888219 670948863 668992817 666675806 663864732 660880685
1605.2 660880685 657945156 654799521 651488006 648356676 644639492 639695823 635953605 633225679
1621.5 633225679 629652202 625791728 622205913 619002521 617047012 615772843 613388300 610728920
1637.8 610728920 609491646 609402001 610165119 611206234 612063348 613281488 615401030 617956400 619907975
1656.2F19907975K151013K878129L679574M102647M076421M424572M590869M131556
1672.5F49942756M616558N130530M692971M595816N101741N623579M555583L907800
1688.8F88167334M004061L823578M180849M365265L499270K693951J965284J579583
1705.1G14279175J500606J627148J905798K103985K012610J425803Q92103J049637
1721.5G26796865J232088J393855J754582K270400K402008J779020J194059J426697
1737.8G40249574J744807J983523K247691K424121K461315K355277K350092K508998
1754.1G58325398K592385K488851K312959K186656K074480K120018K178788K001941
1770.4G76281476J417696R36270J059056J236379J123011R18031Q97944J060664J297534
$$ plain form
1656.2 619907975 622058988 624937117 628616691 632719338 636795759 641220331 645811200 649942756
1672.5 649942756 654559314 659689844 664382815 668978631 674080372 679703951 684259534 688167334
1688.8 688167334 692171395 695994973 700175822 704541087 708040357 710734308 712699592 714279175
1705.1 714279175 715779781 717406929 719312727 721416712 723429322 724855125 725747228 726796865
1721.5 726796865 728028953 729422808 731177390 733447790 735849798 737628818 738822877 740249574
1737.8 740249574 741994381 743977904 746225595 748649716 751111031 753466308 755816400 758325398
1754.1 758325398 760917783 763406634 765719593 767906249 769980729 772100747 774279535 776281476
1770.4 776281476 777699172 778635442 779694498 780930877 782053888 782971919 783869863 784930527 786228061
1788.8G86228061J246273P88510N66065Q04425R73940Q42869O25908O18875P81060
1807.1G93475986Q79704P72000O04212N60284N36203O10531Q21769Q98003P47562O23882
1827.5H00530136M46915K51353L93689M61101K85447L16560N98312N86569K24173J5795
1847.9H04110050k444J21952K95341L81290K83838J26362J29997L92318O49154L95835
1868.3H06883693j27971j40667J58727L74675M17292K99096K17974L00765N01335N36740
1888.7H09421659K99990J41859J34229J83523K59578K59340J57118Q7798J05619J43886
1909.1H11194599J51992J72853K20776J51157Q5592J64449J32919O854J0670Q3565
1929.5H12375426J37508J58310J48654J60694K16782K07723Q4042M5478Q5772J12771
$$ plain form
1788.8 786228061 787474334 788262844 788828909 789633334 790607274 791450143 792076051 792694926 793475986
1807.1 793475986 794355690 795127690 795731902 796292186 796828389 797438920 798260689 799158692 799906254 800530136
1827.5 800530136 800977051 801228404 801622093 802083194 802368641 802685201 803283513 803870082 804094255 804110050
1847.9 804110050 804107606 804229558 804524899 804906189 805190027 805316389 805446386 805838704 806487858 806883693
1868.3 806883693 806755722 806615055 806773782 807148457 807565749 807864845 808082819 808383584 808884919 809421659
1888.7 809421659 809721649 809863508 809997737 810181260 810440838 810700178 810857296 810945094 811050713 811194599
1909.1 811194599 811346591 811519444 811740220 811891377 811976969 812141418 812274337 812281191 812291861 812375426
1929.5 812375426 812512934 812671244 812819898 812980592 813197374 813405097 813489139 813534617 813620389 813733160
1949.9H13733160J73271K25067K21491J97709J65641J46389K10405K58982J91927J05202
1970.3H15629244N7041N2035J21117J94371J64866P1943K1934O3777J53661J61112
1990.7H16691101J2517j01388n8114K1517M8935k146j01804j87755k04503j57595j13070
2013.1H15847695j84417m11451n98728n92053o16491o25670k90215l874r0540k23815
2033.5H12210441k79367l44754m00781l85463l00766k11358j94311k27511k01761p9573
2053.9H09584796L9876N8770R179p212M9412R6679Q1956O0440M8816K3722N2870J09672
2078.4H10208976Q8752L5047K6047O2824J18196J48832J34349J24336J17421J19507
2098.8H11184287J51515J84119J91152J44482R1254R0838J18732J08540O4850L3200
$$ plain form
1949.9 813733160 813906431 814131498 814352989 814550698 814716339 814862728 815073133 815332115 815524042 815629244
1970.3 815629244 815686285 815738320 815859437 816053808 816218674 816290617 816312551 816376328 816529989 816691101
1990.7 816691101 816703618 816602230 816544116 816565633 816614568 816612422 816510618 816322863 816118360 815960765 815847695
2013.1 815847695 815663278 815251827 814653099 814061046 813444555 812818885 812528670 812524796 812434256 812210441
2033.5 812210441 811931074 811586320 811185539 810800076 810499310 810287952 810093641 809866130 809664369 809584796
2053.9 809584796 809624672 809683442 809692621 809685409 809734821 809831500 809913456 809973896 810022712 810046434 810099304 810208976
2078.4 810208976 810297728 810332775 810358822 810421646 810539842 810688674 810823023 810947359 811064780 811184287
2098.8 811184287 811335802 811519921 811711073 811855555 811946809 812037647 812156379 812264919 812329769 812362969
2119.2H12362969K8551N0008O4254L5882J9490L9459K7954R477M2856R0063O6697L875
2143.7H12841535M470P5996J25289R5785O8545J00851J84297K49506K67446K87056
2164.1H14300776K93970L24189M32492M99844M66049M35352M31359M35591M43935M66287
2184.5H18529844M79162M27604L74615L99172M54664M26293L40223L08573L45111M00305
2204.8H22485566M33266M09603L59238L75211M14610L89516L50356L35276L07143K92242
2225.2H26152027L12090L12149K66016K26557K24769K42949K80737K67625J82331J60873
2245.6H28628123K29120K74658K52724K17378K02298K02716K41339K70009K09808J26302
2266H30854475J28150K34426L26812K90096J79588Q5593J01566K15590K93136L12984
$$ plain form
2119.2 812362969 812391520 812441528 812505782 812541664 812561154 812600613 812628567 812638044 812680900 812770963 812837660 812841535
2143.7 812841535 812846005 812922001 813047290 813143075 813211620 813312471 813496768 813746274 814013720 814300776
2164.1 814300776 814594746 814918935 815351427 815851271 816317320 816752672 817184031 817619622 818063557 818529844
2184.5 818529844 819009006 819436610 819811225 820210397 820665061 821091354 821431577 821740150 822085261 822485566
2204.8 822485566 822918832 823328435 823687673 824062884 824477494 824867010 825217366 825552642 825859785 826152027
2225.2 826152027 826464117 826776266 827042282 827268839 827493608 827736557 828017294 828284919 828467250 828628123
2245.6 828628123 828857243 829131901 829384625 829602003 829804301 830007017 830248356 830518365 830728173 830854475
2266 830854475 830982625 831217051 831543863 831833959 832013547 832099140 832200706 832416296 832709432 833022416
2286.4H33022416K96175K51174K54333L28302L65019L25799L08395L58224M69863N99146
2306.8H36578846O13213M98950M05312M77314P13884R07064Q52466N92291M10497M67718
2327.2H42517555N63621L79980L1948p1406K6285N2274j35959p04765j434863j104891
2347.6H40119779K22683J404464J851261J595914R70126J42693n33402r50277j284420
2366H43538821j575411j762271j784086j672029j543880j440644j308918j086831p43807
2384.3H30620944m02271k72990l13460k98858k24531j86741j82986k26736l06666l20494
2404.7H27885211k41519k25961l15487l95894m26114m14848l79682l67522m67300o06358
2425.1H24044526n92769m56035l87549m57049n77807o31869n61178m67836m84288n91397
$$ plain form
2286.4 833022416 833318591 833569765 833824098 834152400 834517419 834843218 835151613 835509837 835979700 836578846
2306.8 836578846 837192059 837691009 838096321 838573635 839287519 840194583 841047049 841639340 842049837 842517555
2327.2 842517555 843081176 843461156 843493104 843421698 843447983 843500257 843364298 842659533 841224670 840119779
2347.6 840119779 840342462 841746926 843598187 845194101 846164227 846306920 845773518 844823241 843538821
2366 843538821 841963410 840201139 838417053 836745024 835201144 833760500 832451582 831364751 830620944
2384.3 830620944 830218673 829945683 829632223 829333365 829108834 828922093 828739107 828512371 828205705 827885211
2404.7 827885211 827643692 827417731 827102244 826706350 826280236 825865388 825485706 825118184 824650884 824044526
2425.1 824044526 823451757 822995722 822608173 822151124 821573317 820941448 820380270 819912434 819428146 818836749
2445.5H18836749o76811o48201n20706m26829m58955n53370n96046n27263m10318m00782
2465.9H13617468n14090n93960n50330m49360l96072m29750n06759n21600m19676l17335
2486.3H08918536l34382m04656m30227l79920k72095j96397k21193l24190l67999k73168
2506.7H05714309j73628k14696l51429m36485l99411k98380k65539l46065m67539n30183
2527.1H02230954n06401m53412m49419n68867p07984o83129n44906m81307n45919o43492
2547.5G96646118o50048n49257n01871n84483p03812p32541n99027m27246l89218n10871
2567.9G90997744o61850o72400n57483m63724n02169o41525o73413n14388l51131l22998
2588.3G85636663m21106n36204m88400l15190k54869l76523n27978n53905m76182m11630
$$ plain form
2445.5 818836749 818159938 817511737 816991031 816564202 816105247 815551877 814955831 814428568 814018250 813617468
2465.9 813617468 813103378 812509418 811959088 811509728 811113656 810683906 810177147 809655547 809235871 808918536
2486.3 808918536 808584154 808179498 807749271 807369351 807097256 806900859 806679666 806355476 805987477 805714309
2506.7 805714309 805540681 805325985 804974556 804538071 804138660 803840280 803574741 803228676 802761137 802230954
2527.1 802230954 801724553 801271141 800821722 800252855 799544871 798861742 798316836 797835529 797289610 796646118
2547.5 796646118 795996070 795446813 794944942 794360459 793656647 792924106 792325079 791897833 791508615 790997744
2567.9 790997744 790335894 789663494 789106011 788642287 788140118 787498593 786825180 786310792 785959661 785636663
2588.3 785636663 785215557 784679353 784190953 783875763 783620894 783244371 782716393 782162488 781686306 781274676
2608.7G81274676m71532o62446q01086p86722p26521p48813q85427j045287j109898
2627G74036944j047731r50694r57727j098514j221478j185953j057804r95695j081229
2645.4G64440119j199960j195848j112342j024843r78052j043678j126885j077712
2661.7G55680799r54389q84593r50634j079083j065135r25242q29876q34882r02534
2680.1G47254431r24527q25644p22766p65204r02415j008391j009524r21786q74459
2698.4G39299715r42946j064062j112103j090467j073897j047910j058340j116037
2714.7G30793953j092136r85503r00924q63731q79884r04620q46505p38501p21872
2733.1G22860277p99597q21828p66576o98447o39558o49333p23481p45773o76096n99623
$$ plain form
2608.7 781274676 780803144 780140698 779339612 778552890 777826369 777077556 776192129 775146842 774036944
2627 774036944 772989213 772038519 771080792 769982278 768760800 767574847 766517043 765521348 764440119
2645.4 764440119 763240159 762044311 760931969 759907126 758929074 757885396 756758511 755680799
2661.7 755680799 754726410 753841817 752891183 751812100 750746965 749821723 748991847 748156965 747254431
2680.1 747254431 746329904 745504260 744781494 744016290 743113875 742105484 741095960 740174174 739299715
2698.4 739299715 738356769 737292707 736180604 735090137 734016240 732968330 731909990 730793953
2714.7 730793953 729701817 728716314 727815390 726951659 726071775 725167155 724320650 723582149 722860277
2733.1 722860277 722060680 721238852 720472276 719773829 719134271 718484938 717761457 717015684 716339588 715739965
2753.5G15739965n97536o66320o88911o00398n04910m79997n30183o29067p01607p07507
2773.9G09633529p33733q15332q76546r41992r96887r70006r56416j068354j251042
2792.2G01023221j385570j442194j455128j492262j584947j663208j701116j731992
2808.6F88566804j805782j928151j997769k016187k060115k151787k288103k385617
2824.9F71933293k437412k512515k589524k666950k788723k917289l061712l284037
2841.2F49675131l507495l683150l854811l957152l817380l395259k939403k698779
2857.5F21821702k745152l054559l471017l899992m368662m819751n166471n360544
2873.8E88935554n386949n204320m770636m163802l486156k793253k131819j517594
$$ plain form
2753.5 715739965 715142429 714476109 713787198 713186800 712681890 712201893 711671710 711042643 710341036 709633529
2773.9 709633529 708899796 708084464 707207918 706265926 705269039 704299033 703342617 702274263 701023221
2792.2 701023221 699637651 698195457 696740329 695248067 693663120 691999912 690298796 688566804
2808.6 688566804 686761022 684832871 682835102 680818915 678758800 676607013 674318910 671933293
2824.9 671933293 669495881 666983366 664393842 661726892 658938169 656020880 652959168 649675131
2841.2 649675131 646167636 642484486 638629675 634672523 630855143 627459884 624520481 621821702
2857.5 621821702 619076550 616021991 612550974 608650982 604282320 599462569 594296098 588935554
2873.8 588935554 583548605 578344285 573573649 569409847 565923691 563130438 560998619 559481025
2890.1E59481025j038194p88331o83188o47843o92249q28683j106560j484812j830577
2908.5E50380588k174974k624392l146172l602147l820479l748178l399730k827049
2924.8E25037467k112388j283229l74436O54519J837134K984822L900409M619598N182385
2943.2E40446281N513907N598307N617857N730748N796015N699635N555391N498469
2959.5E85456610N427003N136609M719794M390954M167140M010916L902972L767609
2975.8F20979607L679454L641010L384411K968609K703071K526343K295613K019584
2992.1F44197702J665593J317739J023114P42972N00798K09868j27673l64781n38230
3010.5F48627102p69198j075685j416623j676321j799762j843811j932084k105951
$$ plain form
2890.1 559481025 558442831 557654500 556971312 556323469 555631220 554802537 553695977 552211165 550380588
2908.5 550380588 548205614 545581222 542435050 538832903 535012424 531264246 527864516 525037467
2924.8 525037467 522925079 521641850 521267414 521921933 523759067 526743889 530644298 535263896 540446281
2943.2 540446281 545960188 551558495 557176352 562907100 568703115 574402750 579958141 585456610
2959.5 585456610 590883613 596020222 600740016 605130970 609298110 613309026 617211998 620979607
2975.8 620979607 624659061 628300071 631684482 634653091 637356162 639882505 642178118 644197702
2992.1 644197702 645863295 647181034 648204148 648947120 649447918 649657786 649530113 649165332 648627102
3010.5 648627102 647857904 646782219 645365596 643689275 641889513 640045702 638113618 636007667
3026.8F36007667k179206k179444k275645k430976k515316k447665k423346k580225
3043.1F16975844k745450k799928k755344k744198k812683k829313k837122k869606
3059.4E94582200k814949k727508k728641k847731k978385k981722k888322k714157
3075.7E71900785k571464k700030k902687k930880k917170k883792k832413k888977
3092.1E49273372k955199k863943k702773k712846k861619k844333k636612k528846
3108.4E27167201k641678k670526k496004k453804k608657k813697k949655k834380
3124.7E05698800k568900k428651k495259k603531k512157k326280k342045k540738
3141D85881239k637386k521336k329558k125949k025545k213359k467572k432406k297133
$$ plain form
3026.8 636007667 633828461 631649017 629373372 626942396 624427080 621979415 619556069 616975844
3043.1 616975844 614230394 611430466 608675122 605930924 603118241 600288928 597451806 594582200
3059.4 594582200 591767251 589039743 586311102 583463371 580484986 577503264 574614942 571900785
3075.7 571900785 569329321 566629291 563726604 560795724 557878554 554994762 552162349 549273372
3092.1 549273372 546318173 543454230 540751457 538038611 535176992 532332659 529696047 527167201
3108.4 527167201 524525523 521854997 519358993 516905189 514296532 511482835 508533180 505698800
3124.7 505698800 503129900 500701249 498205990 495602459 493090302 490764022 488421977 485881239
3141 485881239 483243853 480722517 478392959 476267010 474241465 472028106 469560534 467128128 464830995
3159.4D64830995k268941k203583k111078k085119k061784k019644k010375j977236
3175.7D48093235j918673j905561j904100j879006j874626j877040j834899j749098
3192D33150232j652360j667708j762927j737535j603722j513571j520962j578360j572192
3210.3D18540895j480371j411408j388907j394123j404405j394451j388162j341581
3226.7D07337487j210153j046032j008093j234740j453430j355380j146465j046121
3243C97837073r87441j006216j138865j131326r40174q77500j009136j058311r52214
3261.3C88735890q49485p68036o56902n90653p39515r50962r80526r33915q87752q21531
3281.7C80556613p46429o87569o26564n28276n07742o22779p84368r31769r08226o58929
$$ plain form
3159.4 464830995 462562054 460358471 458247393 456162274 454100490 452080846 450070471 448093235
3175.7 448093235 446174562 444269001 442364901 440485895 438611269 436734229 434899330 433150232
3192 433150232 431497872 429830164 428067237 426329702 424725980 423212409 421691447 420113087 418540895
3210.3 418540895 417060524 415649116 414260209 412866086 411461681 410067230 408679068 407337487
3226.7 407337487 406127334 405081302 404073209 402838469 401385039 400029659 398883194 397837073
3243 397837073 396849632 395843416 394704551 393573225 392633051 391755551 390746415 389688104 388735890
3261.3 388735890 387886405 387118369 386461467 385870814 385131299 384180337 383199811 382265896 381378144 380556613
3281.7 380556613 379810184 379122615 378496051 377967775 377460033 376837254 376052886 375121117 374212891 373553962
3302.1C73553962m66913n55009q25703j068324j128435j001627q81642q57025q40545
3320.5C65928739p96705p86066r09895j030594r79066q82745p88867o91772p47710
3338.8C58315319r26107j066357j138032r97632p13945p69108j108051j201629j020998
3357.2C49373460q61615q34465q25972o82145o09338q68112j210481j195192q97497
3375.5C41388643p60228p85440p85261p41780o33150m17382j76102k46376o03974o65724
3395.9C35573226k94596q8006m23938p87050o47932l37571k21133k47270l75867m26143
3416.3C31723720k31177j16467j92166r5725J74135L02643J88321J90943L49224J94877
3436.7C32488328j63167j94699J04546L72202M31746L60697L70801M78834N54919O19024
$$ plain form
3302.1 373553962 373087049 372532040 371706337 370638013 369509578 368507951 367626309 366769284 365928739
3320.5 365928739 365132034 364345968 363436073 362405479 361426413 360543668 359754801 359063029 358315319
3338.8 358315319 357389212 356322855 355184823 354187191 353473246 352704138 351596087 350394458 349373460
3357.2 349373460 348511845 347677380 346851408 346169263 345559925 344691813 343481332 342286140 341388643
3375.5 341388643 340628415 339842975 339057714 338315934 337682784 337265402 337089300 336842924 336238950 335573226
3395.9 335573226 335278630 335190624 334766686 333979636 333331704 332994133 332773000 332525730 332149863 331723720
3416.3 331723720 331492543 331376076 331183910 331088185 331262320 331564963 331753284 331944227 332293451 332488328
3436.7 332488328 332325161 332130462 332235008 332607210 333038956 333399653 333770454 334249288 334804207 335423231
3457.1C35423231P01100O08891N84960R36776J145184P80374K72960K66880O36398
3475.5C41356754R57489R34393O22153O24329R02295Q69632P35521Q68410R93788J009464
3495.9C49874228R90838R95785J005322Q24570O66082P89583J028746J222998J161397
3514.2C58559549R01371Q85695J170934J398325J203238Q45552Q38846J121640J388371
3532.6C68313521J503617J357466J206308J482398J769989J518965J052737J100123
3548.9C79305124J410455J542985J640260J775176J955509K111673K035231J813769
3565.2C93590182J961112K323568K328575K308309K515107K693117K867907L121167
3581.5D13709044L211022K951890K694517K986551L211140L189356L333419L566325
$$ plain form
3457.1 335423231 336124331 336733222 337318182 338254958 339400142 340180516 340453476 340720356 341356754
3475.5 341356754 342314243 343248636 343870789 344495118 345397413 346267045 347002566 347870976 348864764 349874228
3495.9 349874228 350865066 351860851 352866173 353690743 354356825 355146408 356175154 357398152 358559549
3514.2 358559549 359460920 360346615 361517549 362915874 364119112 364964664 365803510 366925150 368313521
3532.6 368313521 369817138 371174604 372380912 373863310 375633299 377152264 378205001 379305124
3548.9 379305124 380715579 382258564 383898824 385674000 387629509 389741182 391776413 393590182
3565.2 393590182 395551294 397874862 400203437 402511746 405026853 407719970 410587877 413709044
3581.5 413709044 416920066 419871956 422566473 425553024 428764164 431953520 435286939 438853264
3597.9D38853264L585130L528118L487945L350734L433317L698468L807962L882468
3614.2D67627406L757984L655672L992378M004807L735423L413528L314495L948063
3630.5D97449756M015982L715753L608823L612995L753245L944874L989995L818333
3646.8E27909756L675401L739476L525019L226042L531277L740966L378928L240168
3663.1E55967033L464997L377855L080129L319562L024339K330244K650559K884686
3679.4E80099404K792179K990008L142476K891183K223491J908362K124668K290487
3695.8F00462258K234995J955033J738429J944661K182722K065062J532436J175463
3712.1F15291059J637936J896917J809776J750052J659572J398564J314580J666665
$$ plain form
3597.9 438853264 442438394 445966512 449454457 452805191 456238508 459936976 463744938 467627406
3614.2 467627406 471385390 475041062 479033440 483038247 486773670 490187198 493501693 497449756
3630.5 497449756 501465738 505181491 508790314 512403309 516156554 520101428 524091423 527909756
3646.8 527909756 531585157 535324633 538849652 542075694 545606971 549347937 552726865 555967033
3663.1 555967033 559432030 562809885 565890014 569209576 572233915 574564159 577214718 580099404
3679.4 580099404 582891583 585881591 589024067 591915250 594138741 596047103 598171771 600462258
3695.8 600462258 602697253 604652286 606390715 608335376 610518098 612583160 614115596 615291059
3712.1 615291059 616928995 618825912 620635688 622385740 624045312 625443876 626758456 628425121
3728.4F28425121J814008J601279J141906R39130J451135J571655O91533L54648J426101
3746.7F39416516J169264K00689P56443J526653J254320Q51334J041412J193941J087188
3765.1F48497760R44972O47605O92904J077950J225114J102209Q34405P49350P14242
3783.5F56486511O56069P83920R52542J066088J042486R95576J072168O38366K97904
3801.8F63991630Q03471N60105K83598R21727J267135Q31306N54502Q93414L89874
3820.2F70496762J64687P76649Q16882P77304P74324Q55386J088560O68287l1293O2407
3840.6F76449955L67820O60717J056791J280367P46071p64727n53966J050174J202047
3858.9F81495249P84576L69191M08590N75543K58982K28762M02630N71132P37965M42981
$$ plain form
3728.4 628425121 630239129 631840408 632982314 633921444 635372579 636944234 637635767 637990415 639416516
3746.7 639416516 640585780 640786469 641542912 643069565 644323885 645175219 646216631 647410572 648497760
3765.1 648497760 649442732 650090337 650783241 651861191 653086305 654188514 655022919 655772269 656486511
3783.5 656486511 657142580 657926500 658879042 659945130 660987616 661983192 663055360 663693726 663991630
3801.8 663991630 664795101 665355206 665638804 666560531 667827666 668658972 669213474 670106888 670496762
3820.2 670496762 670661449 671438098 672254980 673032284 673806608 674661994 675750554 676418841 676387548 676449955
3840.6 676449955 676817775 677478492 678535283 679815650 680561721 679796994 679243028 680293202 681495249
3858.9 681495249 682279825 682649016 683057606 683633149 683892131 684120893 684523523 685094655 685832620 686275601
3879.3F86275601M17233M49836J02222L21210M48286K01702M82559Q18670O85632L61443
3899.7F90564394m6313k87831M2856M21941M84825N37097N06759K01881K5749K93135
3920.1F92744493M25876J63555J19150K94685J88053J24156K89917L22163L04937K35677
3940.5F95212662J01388K01046L07918K02894J38938J89841K58684K89202K82168K35141
3960.9F97419882J98006K05219J91629J55449J39952J45793J71125K20537K54869K61367
3981.3F99363828K25067J57595J49428J95980J67251Q6606R6500J98304
3997.6G00640559
$$ plain form
3879.3 686275601 686692834 687142670 687244892 687566102 688014388 688216090 688698649 689517319 690202951 690564394
3899.7 690564394 690518081 690230250 690273106 690695047 691179872 691716969 692223728 692425609 692451358 692744493
3920.1 692744493 693170369 693333924 693453074 693747759 693935812 694059968 694349885 694672048 694976985 695212662
3940.5 695212662 695314050 695515096 695823014 696025908 696164846 696354687 696613371 696902573 697184741 697419882
3960.9 697419882 697617888 697823107 698014736 698170185 698310137 698455930 698627055 698847592 699102461 699363828
3981.3 699363828 699588895 699746490 699895918 700091898 700259149 700345755 700442255 700640559
3997.6 700640559
##END=$$ End of the data block
