##TITLE=$$ Begin of the data block
##JCAMP-DX=5.00 $$ ACD/SpecManager v 10.08
##SPECTROMETER/DATA SYSTEM=Alpha
##DATE=23 Dec 2014 14:28:26
##DATA TYPE=INFRARED SPECTRUM
##DATA CLASS=XYDATA
##ORIGIN=
##OWNER=
##NPOINTS=1765
##FIRSTX=399.76428223
##LASTX=3997.64306641
##MAXX=3997.64306641
##MINX=399.76428223
##MAXY=0.83360779
##MINY=0.22093219
##XFACTOR=1.0000000000
##YFACTOR=1.000000000000000e-9
##FIRSTY=0.52711248
##DELTAX=2.03961372
##XUNITS=1/CM
##YUNITS=ARBITRARY UNITS
##XYDATA=(X++(Y..Y))
399.8 527112484 523185730 519306660 515536785 513766706 514736056 517335951 520094812 521828651 521930754
418.1 521930754 520489097 518704534 517001867 514777303 511583269 508015692 504889905 502394080
434.4 502394080 500708759 500449181 502314687 506237745 510979295 515817821 520462871 523808241 525218785
452.8 525218785 525063455 524104178 522986412 521845102 520236492 517659664 514082491 510275602 506796956
471.2 506796956 503610134 500936210 498781562 496877760 495270491 494493634 494778246 495392650 495419800
489.5 495419800 494500607 492990464 491499245 490215778 488810629 486725688 483760685 480354786 477115810
507.9 477115810 474220753 471100062 467174828 462273389 456831157 452039570 448679358 446679205
524.2 446679205 445588738 444965988 444772393 445356160 447359055 451418430 457280576 463519990 468611032
542.5 468611032 472019196 474088699 475043893 474730760 473136544 470375955 466763735 462787598 458454400
560.9 458454400 453210592 446725667 439282298 431802034 425602674 421822459 420968503 422720611 426565766
579.3 426565766 432332397 439654201 447595477 454921573 460562170 464138418 465959668 466737032 467040539
597.6 467040539 467084914 466995090 466743261 466257215 465993047 466702282 468475163 470796973 473298430 475933105
618 475933105 478946179 482729584 487216800 491754949 495629758 498529971 500790656 502929986 505140722
636.4 505140722 507260323 508929014 509970963 510740757 511883199 513594687 515328705 516593516 517393708
654.7 517393708 517953694 518675864 519824386 521190464 522724986 525115967 527096391 527227581 527998030
673.1 527998030 529911578 531847894 533345997 534570873 535804033 537131071 538246036 538678408 538201153
691.4 538201153 536932468 535100937 532782555 529917896 526547253 523029625 520014465 518250048
707.7 518250048 518176019 519712448 522549391 526429176 531220198 536794901 542935014 549460530 556008995
726.1 556008995 562033474 567284584 571819961 575778306 579182148 581849813 583566666 584075093 583229065
744.5 583229065 581124187 577968061 573917747 569113791 563783228 558262289 553038776 548696458
760.8 548696458 545712531 544454396 545313299 548543215 554050446 561493754 570469975 580351591 590144336
779.1 590144336 598899901 606263578 612442672 617746413 622427225 626616001 630458117 634281754
795.4 634281754 638448536 643101931 647898972 652183473 655538678 658045709 660038292 661719024
811.8 661719024 663109481 664125085 664550602 664254189 663154483 661188841 658413827 654790223 650151134
830.1 650151134 644549847 638378203 632133007 626253724 620851517 615805566 611097097 606770456
846.4 606770456 602767825 598887026 594787896 590044081 584584773 579413474 576804936 578970790
862.8 578970790 586155891 596826315 609352052 622416556 634590328 644565523 651487172 654915810
879.1 654915810 654799521 651610792 646289170 639825583 632969320 626161277 619544446 613170266 607144594
897.4 607144594 601463139 595812082 589696288 582692027 574562550 565336704 555199862 544381082
913.7 544381082 533298969 522673488 513444960 506483495 502118587 499969125 499338329 499728531
930.1 499728531 501054049 503455997 506979764 511528671 516892195 522397935 526534081 527424216 523989320
948.4 523989320 516369879 505367577 491910160 476780921 460454345 443179250 425176680 406583279
964.7 406583279 387409896 367734373 347744435 327715695 308069080 289394736 272369713
979 272369713 257585227 245403484 235918358 229040638 224523515 221960664 220932186 221039832 221834585
997.4 221834585 223014578 224372998 225610718 226477548 226829588 226657555 226223931 225977525 226280212
1015.7 226280212 227314055 229057476 231401607 234306484 237744898 241550282 245468259 249266148
1032 249266148 252620280 255193532 256853521 257793933 258411527 259057403 259961635 261370182 263700038
1050.4 263700038 267436624 272762418 279467344 287321836 296248913 306173295 316403896 324737489
1066.7 324737489 327723056 323236585 313047349 301831692 293536603 289309025 288433760 289866924
1083 289866924 292856276 296952456 301995039 307921737 314355075 320543408 325627148 329067439 330925345
1101.4 330925345 331821382 332707524 334467411 337434500 341353625 345709532 349945813 353620768 356472760
1119.8 356472760 358514398 360172629 362193853 365262061 369523436 374233574 377991557 379429549
1136.1 379429549 377763212 373062819 366132945 358058184 349807411 342135817 335591644 330551177
1152.4 330551177 327188730 325453311 325210422 326419920 329251289 334028572 341008186 350171685
1168.7 350171685 361259073 373869568 387511551 401660562 415957630 430202991 444086313
1183 444086313 457165599 468948394 478985965 487040520 493136376 497506171 500578642 502846956
1199.3 502846956 504706144 506502151 508663416 511598051 515469670 520204663 525501370 530904651
1215.6 530904651 535969496 540282011 543466210 545254886 545616925 544810832 543274224 541450560 539619148
1234 539619148 537823260 536054194 534479797 533443868 533305585 534188390 535852909 537896812 540031552
1252.3 540031552 542136073 544101715 545758307 547024727 548021376 549079001 550591946 552687943
1268.6 552687943 555061579 557136476 558429837 558830142 558527946 557825387 557003379 556179821 555313528
1287 555313528 554319739 553111613 551629066 549861491 547835112 545613706 543322265 541094065 538957894
1305.4 538957894 536884010 534966648 533333242 531910121 530529082 529105723 527535975 525504947
1321.7 525504947 522550464 518370390 513080537 507199466 501430094 496398687 492462069 489767462
1338 489767462 488358915 488010645 488273263 488808721 489353478 489667714 489604354 489137948 488357753 487338662
1358.4 487338662 486197084 485160261 484366447 483698070 483204514 483135283 483655781 484771639 486018062
1376.7 486018062 487099618 488181442 489627242 492056251 496038347 500577390 503928781 505985200
1393.1 505985200 507033169 507096767 506414115 505278945 503776252 501953125 499973655 497894943 495798677
1411.4 495798677 493896008 492284626 490988702 490253419 490065426 490289956 490918130 491822720 493097723
1429.8 493097723 494635254 496131629 498084366 500592709 502665758 504454672 506016672 507056355
1446.1 507056355 507442296 507059395 505980253 504461169 502553701 500908494 500432670 500973344 503170192
1464.5 503170192 507147133 511865199 518084764 527806163 538822770 548329890 556800723 564827621
1480.8 564827621 572477460 579179943 585407376 592139125 598934650 604120135 608426511 613206208
1497.1 613206208 617808938 621482134 624383569 627437055 631757796 635263860 637520075 639594138
1513.4 639594138 641809702 644262373 646475077 648606241 650618434 652323127 654100418 655614018
1529.7 655614018 656763613 657832742 658631980 659024894 659606278 660426080 660897255 661016822 660779417
1548.1 660779417 660404205 660126269 659825921 659204185 658067822 656919360 656234205 655474067 654608071
1566.4 654608071 653627753 652558386 651574135 650503397 649400175 648564756 647759259 646722436 645494103
1584.8 645494103 644178867 642870724 641516864 640031695 638298512 636302173 634129345 631784141
1601.1 631784141 629282653 626596630 623636186 620325208 616880178 613502800 609825134 605781794
1617.4 605781794 602504671 599550307 596196890 592961788 589998484 587288737 585037649 583038867
1633.7 583038867 581174791 579940557 579215527 578777134 578638494 579151511 580457628 581498563 583052456
1652.1 583052456 586706161 589798570 592193425 595042944 598814607 603022873 606664419 610733271
1668.4 610733271 615881264 620480716 625139892 630415797 635026991 639064550 643714249 650271833
1684.7 650271833 655960023 660263479 664661944 668575048 672477663 676583350 680319548 684383333
1701.1 684383333 687583923 690086067 692708015 695032120 697075188 698995233 700963855 703513443
1717.4 703513443 706151962 708173156 710048378 712053478 713929653 715603232 717042327 718788385
1733.7 718788385 720851481 722431183 723989606 725737154 727453351 729268551 731413782 734143078
1750 734143078 737175882 739703596 741885602 744061351 746190906 748530209 750699103 752313375 753585994
1768.4 753585994 754720986 756130278 757842064 759312868 760432184 761337876 762214899 763258517 764450669
1786.7 764450669 765478909 766240418 767024398 767885625 768763483 769737661 770798981 771755815 772435665
1805.1 772435665 772990644 773693919 774642766 775620997 776373327 776895463 777376831 777915597 778564036 779353917
1825.5 779353917 779982209 780326307 780689895 781205416 781814516 782433450 782842457 782930791 782913864 783204556
1845.9 783204556 783776939 784305513 784597039 784670234 784699976 784868479 785239816 785658181 785895765 785851777
1866.3 785851777 785769701 786051810 786583006 787048757 787348390 787528813 787714779 788043022 788511813 788957715
1886.7 788957715 789255142 789451182 789625704 789880514 790288746 790674627 790868521 790900052 790920675 791024566
1907.1 791024566 791209519 791433811 791580021 791576087 791553020 791674316 791870534 792100072 792325854 792453825
1927.5 792453825 792533994 792665899 792868912 793056726 793145955 793123603 793084860 793209851 793491602 793745279
1947.9 793745279 793912530 794072032 794287741 794547498 794801593 795020521 795174003 795264482 795366466 795573771
1968.3 795573771 795842469 796032310 796098053 796132803 796243846 796417296 796590805 796697199 796702087 796657860
1988.7 796657860 796650410 796733618 796879709 796970308 796937108 796833336 796730280 796677887 796647251 796539545 796300709
2011.1 796300709 795957923 795571029 795213461 794870973 794401407 793743551 793081820 792711914 792581618 792397439
2031.5 792397439 792071223 791642845 791158438 790700972 790365100 790138125 789914906 789635658 789327681 789071321
2051.9 789071321 788945615 788965225 789032102 789031327 788972914 788961232 789060354 789219141 789320886 789330900 789313376
2074.3 789313376 789314926 789334297 789392173 789483249 789543271 789572835 789619803 789722383 789875209 790032983 790174544
2096.8 790174544 790292382 790396035 790534675 790722013 790890455 791009367 791108489 791196465 791270852 791355968
2117.1 791355968 791445971 791497588 791506767 791505754 791518569 791540146 791553497 791547000 791528761 791524053 791517735 791494071
2141.6 791494071 791505873 791575313 791651189 791709065 791763306 791841030 791973472 792167187 792399228 792666018 792974770
2164.1 792974770 793272972 793551564 793922782 794418275 794926047 795376956 795807838 796261191 796724916 797194600
2184.5 797194600 797675729 798133612 798532128 798890054 799265921 799678445 800089896 800475717 800834715 801164985
2204.8 801164985 801532507 801979780 802448094 802874148 803219199 803528070 803894937 804314852 804706514 805028319
2225.2 805028319 805290937 805522621 805764437 806051373 806364596 806638122 806838572 806985915 807140529 807361722
2245.6 807361722 807634711 807885408 808080792 808252871 808463693 808760405 809062243 809289336 809485197 809665620
2266 809665620 809846163 810087800 810374081 810626805 810801029 810880303 810912430 811035931 811349094 811781943
2286.4 811781943 812172294 812460780 812752366 813153028 813626528 814090550 814512789 814955533 815561593 816413760
2306.8 816413760 817433178 818414986 819183588 819830000 820706964 821971476 823385656 824578822 825408399
2325.2 825408399 826121211 826885700 827453971 827700078 827881157 828127444 828367293 828375757 827578783 825435221
2345.6 825435221 823220611 822916448 824887872 828019202 830896616 832864881 833607793 833091021 831592917
2363.9 831592917 829436958 826837003 824078202 821368515 818725884 816134989 813639104 811413109
2380.2 811413109 809643686 808364868 807506382 806935251 806515157 806205809 805984974 805797696 805596709
2398.6 805596709 805307627 804929495 804569423 804240704 803890169 803538322 803169489 802731872 802244842 801749647
2419 801749647 801239133 800693333 800145686 799609363 799045265 798459888 797887504 797308624 796701074 796083331
2439.4 796083331 795474470 794878006 794269264 793642759 793012738 792371750 791723490 791087866 790481031 789915323
2459.8 789915323 789393008 788889825 788360715 787798882 787247717 786715388 786183357 785655260 785127759 784581304
2480.2 784581304 784011662 783456445 782995284 782655895 782342255 781971037 781550586 781126440 780772507 780516028
2500.6 780516028 780272007 779936254 779508173 779078722 778741002 778499901 778256893 777920425 777468503 776947260
2521 776947260 776460171 776041031 775623679 775116861 774446666 773693562 773039222 772502661 771951079 771315753
2541.4 771315753 770599604 769838452 769122124 768476725 767848730 767224967 766600847 765923262 765200377 764544427
2561.8 764544427 763994694 763447046 762808919 762095392 761372805 760721266 760175049 759656131 759089828 758471906
2582.2 758471906 757815659 757197678 756702960 756310105 755922258 755459607 754942179 754440904 754004002 753620267
2602.6 753620267 753188848 752618909 751931429 751219690 750542641 749893844 749211848 748400211 747394145
2620.9 747394145 746276617 745230079 744284272 743311942 742212951 740959704 739632368 738397658 737296283
2639.3 737296283 736226678 735090971 733821809 732467175 731186390 730081916 729089022 728028834
2655.6 728028834 726815879 725553513 724377096 723322392 722329617 721305966 720202804 719053388
2671.9 719053388 717974722 717046082 716230869 715424716 714506269 713472605 712452769 711520255 710670769
2690.3 710670769 709840059 708889663 707780957 706631064 705533206 704489172 703456223 702344477 701110423
2708.6 701110423 699855447 698691785 697640002 696654260 695628822 694512248 693399191 692399085
2724.9 692399085 691531360 690723538 689888537 689009488 688140512 687336862 686597705 685885906 685135961 684350193
2745.3 684350193 683582962 682835817 682125747 681489766 680897415 680279970 679637492 679010630 678399622 677806735
2765.7 677806735 677235484 676626742 675911188 675098479 674260259 673425436 672555685 671632946 670632362
2784.1 670632362 669522762 668334484 667119741 665899754 664632201 663241208 661704242 660091043
2800.4 660091043 658473909 656814992 655061960 653224587 651284039 649224520 647105455 644984841
2816.7 644984841 642865241 640683293 638338745 635809481 633214653 630668342 628109336 625402689
2833 625402689 622514069 619479299 616262257 612807095 609149039 605323911 601337731 597308934 593471169
2851.4 593471169 589982986 586866975 584020436 581178010 578016639 574381053 570284009 565726101
2867.7 565726101 560743749 555466175 549969018 544304252 538717389 533608496 529265106 525710940
2884 525710940 522838593 520611763 519001842 517884612 517112970 516557097 516018689 515306830 514352441
2902.4 514352441 513126075 511575758 509704709 507500112 504783511 501451135 497677088 493725181
2918.7 493725181 489821821 486236662 483236045 480971009 479542255 479069501 479768723 481783450 484944314
2937 484944314 488981694 493734062 499073237 504826128 510776818 516782701 522817850 528814375 534720600
2955.4 534720600 540634096 546571493 552319765 557639062 562477469 566950560 571201742 575350106
2971.7 575350106 579417288 583299816 586961329 590479672 593833327 596905231 599697351 602251589
2988 602251589 604498684 606406391 608044863 609455466 610591531 611387432 611842155 611943364 611724734
3006.4 611724734 611365259 610898316 610126138 608938932 607424259 605745256 603983641 602127492 600136518
3024.7 600136518 597992063 595775306 593552053 591318071 588988543 586457193 583834171 581243396
3041.1 581243396 578613162 575873435 573049664 570244431 567444026 564559162 561659694 558762670
3057.4 558762670 555831611 552958667 550180852 547405064 544529676 541543424 538556993 535685062
3073.7 535685062 532957852 530268610 527448595 524545968 521671414 518732369 515740812 512811303
3090 512811303 509840727 506791294 503866076 501148641 498450845 495594978 492717355 490014315 487382233
3108.4 487382233 484622955 481851697 479302883 476864904 474286586 471442670 468416393 465500861
3124.7 465500861 462858737 460382521 457872748 455261499 452669173 450215906 447838128 445370287
3141 445370287 442804605 440256327 437789649 435483009 433351040 431168199 428775787 426306307 423896343
3159.4 423896343 421577632 419367015 417245656 415169954 413123846 411079884 409009665 406964630
3175.7 406964630 405013621 403138608 401234537 399270087 397354722 395562083 393839359 392094553
3192 392094553 390286356 388472348 386743218 385110706 383557409 382066727 380567431 378999382 377420932
3210.3 377420932 375931442 374550164 373230845 371916831 370558351 369156420 367761582 366420597
3226.7 366420597 365207970 364166021 363163650 361960888 360578269 359280854 358139306 357105523
3243 357105523 356165916 355177581 354052335 352975756 352087259 351275980 350386381 349421531 348478168 347603083
3263.4 347603083 346819252 346143901 345539421 344829202 343930542 343018204 342202365 341446996 340710461 339982003
3283.8 339982003 339287609 338660449 338144839 337683380 337101668 336355597 335545927 334803373 334255844 333863229
3304.2 333863229 333373666 332615137 331625104 330583304 329701453 328965276 328251332 327559710 326924950
3322.5 326924950 326312304 325561851 324659348 323803276 323039681 322380602 321857929 321260929 320456207 319602430
3342.9 319602430 318778783 318038464 317453593 316805571 315910161 314977139 314237744 313606650 312909245 312211484
3363.3 312211484 311724037 311369985 310801983 309897244 308910638 308111191 307499617 306960166 306388348 305804312
3383.7 305804312 305340260 305082321 305016935 304896772 304480433 304017603 303881764 303876221 303531885 302878499
3404.1 302878499 302374244 302195221 302176207 302112997 301831871 301423669 301203758 301200837 301216602 301273435 301475316
3426.5 301475316 301751912 301947474 302143335 302465081 302684575 302609056 302473158 302571237 302924454 303388387
3446.9 303388387 303792953 304141760 304535180 304998934 305591762 306326389 306955189 307476610 308278412 309320599
3467.3 309320599 310060591 310292602 310510159 311122090 312011987 312848479 313463062 314078927 314855188 315586030
3487.7 315586030 316251606 317056566 317984879 318961650 319872975 320717484 321658283 322510332 323097020 323781043
3508.1 323781043 324842155 326109707 327191055 327952683 328698128 329676956 330921590 332095683 332948923
3526.5 332948923 333837390 334965587 336166173 337434500 338720769 339867681 341070890 342510700
3542.8 342510700 344020456 345345646 346542776 347889870 349454701 351081073 352752686 354587227
3559.1 354587227 356479764 358149379 359842002 362352252 365247548 367601842 369743228 372149080
3575.4 372149080 374792695 377649605 380624771 383464396 386271447 389437556 392769605 395819545
3591.7 395819545 398935080 402419537 406085461 409775794 413374335 416621655 419598818 422940135
3608.1 422940135 426691562 430502266 434397161 438116819 442040682 446626097 450755268 453951180
3624.4 453951180 456817329 460728526 465691477 469769299 473364741 477050990 480761617 484534204
3640.7 484534204 488139361 491317362 494500995 498862952 503965974 507864058 511078954 514992654
3657 514992654 519094646 522585273 525776744 528843224 531620681 534601450 538034499 540910542 543971181
3675.4 543971181 547731817 550974011 553826809 556537986 559013724 561570227 564459026 567236483
3691.7 567236483 569667041 571871281 573882103 575791299 577872097 580052078 581880629 583294690
3708 583294690 584648788 586455345 588513196 590283334 591879308 593479931 595086813 596686304 598314166
3726.4 598314166 599795580 600880086 601861894 603189588 604907393 606483698 607350051 607651770 608449101
3744.7 608449101 609805167 610632837 611564398 613198578 614650130 615619183 616586447 617826581 618926704
3763.1 618926704 619875908 620917141 622002304 623170853 624270439 625171006 626029015 626975715 627881289
3781.4 627881289 628596663 629377007 630345285 631346047 632224500 632840753 633421600 634119868 634610891
3799.8 634610891 635315537 636356592 637066483 637911797 638991833 639757574 640118241 640521049 641124547
3818.1 641124547 641635835 642590463 643630505 644294083 644886494 645406604 645942926 646582007 647100747
3836.5 647100747 647543550 648145437 648882449 649708986 650438607 650802433 650603652 650318623 651311994 652699471
3856.9 652699471 653432488 653706908 653893828 654378414 654902339 655226827 655776381 656450987 657137692 657626569
3877.3 657626569 657774925 658174217 658711910 659179270 659753919 660087705 660378575 660901546 661249578 661329150
3897.7 661329150 661384821 661547601 661939323 662632763 663296223 663732350 664044023 664206505 664223194 664389431
3918.1 664389431 664757907 665014029 665180504 665465117 665752947 665928125 666198730 666624069 666940272 667079866
3938.5 667079866 667143285 667294323 667610466 667884350 668068826 668315411 668583035 668780923 668971896 669187248
3958.9 669187248 669385850 669616282 669860780 670033514 670176387 670345604 670530319 670746207 670963824 671092331
3979.3 671092331 671215534 671458900 671735108 671916008 672019303 672110140 672211170 672362685 672574580
3997.6 672574580
##END=$$ End of the data block
