##TITLE=$$ Begin of the data block
##JCAMP-DX=5.00 $$ ACD/SpecManager v 10.08
##SPECTROMETER/DATA SYSTEM=Alpha
##DATE=23 Dec 2014 14:28:26
##DATA TYPE=INFRARED SPECTRUM
##DATA CLASS=XYDATA
##ORIGIN=
##OWNER=
##NPOINTS=1765
##FIRSTX=399.76428223
##LASTX=3997.64306641
##MAXX=3997.64306641
##MINX=399.76428223
##MAXY=0.83455765
##MINY=0.22118147
##XFACTOR=1.0000000000
##YFACTOR=1.000000000000000e-9
##FIRSTY=0.52787071
##DELTAX=2.03961372
##XUNITS=1/CM
##YUNITS=ARBITRARY UNITS
##XYDATA=(X++(Y..Y))
399.8E27870715l782571m044354l900706j595378J294136K783179K642810J432956
416.1E22700787o6400j222014j316846j518190k632379l626347l641188l176332k607345
434.4E02893746j555383L9637J917839L777742M724801M832208M467249L165424J405239
452.8E25668502j7345q96454j244426j204252j556218k564489l673554l904641l456950
471.2E07150173l063559k385795j935691k006084j847088r99153K28852Q65400L45826
489.5D96352881r08196j802742j834512j523167j467734k048255k889901l273696l189593
507.9D77415085l003627l262580l983438m730016n088389m572421l324658k042353
524.2D47407603j173556p00891k63691O89954K257079L995836N537182O198227N347669
$$ plain form
399.8 527870715 524088144 520043790 516143084 514547706 515841842 518625021 521267831 522700787
416.1 522700787 522634387 521412373 520095527 518577337 515944958 512318611 508677423 505501091 502893746
434.4 502893746 501338363 501378000 503295839 507073581 511798382 516630590 521097839 524263263 525668502
452.8 525668502 525651157 524754703 523510277 522306025 520749807 518185318 514511764 510607123 507150173
471.2 507150173 504086614 501700819 499765128 497759044 495911956 494912803 495141655 496007055 496352881
489.5 496352881 495444685 493641943 491807431 490284264 488816530 486768275 483878374 480604678 477415085
507.9 477415085 474411458 471148878 467165440 462435424 457347035 452774614 449449956 447407603
524.2 447407603 446234047 445533156 445269465 445959419 448216498 452212334 457749516 463947743 469295412
542.5D69295412L543645J978577Q47667m17769j696765k670437l402919l989875m491538
560.9D58995998n200297o303280p419467p688642o358176l761530r18985J585067L775894
579.3D26706582N801380P341266P909238P376760N829633L744691J821101O73652K37822
597.6D67442125K4974j24126k51979l66002j51932P07298J782775K357185K471238
616D73891556K583593L015072L812611M537582M596859L847271K818853K188414K120913
634.3E03412724K326011K242804J701593J056433P61151J046956J560449J696408J370073
652.7E17174602R08613N79595O52731J146316J482547J584470K337396J996815J73569
671E28036654P80225K007186K008915J412869J167118J248062J263738J055061M94421
$$ plain form
542.5 469295412 472839057 474817634 475665301 475247532 473550767 470880330 467477411 463487536 458995998
560.9 458995998 453795701 447492421 440072954 432384312 426026136 422264606 421345621 422930688 426706582
579.3 426706582 432507962 439849228 447758466 455135226 460964859 464709550 466530651 467204303 467442125
597.6 467442125 467467099 467342973 467090994 466724992 466573060 467280358 469063133 471420318 473891556
616 473891556 476475149 479490221 483302832 487840414 492437273 496284544 499103397 501291811 503412724
634.3 503412724 505738735 507981539 509683132 510739565 511500716 512547672 514108121 515804529 517174602
652.7 517174602 518083215 518662810 519315541 520461857 521944404 523528874 525866270 527863085 528036654
671 528036654 528816879 530824065 532832980 534245849 535412967 536661029 537924767 538979828 539474249
689.4E39474249m24802j352728j954079k376914k812206l238023l466606l037929j775563
707.7E19035399j10030J561940K978980L968716M777312N589485O162882O485641O543577
726.1E56993902O059169N242587M493415L892958L357709K665162J712799N05805q39055
744.5E84084451k099514l139674m045368m870474n472243n631029n229176m305958
760.8E49291015k937615j219988Q50558L222406N520046P471621R046912R950459R800553
779.1E90995967Q720100P320941O156027N320132M703104M182697L823518L802598
795.4F35025084M156888M654288M799485M341841L451943K533317J964569J692831
811.8F62620246J419723R89676L26753m56214j213849j923084k676904l569007m629672
$$ plain form
689.4 539474249 539049447 537696719 535742640 533365726 530553520 527315497 523848891 520810962 519035399
707.7 519035399 518925369 520487309 523466289 527435005 532212317 537801802 543964684 550450325 556993902
726.1 556993902 563053071 568295658 572789073 576682031 580039740 582704902 584417701 584923506 584084451
744.5 584084451 581984937 578845263 574799895 569929421 564457178 558826149 553596973 549291015
760.8 549291015 546353400 545133412 545983970 549206376 554726422 562198043 571244955 581195414 590995967
779.1 590995967 599716067 607037008 613193035 618513167 623216271 627398968 631222486 635025084
795.4 635025084 639181972 643836260 648635745 652977586 656429529 658962846 660927415 662620246
811.8 662620246 664039969 665029645 665356398 664900184 663686335 661763251 659086347 655517340 650887668
830.1F50887668n697489o302237o282330n858481n349099n014897m760742m374862
846.4F07247531m007101l907323m151105m747093n386710n072773k564311K147973
862.8E79559088P185876J0671735J2473047J2992084J2121618R941875O876529L366530
879.1F55188382j76192l232300n366385o499946o827772o768167o642759o402850o009578
897.4F07262433n693436n698204o122947p005334q175134r253085j0089934j0724008
913.7E44500351j1013031j0646462r316922p014155m347921k126276o28322M24355
930.1D99831617J401603K417147L456116M502892N359829N485892M110813Q84533l460586
948.4E23989856p640123j0977209j3460904j5191406j6349971j7209411j7953605j8638402
$$ plain form
830.1 650887668 645190179 638887942 632605612 626747131 621398032 616383135 611622393 607247531
846.4 607247531 603240430 599333107 595182002 590434909 585048199 579975426 577411115 579559088
862.8 579559088 586744964 597416699 609889746 622881830 635003448 644945323 651821852 655188382
879.1 655188382 655012190 651779890 646413505 639913559 633085787 626317620 619674861 613272011 607262433
897.4 607262433 601568997 595870793 589747846 582742512 574567378 565314293 555224359 544500351
913.7 544500351 533487320 522840858 513523936 506509781 502161860 500035584 499407262 499831617
930.1 499831617 501233220 503650367 507106483 511609375 516969204 522455096 526565909 527450442 523989856
948.4 523989856 516349733 505372524 491911620 476720214 460370243 443160832 425207227 406568825
964.7D06568825j9228518j9683718j9964993j9986272j9618601j8660515j7031670
979B72394538j4811039j2179151r414450o780445m476726k538666j012594M3422P30887
997.4B21955776J181483J379386J256511Q70213L65495j21042m10899k82988K57134
1015.7B26451069R97871J720324K341405K890930L386780L766179L958687L879026
1032B49392271L375530K530277J619637R42677O54638O76900R18269J416922K309293
1050.4B63836414L690242N311489O731719P865161Q911312R929806J0244846Q311987
1066.7C24832976K958327m487395j0167718j1164099q238435m215866r09656J394778
1083B90002912K989471M133046N060077N897790O383776O161094N108983L488272J891196
$$ plain form
964.7 406568825 387340307 367656589 347691596 327705324 308086723 289426208 272394538
979 272394538 257583499 245404348 235989898 229209453 224732727 222194061 221181467 221224889 221955776
997.4 221955776 223137259 224516645 225773156 226643369 227008864 226887822 226476923 226193935 226451069
1015.7 226451069 227448940 229169264 231510669 234401599 237788379 241554558 245513245 249392271
1032 249392271 252767801 255298078 256917715 257860392 258515030 259191930 260110199 261527121 263836414
1050.4 263836414 267526656 272838145 279569864 287435025 296346337 306276143 316520989 324832976
1066.7 324832976 327791303 323303908 313136190 301972091 293733656 289517790 288608134 290002912
1083 290002912 292992383 297125429 302185506 308083296 314467072 320628166 325737149 329225421 331116617
1101.4C31116617R18895Q89450J738220K958656L924847M342824M229635L683775K844155
1119.8C56647074K029240J669497K058357L072202M197359M668146L765285J425982
1136.1C79533142j677215m674644o918013q089244q247882p661224o539553n024761
1152.4C30700606l339529j729488k68430J208276K889782M819363O954730R118765
1168.7C50354075J1069388J2605905J3637543J4157951J4311343J4248461J3867825
1183D44252491J3068378J1820972J0067850Q008659O049246M381209L115386K301037
1199.3E03065228J837492J759887K157867K929628L865421M742145N290986N371689
1215.6E31020343N039573M315555L201902J809180L62634q17358j537025j817107j824916
$$ plain form
1101.4 331116617 332035512 332924962 334663182 337621838 341546685 345889509 350119144 353802919 356647074
1119.8 356647074 358676314 360345811 362404168 365476370 369673729 374341875 378107160 379533142
1136.1 379533142 377855927 373181283 366263270 358174026 349926144 342264920 335725367 330700606
1152.4 330700606 327361077 325631589 325363159 326571435 329461217 334280580 341235310 350354075
1168.7 350354075 361423463 374029368 387666911 401824862 416136205 430384666 444252491
1183 444252491 457320869 469141841 479209691 487218350 493267596 497648805 500764191 503065228
1199.3 503065228 504902720 506662607 508820474 511750102 515615523 520357668 525648654 531020343
1215.6 531020343 536059916 540375471 543577373 545386553 545749187 544931829 543394804 541577697 539752781
1234E39752781j795828j754284j545131j016319j24693Q83758J647651K030969K136231
1252.3E40215135K099931J949966J663625J310706J046419J072407J485169K057970
1268.6E52901328K363264K094627J305163L75807l30866o96778p87973p72894q35538
1287E55616140j006126j218736j471639j761675k035737k222299k277196k233147k165854
1305.4E39223731k089084j919686j657427j429200j344502j413226j612186k072454
1321.7E25685966k946496m121780n226911n855262n769789n042374l963322k697408
1338D90062624j367301l47077K13593N16325N66512L29346n8740m43697p55072j017630
1358.4D87698883j158536j050144p92772o70671n14388j15156M77880J108616J269520
$$ plain form
1234 539752781 537956953 536202669 534657538 533641219 533516526 534400284 536047935 538078904 540215135
1252.3 540215135 542315066 544265032 545928657 547239363 548285782 549358189 550843358 552901328
1268.6 552901328 555264592 557359219 558664382 559040189 558709323 558012545 557224572 556451678 555616140
1287 555616140 554610014 553391278 551919639 550157964 548122227 545899928 543622732 541389585 539223731
1305.4 539223731 537134647 535214961 533557534 532128334 530783832 529370606 527758420 525685966
1321.7 525685966 522739470 518617690 513390779 507535517 501765728 496723354 492760032 490062624
1338 490062624 488695323 488348246 488561839 489078164 489644676 489974022 489915282 489471585 488716513 487698883
1358.4 487698883 486540347 485490203 484697431 484026760 483512372 483397216 483875096 484983712 486253232
1376.7D86253232J117617J110762J463711K421022L932684M494012L326654K025783
1393.1E06145477J030445O7234o76810j114428j475335j808702j968503k066613k091407
1411.4D96041358j910687j632571j325607p60228j87814K52187O78331R48161J287430
1429.8D93390560J521230J450717J909584K527923K112388J799166J563073J052379
1446.1E07327020M14729l40104j060188j570761k003372j660943m27782N70357K206564
1464.5E03455520L989219M737079O208122R676218J1002839R520948Q498669Q073091
1480.8E65161705P668853O668806O166339O677091O799459N236626M329443M750431
1497.1F13458753M589975L706336K910554K966642M238189L586649K348245K108991
$$ plain form
1376.7 486253232 487370849 488481611 489945322 492366344 496299028 500793040 504119694 506145477
1393.1 506145477 507175922 507243156 506566346 505451918 503976583 502167881 500199378 498132765 496041358
1411.4 496041358 494130671 492498100 491172493 490412265 490224451 490476638 491154969 492103130 493390560
1429.8 493390560 494911790 496362507 498272091 500800014 502912402 504711568 506274641 507327020
1446.1 507327020 507741749 507401645 506341457 504770696 502767324 501106381 500678599 501248956 503455520
1464.5 503455520 507444739 512181818 518389940 528066158 539068997 548589945 557088614 565161705
1480.8 565161705 572830558 579499364 585665703 592342794 599142253 604378879 608708322 613458753
1497.1 613458753 618048728 621755064 624665618 627632260 631870449 635457098 637805343 639914334
1513.4F39914334K204180K427876K172589K107859K057552J763403J818180J511813
1529.7F55977786J105070J035034Q11160M11093N67377Q10802N02050J72972j93357
1548.1F61199987l62277k84970k98560o21497j162529j099944o33061p74324q79526
1566.4F55083299r76324j082182r95815j074433j092494p99477p92861j049161j208186
1584.8F46012366j273334j302481j374304j487971j722991j992226k159655k329051
1601.1F32370353k504051k695858k961994l293216l404856l348946l709138m112184
1617.4F06340110l298819k950966l321111l156960k907098k688586k243281k036214
1633.7E83737075j919269j173973o21438l92855j59621M49717J282573J088262J585602
$$ plain form
1513.4 639914334 642118514 644546390 646718979 648826838 650884390 652647793 654465973 655977786
1529.7 655977786 657082856 658117890 658929050 659340143 659907520 660718322 661220372 661393344 661199987
1548.1 661199987 660837710 660552740 660254180 659632683 658470154 657370210 656737149 655962825 655083299
1566.4 655083299 654106975 653024793 652028978 650954545 649862051 649062574 648269713 647220552 646012366
1584.8 646012366 644739032 643436551 642062247 640574276 638851285 636859059 634699404 632370353
1601.1 632370353 629866302 627170444 624208450 620915234 617510378 614161432 610452294 606340110
1617.4 606340110 603041291 600090325 596769214 593612254 590705156 588016570 585773289 583737075
1633.7 583737075 581817806 580643833 580022395 579629540 579469919 579919636 581202209 582290471 583876073
1652.1E83876073L626883L114283K457619K905786L788114M181981L611743M042685
1668.4F11605167N124092M588247M664004N314946M659951M046619M622340O550669
1684.7F51176035N712867M329324M408777L890395L861487M068911L673076L992439
1701.1F85113311L176689K490699K641738K370476K055943J885772J927555K562165
1717.4G04224348K689302K051115J890302K011239J848162J631736J410246J702845
1733.7G19459295K070844J636744J586080J750946J720309J797855K087414K669692
1750G34779179L034592K559602K209663K214194K137780K311885K169788J621187J250207
1768.4G54288077J101792J421571J762867J476407J085520Q91924Q90255J056134J213432
$$ plain form
1652.1 583876073 587502956 590617239 593074858 595980644 599768758 603950739 607562482 611605167
1668.4 611605167 616729259 621317506 625981510 631296456 635956407 640003026 644625366 651176035
1684.7 651176035 656888902 661218226 665627003 669517398 673378885 677447796 681120872 685113311
1701.1 685113311 688290000 690780699 693422437 695792913 697848856 699734628 701662183 704224348
1717.4 704224348 706913650 708964765 710855067 712866306 714714468 716346204 717756450 719459295
1733.7 719459295 721530139 723166883 724752963 726503909 728224218 730022073 732109487 734779179
1750 734779179 737813771 740373373 742583036 744797230 746935010 749246895 751416683 753037870 754288077
1768.4 754288077 755389869 756811440 758574307 760050714 761136234 762028158 762918413 763974547 765187979
1786.7G65187979J046896P43568P68125Q85069Q91328R68814J066565R96173P40707
1805.1G73295224N77926O70553Q98063R44912P31945M99428M85658N84960O83248P60973
1825.5G80132890N71966L41952M26352N68211O22690O16073L92139L6299o4373L17693
1845.9G83961892O15299N47409L12269R1493K1457J42634L73900M33326K11477j02400
1866.3G86608756j12057L02732N58078N01394L51727K07782J74999L03388M46558M22478
1886.7G89765835K81513K16245K06351K63632M05133L90291K18093N2154r119N0485
1907.1G91840613J83701K67625J76668j1086n7578J09374K11180K40862K35379J27077
1927.5G93323815P8857J54078K13146J67251Q4102r000n6744R3281K93672K94328J88410
$$ plain form
1786.7 765187979 766234875 766978443 767746568 768631637 769522965 770491779 771558344 772554517 773295224
1805.1 773295224 773873150 774543703 775441766 776386678 777118623 777618051 778103709 778688669 779371917 780132890
1825.5 780132890 780704856 781046808 781473160 782041371 782664061 783280134 783672273 783708572 783644199 783961892
1845.9 783961892 784577191 785124600 785436869 785528362 785549819 785692453 786066353 786499679 786711156 786608756
1866.3 786608756 786496699 786799431 787357509 787858903 788210630 788418412 788593411 788896799 789343357 789765835
1886.7 789765835 790047348 790263593 790469944 790733576 791138709 791529000 791747093 791799247 791790128 791840613
1907.1 791840613 792024314 792291939 792468607 792457521 792399943 792509317 792720497 792961359 793196738 793323815
1927.5 793323815 793402672 793556750 793769896 793937147 794021249 794012249 793955505 794048786 794342458 794636786 794825196
1949.9G94825196J57953K05397K39015K51174K33888J55271R4830J19806K22981K76267
1970.3G96781778K02000R2745N2214R8586J63674J80304J14620O795p4208n1796P4267
1992.7G97640979J74463J19746j3769o4373p0989o4969n7936j32441k58625l48985
2013.1G96923101l88920l83973l83795m56452o00636o38127l81649j30355j62244l09408
2033.5G93087542m20749m68671m60387l77059k50041k09749k65241k80082k14457j05203
2053.9G90035903N246K8610l2067o5864j1742R5368J68860J35243M7922r954k0564
2076.4G90376961K3425R5844J09911N0366J5676M5717R8586J36196J48058J37628J29282
2098.8G91367650J29938J36256J67728J93059J71781J14143N2929L5166Q8215J11580
$$ plain form
1949.9 794825196 794983149 795188546 795427561 795678735 795912623 796067894 796162724 796282530 796505511 796781778
1970.3 796781778 796983778 797076523 797128737 797227323 797390997 797571301 797685921 797692716 797618508 797566712 797640979
1992.7 797640979 797815442 797935188 797921419 797857046 797786057 797721088 797663152 797530711 797272086 796923101
2013.1 796923101 796534181 796150208 795766413 795309961 794709325 794071198 793689549 793559194 793396950 793087542
2033.5 793087542 792666793 792198122 791737735 791360676 791110635 790900886 790635645 790355563 790141106 790035903
2053.9 790035903 790041149 790069759 790037692 789971828 789960086 790055454 790224314 790359557 790407479 790397525 790376961
2076.4 790376961 790400386 790496230 790606141 790656507 790672183 790717900 790816486 790952682 791100740 791238368 791367650
2098.8 791367650 791497588 791633844 791801572 791994631 792166412 792280555 792333484 792368650 792456865 792568445
2119.2G92568445N6386J848j3471L159K3544K7001K1696P212j8835k7179l994L8266
2143.7G92684078N9784M8518N5492O8426P1764J13547J92880K39432K63751L04222
2164.1G94101894K98500K79844L71396N14627N46574M67599M14073M43340M81963M79877
2184.5G98399687M61578M42624M05550L71099L83734M11332M09663L86357L61264L43919
2204.8H02376807L81946M66526N04911M48108L36825K85030L34203L98934L94106L11732
2225.2H06239128K27451K14696K44022K79724L08812K87116K19643J51515J60575K45392
2245.6H08578074K96116K60353J77562J40667K01404L10242L36469K40862J58548J69516
2266H10869813K16007K49207K64347K50578J86920R1135M6432J34707L21507M22657
$$ plain form
2119.2 792568445 792624831 792626679 792613208 792616367 792639911 792666912 792688608 792695820 792676985 792649806 792645812 792684078
2143.7 792684078 792743862 792792380 792847872 792916298 792988062 793101609 793294489 793533921 793797672 794101894
2164.1 794101894 794400394 794680238 795051634 795566261 796112835 796580434 796994507 797437847 797919810 798399687
2184.5 798399687 798861265 799303889 799709439 800080538 800464272 800875604 801285267 801671624 802032888 802376807
2204.8 802376807 802758753 803225279 803730190 804178298 804515123 804800153 805134356 805533290 805927396 806239128
2225.2 806239128 806466579 806681275 806925297 807205021 807513833 807800949 808020592 808172107 808332682 808578074
2245.6 808578074 808874190 809134543 809312105 809452772 809654176 809964418 810300887 810541749 810700297 810869813
2266 810869813 811085820 811335027 811599374 811849952 812036872 812128007 812174439 812309146 812630653 813053310
2286.4H13053310L60906K86043L12209L99470M60804M67658M23789M38988O10054Q27550
2306.8H17640781R58443R39310P72476O72281R00209J299679J426518J139641P86364
2325.2H26535702P23064P93874N61118J79827J75655L27885K55585q3208r09209k161503
2345.6H26398790k143920k51472J983107L105998K829551J940847O94751n70476j487195
2363.9H32499981k081513k463341k689421k782166k706349k549470k417803k187252
2380.2H12622666j741051j233042q35955n79118m25458k97666k10404k05279k25723
2398.6H06868970k79009l56436l69429l42906l49641l68595l86715m12702m49837m86552
2419H03067148m86315n02944n79118o12557n74053n61058n81682n87642o01649o26385
$$ plain form
2286.4 813053310 813414216 813700259 814012468 814411938 814872742 815340400 815764189 816203177 816813231 817640781
2306.8 817640781 818599224 819538534 820311010 820983291 821883500 823183179 824609697 825749338 826535702
2325.2 826535702 827258766 828052640 828613758 828793585 828969240 829297125 829552710 829469502 828560293 826398790
2345.6 826398790 824254870 824003398 825986505 829092503 831922054 833862901 834557652 833987176 832499981
2363.9 832499981 830418468 827955127 825265706 822483540 819777191 817227721 814809918 812622666
2380.2 812622666 810881615 809648573 808812618 808233500 807808042 807510376 807299972 807094693 806868970
2398.6 806868970 806589961 806233525 805864096 805521190 805171549 804802954 804416239 804003537 803553700 803067148
2419 803067148 802580833 802077889 801498771 800886214 800312161 799751103 799169421 798581779 797980130 797353745
2439.4G97353745o15895n90623o00397o00994n86629o31571o72280o39737o15299n95033
2459.8G91205287n45919n18322n31614n63085n69761n45203n05448m92036n27680n49197
2480.2G85857022n42581n35727m65691l44396l17573l89218m48227m33505l30985k17139
2500.6G81831980k28524l64066m53591m01497k97487k43127k34842l20912m97997n75959
2521G78213978m88758l86954l92973n04375o45995p06553o52313n82159n84781o39379
2541.4G72629738p12574p58767p08043o22154n81085n85020o45816p22230p31587o56426
2561.8G65906036n60641n37455o13988p04348p18951o56367n77807n45084n69523o19054
2582.2G59802818o45399o02603m79042l68238l77655m79579n53250n14388m03285l45230
$$ plain form
2439.4 797353745 796737850 796147227 795546830 794945836 794359207 793727636 793055356 792415619 791800320 791205287
2459.8 791205287 790659368 790141046 789609432 789046347 788476586 787931383 787425935 786933899 786406219 785857022
2480.2 785857022 785314441 784778714 784313023 783968627 783651054 783261836 782813609 782380104 782049119 781831980
2500.6 781831980 781603456 781239390 780785799 780384302 780086815 779843688 779608846 779287934 778789937 778213978
2521 778213978 777725220 777338266 776945293 776440918 775794923 775088370 774436057 773853898 773269117 772629738
2541.4 772629738 771917164 771158397 770450354 769828200 769247115 768662095 768016279 767294049 766562462 765906036
2561.8 765906036 765345395 764807940 764193952 763489604 762770653 762114286 761536479 760991395 760421872 759802818
2582.2 759802818 759157419 758554816 758075774 757707536 757329881 756850302 756297052 755782664 755379379 755034149
2602.6G55034149m11094n48839o79910p36714o98983o57916p06017q53003j008152
2620.9G48733521j065434j032114r77337r82046j102746j277268j344919j231909j067459
2639.3G38652289j022935j125574j279056j357913j292885j124978j016974j086056
2655.6G29345918j222790j266896j184523j035989r52482r90987j058221j090765j074731
2673.9G19468534r77278q49187q16584r16660j037478j039863r31680q30948q32916
2692.3G11235940r58979j102566j143456j100242j056671j060486j128078j212239
2708.6G02473223j221835j162231j094282j032949j019597j081884j096904r86159
2724.9F93777382q68976q31187q28504q49485q69871q18133p40647p18296p34985p56562
$$ plain form
2602.6 755034149 754623055 754074216 753394306 752657592 751958609 751300693 750594676 749741673 748733521
2620.9 748733521 747668087 746635973 745658636 744676590 743573844 742296576 740951657 739719748 738652289
2639.3 738652289 737629354 736503780 735224724 733866811 732573926 731448948 730431974 729345918
2655.6 729345918 728123128 726856232 725671709 724635720 723683238 722692251 721634030 720543265 719468534
2673.9 719468534 718491256 717642069 716825485 715908825 714871347 713831484 712899804 712068856 711235940
2692.3 711235940 710276961 709174395 708030939 706930697 705874026 704813540 703685462 702473223
2708.6 702473223 701251388 700089157 698994875 697961926 696942329 695860445 694763541 693777382
2724.9 693777382 692908406 692077219 691248715 690399230 689529359 688711226 687970579 687252283 686517298 685760736
2745.3F85760736p64548p38144p03573o83427o55771o28531o09994n92708n98848o04451
2765.7F79180741n76198n88000o75797p78079q49903q73387q62538q94249j013279
2784.1F72069311j133442j176715j167535j183987j276910j391650j491069j596451
2800.4F61651552j678765j733720j779378j839280j958549k070129k098024k081036
2816.7F46412671k106607k221167k366424k499938k575934k569973k587557k706945
2833F26778126k881110l061533l273010l486932l644764l770590l936052m061103l925800
2851.4E94737232l529847l068685k793968k863765l199756l678560m189372m631997
2867.7E66781282n007982n311012n519927n642473n533874n071402m375160l618002
$$ plain form
2745.3 685760736 684996188 684258044 683554471 682871044 682215273 681586742 680976748 680384040 679785192 679180741
2765.7 679180741 678604543 678016543 677340746 676562667 675712764 674839377 673976839 673082590 672069311
2784.1 672069311 670935869 669759154 668591619 667407632 666130722 664739072 663248003 661651552
2800.4 661651552 659972787 658239067 656459689 654620409 652661860 650591731 648493707 646412671
2816.7 646412671 644306064 642084897 639718473 637218535 634642601 632072628 629485071 626778126
2833 626778126 623897016 620835483 617562473 614075541 610430777 606660187 602724135 598663032 594737232
2851.4 594737232 591207385 588138700 585344732 582480967 579281211 575602651 571413279 566781282
2867.7 566781282 561773300 556462288 550942361 545299888 539766014 534694612 530319452 526701450
2884E26701450k898693k226650j630784j173138q22425n96523n77510p22825r35078
2902.4E15117824j182496j496256j849890k240300k753138l328085l789097l987611
2918.7D94490951l893852l583521l065586k315849j406014l98099P56770K028257L182858
2937D85795915M063219M768401N333126N720138N933941N993009O017684O018639N959988
2955.4E35604060N963385N990743N774558N287349M819036M524767M334390M208088
2971.7E76506376M110575L943741L733754L541530L313779L062129K845526K588451
2988F03645861K260447J949131J666308J427114J187443Q41678M30524N4479j78457
3006.4F13284528k91705m61936p58767j145840j497745j682818j768410j820863j920223
$$ plain form
2884 526701450 523802757 521576107 519945323 518772185 517949760 517353237 516775727 516052902 515117824
2902.4 515117824 513935328 512439072 510589182 508348882 505595744 502267659 498478562 494490951
2918.7 494490951 490597099 487013578 483947992 481632143 480226129 479828030 480584800 482613057 485795915
2937 485795915 489859134 494627535 499960661 505680799 511614740 517607749 523625433 529644072 535604060
2955.4 535604060 541567445 547558188 553332746 558620095 563439131 567963898 572298288 576506376
2971.7 576506376 580616951 584560692 588294446 591835976 595149755 598211884 601057410 603645861
2988 603645861 605906308 607855439 609521747 610948861 612136304 612977982 613408506 613462985 613284528
3006.4 613284528 612992823 612530887 611772120 610626280 609128535 607445717 605677307 603856444 601936221
3024.7F01936221k148867k297461k250850k202689k344907k574444k632916k589643
3041.1E82894444k613246k688944k791465k826988k815485k885700k929568k905488
3057.4E60437560k911866k898275k822340k756834k820730k985060l031791k912581
3073.7E37298083k750635k679825k809107k974987k989292k971649k939821k866089
3090E14316678k925277l029465k924741k712071k674281k836555k909422k767474k663165
3108.4D88874227k771616k806038k603322k507478k622038k803892k962321k918482
3124.7D66879040k693355k532780k562970k647251k576858k389192k345205k521157
3141D46610272k624154k552450k479434k335876k141804k192556k423108k495110k401054
$$ plain form
3024.7 601936221 599787354 597489893 595239043 593036354 590691447 588117003 585484087 582894444
3041.1 582894444 580281198 577592254 574800789 571973801 569158316 566272616 563343048 560437560
3057.4 560437560 557525694 554627419 551805079 549048245 546227515 543242455 540210664 537298083
3073.7 537298083 534547448 531867623 529058516 526083529 523094237 520122588 517182767 514316678
3090 514316678 511391401 508361936 505437195 502725124 500050843 497214288 494304866 491537392 488874227
3108.4 488874227 486102611 483296573 480693251 478185773 475563735 472759843 469797522 466879040
3124.7 466879040 464185685 461652905 459089935 456442684 453865826 451476634 449131429 446610272
3141 446610272 443986118 441433668 438954234 436618358 434476554 432283998 429860890 427365780 424964726
3159.4D24964726k286494k198487k138406k084434k074272k129227k151996k067238
3175.7D07834172j943499j873016j881629j899898j861096j798272j756340j763761
3192C93056661j809597j836807j789450j671821j576007j548409j539618j548379j557202
3210.3C78179371j530110j458824j342952j296729j353413j382977j364410j319647
3226.7C67130309j208752j070112j044750j234263j399160j309395j145780j013547
3243C57704550r04143r41336j104295j132667r59844q38577r19283j007706r32723
3261.3C48963976q28207p76708o96450o09249o98924q96692r37313q61675p96914p43955
3281.7C41117889p02173o70224o21230n26726m83125n96911p42495p91371p73460o48170
$$ plain form
3159.4 424964726 422678232 420479745 418341339 416256905 414182633 412053406 409901410 407834172
3175.7 407834172 405890673 404017657 402136028 400236130 398375034 396576762 394820422 393056661
3192 393056661 391247064 389410257 387620807 385948986 384372979 382824570 381284952 379736573 378179371
3210.3 378179371 376649261 375190437 373847485 372550756 371197343 369814366 368449956 367130309
3226.7 367130309 365921557 364851445 363806695 362572432 361173272 359863877 358718097 357704550
3243 357704550 356800407 355859071 354754776 353622109 352662265 351823688 350904405 349896699 348963976
3261.3 348963976 348135769 347359061 346662611 346053362 345354438 344457746 343520433 342658758 341861844 341117889
3281.7 341117889 340415716 339745492 339124262 338597536 338114411 337517500 336775005 335983634 335210174 334562004
3302.1C34562004m37141m26769p00325r71258j001775q52585p65085p64608p48337
3320.5C27894121o93291o35445p18206q47757q55506p85917o05702m65959o27190q54522
3340.9C20804626q75950q40247p45415n69344o42210r28939r78350p59483o10053o63311
3361.3C13191324o95705n04315l81380n85348r09209r93460p63744n60642n46008o12229
3381.7C06639284o00100m46260k20596m2856j70976n13703n21749j17451R5338k37733
3402.1C03863198o27429n19067k09093r9689j33633k51532l37034k13087n2452m0770
3422.5C01379412K1488K03341K99364K21253K50041L86387J97381j63436j69038J07288
3442.9C02733481L31253M36455M05401L81946M69417N31226N65589O45279N82844N16326
$$ plain form
3302.1 334562004 334124863 333698094 332997769 332026511 331024736 330172151 329407066 328642458 327894121
3320.5 327894121 327200830 326565385 325847179 324999422 324143916 323357999 322752297 322286338 321659148 320804626
3340.9 320804626 319928676 319088429 318343014 317773670 317131460 316202521 315224171 314464688 313854635 313191324
3361.3 313191324 312495619 311991304 311609924 311024576 310115367 309121907 308358163 307797521 307251513 306639284
3381.7 306639284 306039184 305592924 305372328 305329472 305158496 304644793 304123044 304005593 304100931 303863198
3402.1 303863198 303235769 302716702 302507609 302407920 302274287 302022755 301685721 301472634 301420182 301379412
3422.5 301379412 301400900 301604241 301903605 302124858 302374899 302761286 302958667 302795231 302626193 302733481
3442.9 302733481 303064734 303501189 303906590 304288536 304757953 305289179 305854768 306500047 307082891 307599217
3463.2C07599217P90804J034290P65949L12686K77639N53578Q00967Q29160O06388
3481.6C13570678N59837P74294Q04305P04974P70628Q98093J001835J000613R20594
3500C21005851Q99702P76559N82338O86318J023650J240164J104891P96884P45446
3518.3C28861803R77039J281887J242489Q87424Q51393J082658J188398J309722J362771
3536.7C39045584J194984J219600J426548J475603J295655J185537J388281J644344
3553C49876136J672864J645922J766592J844138J646251J709550K610267L012627K414823
3571.3C68199170K140969K404421K699346K894967K926350K738506K752483L268986
3587.7C90025198L479809L083110L079533L422261L599822L683657L668815L367334
$$ plain form
3463.2 307599217 308390021 309424311 310190260 310502946 310780585 311334163 312135130 312964290 313570678
3481.6 313570678 314130515 314904809 315709114 316414088 317184716 318082809 319084644 320085257 321005851
3500 321005851 321905553 322682112 323264450 323950768 324974418 326214582 327319473 328116357 328861803
3518.3 328861803 329838842 331120729 332363218 333250642 334102035 335184693 336373091 337682813 339045584
3536.7 339045584 340240568 341460168 342886716 344362319 345657974 346843511 348231792 349876136
3553 349876136 351549000 353194922 354961514 356805652 358451903 360161453 362771720 365784347 368199170
3571.3 368199170 370340139 372744560 375443906 378338873 381265223 384003729 386756212 390025198
3587.7 390025198 393505007 396588117 399667650 403089911 406689733 410373390 414042205 417409539
3604D17409539L128261L474205L783673L737092L797442L651023L880411M598946M199683
3622.3D51660275L256768K874494L859311M934431M127264L684818L750652L684998
3638.7D81833011L740668L642053L149420L047615M337460N219370L949940L243983
3655E12163520L962338M113436L517687L255784L084720K726674K888798L407658K911567
3673.3E42032182L061474L789424L293813K892434K726734K468109K544522K843678
3689.6E65652370K735854K422809K237022K058923J874626J996219K163470J855314
3706E82996607J435697J346052J788318K157390J914680J600325J492798J540006J604259
3724.3E97876132J697659J577556J114309R30250J266658J704156J567066Q32975K43187
$$ plain form
3604 417409539 420537800 424012005 427795678 431532770 435330212 438981235 442861646 447460592 451660275
3622.3 451660275 454917043 457791537 461650848 466585279 470712543 474397361 478148013 481833011
3638.7 481833011 485573679 489215732 492365152 495412767 499750227 504969597 508919537 512163520
3655 512163520 516125858 520239294 523756981 527012765 530097485 532824159 535712957 539120615 542032182
3673.3 542032182 545093656 548883080 552176893 555069327 557796061 560264170 562808692 565652370
3689.6 565652370 568388224 570811033 573048055 575106978 576981604 578977823 581141293 582996607
3706 582996607 584432304 585778356 587566674 589724064 591638744 593239069 594731867 596271873 597876132
3724.3 597876132 599573791 601151347 602265656 603195906 604462564 606166720 607733786 608566761 608809948
3742.7F08809948P19845J281083P60853R81033J797080J547754J005471R92238J266897
3761F19162202J142144R82642J034439J055300J165271J115918Q62539P65920R15408
3779.4F28201783R79066P91728Q19028R84311R65237Q52227O72400O21796O51538M18485
3799.8F35957599O81996J064241P17103Q60095J080752O93083K74777M23610O77824
3818.1F42431080N10395R26912J026571O90043O66558N13196M42684O12974N08011
3836.5F48328424L57449N97178Q63255R74357P87079K96414l59476m50730J039147
3854.8F52433097J574457Q40604K77698J50800L95537M13358K84254O04987P80523
3873.2F57755315P70390N32270J06513K77162M63366M53830N89729L31640K52843N76496
$$ plain form
3742.7 608809948 609529793 610810876 611571729 612552762 614349842 615897596 616903067 617895305 619162202
3761 619162202 620304346 621286988 622321427 623376727 624541998 625657916 626520455 627286375 628201783
3779.4 628201783 629180849 629972577 630791605 631775916 632741153 633593380 634265780 634887576 635539114 635957599
3799.8 635957599 636639595 637703836 638420939 639281034 640361786 641054869 641329646 641753256 642431080
3818.1 642431080 642941475 643868387 644894958 645585001 646251559 646764755 647207439 647820413 648328424
3836.5 648328424 648685873 649283051 650146306 651120663 651907742 652204156 651844680 651393950 652433097
3854.8 652433097 654007554 654848158 655125856 655276656 655672193 656085551 656369805 656974792 657755315
3873.2 657755315 658525705 659057975 659164488 659441650 659905016 660358846 660948575 661280215 661533058 662109554
3893.6F62109554M62830J05321K4915J34051L71873P42734P32124M66048L03746J16288
3914F65569484k1219J66893L92079K94149J97113L00944K83181J67311K86042M28260
3934.4F68064237K82049Q3089N2213K01702L23177K22921J96994L53217L71396K42174
3954.8F70393169J47462J61826K16484K15114J92761J84357J71960J53720J41323J48594
3975.2F72126770J94311K30849K50995K71320K17319J01149N0008R6023J65999K21670
3995.6F73926413K19226
3997.6F74145639
$$ plain form
3893.6 662109554 662572384 662677705 662702620 662836671 663208544 663951278 664683402 665149450 665453196 665569484
3914 665569484 665548265 665715158 666107237 666401386 666598499 666899443 667182624 667349935 667635977 668064237
3934.4 668064237 668346286 668429375 668481588 668683290 669006467 669229388 669426382 669779599 670150995 670393169
3954.8 670393169 670540631 670702457 670918941 671134055 671326816 671511173 671683133 671836853 671978176 672126770
3975.2 672126770 672321081 672551930 672802925 673074245 673291564 673392713 673442721 673538744 673704743 673926413
3995.6 673926413 674145639
3997.6 674145639
##END=$$ End of the data block
