##TITLE=$$ Begin of the data block
##JCAMP-DX=5.00 $$ ACD/SpecManager v 10.08
##SPECTROMETER/DATA SYSTEM=Alpha
##DATE=23 Dec 2014 14:28:26
##DATA TYPE=INFRARED SPECTRUM
##DATA CLASS=XYDATA
##ORIGIN=
##OWNER=
##NPOINTS=1765
##FIRSTX=399.76428223
##LASTX=3997.64306641
##MAXX=3997.64306641
##MINX=399.76428223
##MAXY=0.83526993
##MINY=0.22113509
##XFACTOR=1.0000000000
##YFACTOR=1.000000000000000e-9
##FIRSTY=0.52765739
##DELTAX=2.03961372
##XUNITS=1/CM
##YUNITS=ARBITRARY UNITS
##XYDATA=(X++(Y..Y))
399.8 527657390 523959279 519919038 516083479 514600694 516159236 518997073 521458089 522717535
416.1 522717535 522326648 520700812 519257724 517935634 515742719 512593269 509130657 505745828 502875149
434.4 502875149 501069367 501020074 503265023 507277071 511802673 516490161 521073639 524442673 525972366
452.8 525972366 525870502 524812937 523707807 522784114 521235645 518609166 515095830 511230409 507587492
471.2 507587492 504532158 502051115 499685287 497438252 495692253 494746357 494900078 495755583 496120751
489.5 496120751 495335162 493746132 492087722 490836859 489627868 487595588 484557301 481060505 477671832
507.9 477671832 474685729 471628815 467802763 462902516 457393795 452663958 449567616 447757185
524.2 447757185 446563423 445755094 445513189 446233660 448439747 452505678 458176345 464267015 469373405
542.5 469373405 472897798 475008518 475872368 475517631 473974437 471239388 467597395 463588715 459312737
560.9 459312737 454192609 447690368 439952880 432156831 426011264 422519714 421790570 423465371 427181363
579.3 427181363 432813406 439994395 447883010 455304176 461104542 464870095 466833979 467602015 467803568
597.6 467803568 467777133 467640251 467370242 467028022 467024714 467847466 469517887 471712947 474118441 476708472
618 476708472 479829550 483764410 488361359 492958874 496738225 499501586 501785696 504059017 506399572
636.4 506399572 508570433 510175943 511120558 511915565 513155460 514824510 516468883 517779291 518673778
654.7 518673778 519272327 520026267 521273613 522750437 524302423 526557565 528452516 528721988 529538929
673.1 529538929 531428516 533413589 534928858 536127687 537321806 538553119 539620697 540161431 539791942
691.4 539791942 538453996 536466420 534104705 531341493 528088987 524663806 521679461 519831181
707.7 519831181 519684553 521297634 524281323 528213143 532990873 538608491 544825792 551362276 557892680
726.1 557892680 563961387 569279611 573855639 577819347 581235349 583930254 585615754 586056650 585166454
744.5 585166454 583032906 579843640 575718462 570727348 565160096 559500098 554231822 549913824
760.8 549913824 547051668 545935452 546804726 549948812 555466831 563042045 572142124 582068741 591856658
779.1 591856658 600611985 607969582 614133596 619443059 624144733 628380716 632253051 636033416
795.4 636033416 640164852 644826055 649575591 653784335 657159626 659732521 661779106 663533747
811.8 663533747 664954245 665927351 666284084 665863216 664611161 662591636 659832418 656174660 651449323
830.1 651449323 645722449 639422834 633107007 627147377 621675611 616660655 611984193 607630134
846.4 607630134 603608608 599721134 595621109 590906918 585513473 580432236 577853858 579954565
862.8 579954565 587112486 597851396 610409975 623388290 635443866 645326912 652133822 655425549
879.1 655425549 655189276 651908576 646485686 639907598 632997394 626198530 619592190 613216341 607181728
897.4 607181728 601446688 595722079 589593887 582608700 574479520 565231442 555054486 544214964
913.7 544214964 533150971 522564948 513366103 506413758 502071619 499963403 499343485 499730855
930.1 499730855 501101613 503548622 507056057 511583924 516942501 522415519 526498973 527338386 523851156
948.4 523851156 516190231 505175829 491694272 476516843 460190356 442958444 424946576 406289607
964.7 406289607 387064219 367354274 347379744 327418983 307820767 289198577 272251487
979 272251487 257502079 245338112 235944077 229173690 224701762 222170234 221135095 221170276 221945569
997.4 221945569 223161966 224521667 225770086 226683736 227050543 226837680 226364255 226106182 226374283
1015.7 226374283 227363408 229085922 231414378 234312922 237733096 241509154 245423704 249236062
1032 249236062 252606332 255175292 256809175 257734865 258368462 259058833 259999514 261411488 263727129
1050.4 263727129 267449975 272799969 279559046 287402034 296235591 306091279 316294193 324582279
1066.7 324582279 327536732 323055595 312912971 301803052 293626279 289463699 288571149 289969772
1083 289969772 292964995 297065794 302085578 307978809 314387709 320549577 325606883 329058796 330950558
1101.4 330950558 331888735 332827836 334600210 337547392 341457129 345806152 350047648 353716344 356541187
1119.8 356541187 358588338 360265255 362281621 365335971 369575679 374244720 377947032 379327178
1136.1 379327178 377637774 372983009 366103828 358024001 349753380 342093974 335596234 330620289
1152.4 330620289 327315569 325592428 325327456 326542020 329417437 334229887 341181606 350277692
1168.7 350277692 361329556 373934209 387578696 401749223 416069329 430320203 444208562
1183 444208562 457305193 469095975 479103923 487106144 493173182 497533858 500600994 502871871
1199.3 502871871 504722416 506540835 508768499 511739671 515613258 520329833 525596917 530987442
1215.6 530987442 536032081 540295482 543454111 545247257 545587838 544768572 543269694 541500151 539701462
1234 539701462 537920356 536172330 534621954 533620238 533540010 534468710 536134303 538151801 540260911
1252.3 540260911 542342663 544297040 545983374 547307968 548334301 549357414 550800323 552847385
1268.6 552847385 555219471 557341099 558684468 559085965 558766603 558092296 557339191 556572437 555718243
1287 555718243 554696321 553450823 551959455 550227940 548254132 546062469 543785572 541570544 539429486
1305.4 539429486 537346900 535427570 533776283 532330871 530931652 529494345 527923822 525897920
1321.7 525897920 522954464 518797219 513527572 507659853 501910031 496888697 492945343 490251988
1338 490251988 488864243 488526821 488771409 489288032 489826709 490134835 490067869 489617348 488862932 487841219
1358.4 487841219 486655444 485564709 484738290 484051645 483551025 483460337 483918220 484998256 486290962
1376.7 486290962 487431467 488542914 490004271 492401928 496286243 500748038 504074156 506086528
1393.1 506086528 507070363 507107556 506436467 505324244 503842294 502063394 500158370 498136789 496064246
1411.4 496064246 494147718 492478669 491117626 490379184 490243196 490525067 491219997 492177099 493481815
1429.8 493481815 495030105 496466666 498332828 500866413 503019094 504850090 506426811 507473707
1446.1 507473707 507884204 507538080 506455123 504838824 502740085 501043200 500705242 501353443 503594935
1464.5 503594935 507617593 512359381 518487215 528054714 539055645 548658907 557219148 565303385
1480.8 565303385 572973549 579621315 585712075 592313588 599144220 604464471 608825862 613573670
1497.1 613573670 618201613 621969759 624851048 627636433 631745875 635442257 637905180 640065312
1513.4 640065312 642251134 644627929 646761954 648846507 650944114 652781308 654679716 656258941
1529.7 656258941 657355309 658369958 659205258 659532070 659907103 660723686 661365330 661661148 661570609
1548.1 661570609 661261082 660929978 660514116 659734845 658418953 657457173 657044113 656367898 655490041
1566.4 655490041 654455423 653365254 652399600 651278317 650147617 649432957 648728132 647706687 646494806
1584.8 646494806 645227849 643949449 642585516 641071022 639334261 637375057 635226965 632879615
1601.1 632879615 630415559 627796471 624861300 621561825 618156016 614792943 611063004 607005060
1617.4 607005060 603790104 600858152 597540498 594399452 591486454 588802457 586572826 584500074
1633.7 584500074 582547665 581457555 580939472 580606580 580448806 580855012 582139373 583223820 584739387
1652.1 584739387 588435471 591716051 594238400 597126663 600895524 605126679 608772159 612760723
1668.4 612760723 617849588 622480750 627175629 632499635 637145638 641118348 645600140 652086735
1684.7 652086735 657891810 662291169 666714191 670559466 674286008 678201437 681792080 685821295
1701.1 685821295 689094007 691630781 694308400 696714759 698746681 700528562 702309310 704805076
1717.4 704805076 707583070 709740937 711683154 713704169 715540469 717138350 718440413 719985604
1733.7 719985604 722052276 723741889 725322247 727087796 728839517 730635405 732702613 735373020
1750 735373020 738451242 741060436 743298650 745522141 747648537 749971628 752185047 753812432 755027175
1768.4 755027175 756081462 757473171 759278595 760829449 761953175 762850583 763749540 764819741 766042948
1786.7 766042948 767068446 767749965 768474579 769371569 770292997 771290362 772386312 773389578 774102807
1805.1 774102807 774656713 775339723 776291430 777302384 778072894 778574884 779055715 779632092 780268669
1823.4 780268669 780968606 781494439 781795740 782249749 782902420 783568919 784179866 784565926 784591973 784503520
1843.8 784503520 784829319 785478592 786047995 786375046 786473095 786501944 786670923 787059546 787464321 787627518
1864.2 787627518 787467062 787312567 787672162 788331687 788866103 789205074 789421976 789620459 789944351 790404916
1884.6 790404916 790809751 791031837 791196048 791395843 791670799 792102098 792526901 792752445 792802632 792816877
1905 792816877 792886078 793051481 793297589 793467343 793449163 793395221 793518603 793724656 793957353 794208169
1925.4 794208169 794364929 794478953 794643819 794849813 795026243 795106232 795066774 795021296 795179665 795500815
1945.8 795500815 795769036 795935094 796078324 796265185 796516955 796808302 797063828 797219455 797309339 797429025
1966.2 797429025 797668397 797965467 798165202 798231602 798257351 798352897 798535168 798735082 798858583 798865914
1986.6 798865914 798788846 798744678 798858047 799073279 799203336 799162745 799034536 798917890 798857868 798832536
2007 798832536 798741162 798505366 798152983 797757983 797383189 797026873 796591699 795980275 795331657 794978023
2027.4 794978023 794876397 794702053 794371247 793954194 793493092 793029785 792657971 792422235 792225957 791980565
2047.8 791980565 791725874 791522086 791401625 791380107 791402042 791393876 791346133 791327953 791425467 791597962 791710913
2070.2 791710913 791741788 791742086 791752934 791805208 791893840 791983485 792036533 792070985 792122424 792214990 792363524 792533934
2094.7 792533934 792674839 792780697 792882979 793027937 793234050 793438375 793579519 793673635 793757439 793854773
2115.1 793854773 793977916 794065833 794075131 794054389 794051349 794074953 794115067 794158757 794186294 794187963 794167578 794142008
2139.6 794142008 794141591 794189394 794266522 794322968 794369400 794442058 794525981 794631422 794801950 795021892 795285642
2162 795285642 795612514 795940042 796240032 796625793 797144949 797671914 798109829 798504055 798954427 799481332
2182.4 799481332 800015450 800490737 800900221 801280677 801654577 802044451 802473307 802909851 803286552 803592205
2202.8 803592205 803904653 804318428 804826558 805332005 805758774 806099057 806417763 806793272 807216823 807605445
2223.2 807605445 807903886 808139265 808380067 808652580 808950663 809253633 809513807 809711158 809865832 810036540
2243.6 810036540 810278237 810573339 810834646 811010242 811161637 811387002 811717510 812042177 812282979 812487543
2264 812487543 812668264 812844932 813074768 813346684 813588321 813757777 813851535 813922107 814065993 814344764
2284.4 814344764 814734936 815119684 815430403 815734565 816125810 816583574 817014933 817397594 817833006 818457961
2304.8 818457961 819306672 820277750 821164846 821819305 822375715 823221445 824521005 825952828 827097654
2323.1 827097654 827851832 828492939 829218507 829772949 830013514 830192149 830406368 830568016 830482006 829656899
2343.5 829656899 827639639 825596690 825335264 827169240 830030620 832669497 834542751 835269928 834818304
2361.9 834818304 833481967 831478596 829002321 826364517 823807836 821325123 818840921 816447735
2378.2 816447735 814337373 812653542 811441243 810639083 810084105 809657574 809357166 809153736 808978736
2396.6 808978736 808783472 808509231 808155775 807802022 807468414 807115018 806745350 806357741 805923045 805459976
2417 805459976 804996729 804512441 803990304 803439856 802870810 802289307 801692843 801111937 800564945 799983561
2437.4 799983561 799351513 798740566 798144579 797514915 796884120 796287954 795691371 795050383 794385552 793753684
2457.8 793753684 793185472 792676926 792182028 791637123 791044295 790464461 789927363 789438963 788988709 788504124
2478.1 788504124 787932575 787326157 786765039 786305845 785949647 785621881 785245597 784804523 784374654 784046352
2498.5 784046352 783813000 783581197 783266842 782876790 782476962 782126248 781851947 781621933 781320632 780869663
2518.9 780869663 780329764 779831290 779427707 779025376 778502345 777835011 777125895 776490152 775931537 775377512
2539.3 775377512 774761558 774047971 773275137 772548795 771914124 771335602 770760596 770119488 769377708 768615663
2559.7 768615663 767960548 767433703 766915619 766292751 765579820 764859915 764221013 763677061 763140380 762550950
2580.1 762550950 761918068 761270642 760674298 760206282 759833217 759424150 758907080 758343220 757839859 757445395
2600.5 757445395 757121682 756748319 756229103 755560935 754820764 754114747 753448248 752741516 751915991 750926673
2620.9 750926673 749840617 748773277 747770190 746799052 745761991 744551778 743193269 741895497
2637.2 741895497 740800261 739786625 738659561 737381339 736064672 734827340 733698606 732624471
2653.5 732624471 731510043 730301440 729056239 727881134 726843357 725888610 724884152 723796189
2669.9 723796189 722684622 721627414 720698476 719889641 719083548 718165755 717144728 716125071 715183020
2688.2 715183020 714334846 713505268 712538719 711405277 710244000 709159255 708120942 707049429 705902755
2706.6 705902755 704698026 703487933 702336311 701282918 700285614 699236512 698091269 696978390
2722.9 696978390 696013451 695151985 694321930 693481386 692603588 691721737 690913141 690196812 689518213 688794494
2743.3 688794494 688011348 687230051 686474025 685756981 685095727 684470952 683843851 683217764 682625115 682026625
2763.7 682026625 681409776 680826128 680241883 679581821 678829908 678001344 677129507 676256061 675349891 674343705
2784.1 674343705 673245847 672107697 670938492 669716954 668434024 667026997 665440679 663788855
2800.4 663788855 662181079 660531223 658758819 656914592 655017257 652985156 650809228 648640275
2816.7 648640275 646535516 644341707 641973019 639481187 636915386 634318888 631700397 628990412
2833 628990412 626099825 623006165 619730353 616266668 612601280 608748257 604730964 600643575 596734047
2851.4 596734047 593226671 590134799 587288618 584421098 581236422 577555358 573365688 568714678
2867.7 568714678 563677311 558311284 552662909 546909809 541388988 536378324 531999111 528307974
2884 528307974 525311887 523015976 521379590 520250261 519448459 518821716 518203974 517459214 516532958
2902.4 516532958 515373707 513883650 511996984 509692132 506899893 503567159 499785841 495817006
2918.7 495817006 491952747 488386065 485301286 482933372 481480718 481064022 481831610 483872235 487005383
2937 487005383 490992367 495762795 501182199 506972134 512919009 518930674 524995506 531071603 537091434
2955.4 537091434 543110073 549131811 554911017 560227633 565114260 569712400 574130237 578413963
2971.7 578413963 582542837 586458087 590195477 593837559 597296715 600440264 603279352 605846643
2988 605846643 608133495 610136986 611870289 613380075 614636362 615517199 615965128 616030931 615860105
3006.4 615860105 615572691 615143299 614439964 613345444 611893058 610225081 608437836 606580138 604614794
3024.7 604614794 602442920 600146055 597894728 595689297 593367159 590851903 588281453 585715353
3041.1 585715353 583072305 580344200 577544749 574714601 571883023 569001973 566111386 563224435
3057.4 563224435 560268283 557319760 554503024 551762879 548920691 545926869 542920470 540010333
3073.7 540010333 537226737 534504235 531670928 528717220 525742948 522730887 519726872 516785979
3090 516785979 513800800 510754943 507829845 505108833 502375841 499445736 496508032 493778884 491131872
3108.4 491131872 488357276 485568583 482970715 480446965 477793545 474943370 471959114 469036072
3124.7 469036072 466315508 463765264 461203605 458521694 455882281 453442603 451072186 448561639
3141 448561639 445944428 443362415 440850168 438488364 436317295 434094101 431638539 429108679 426658452
3159.4 426658452 424322486 422119945 420000345 417894930 415791750 413693637 411589831 409516752
3175.7 409516752 407536924 405636996 403711349 401718825 399790257 398011297 396267861 394461304
3192 394461304 392602026 390737832 388956219 387299329 385748446 384237915 382659405 381008744 379407883
3210.3 379407883 377909690 376475513 375098139 373741359 372322828 370862275 369449049 368130028
3226.7 368130028 366941243 365873694 364786953 363518536 362150460 360885143 359732777 358667225
3243 358667225 357730716 356780291 355644047 354508370 353595018 352781951 351846814 350808024 349824846
3261.3 349824846 348931223 348119259 347442329 346867353 346183687 345312119 344388545 343502402 342705429 341965765
3281.7 341965765 341214597 340497524 339864701 339344025 338876128 338304281 337569773 336722881 335928977 335355073
3302.1 335355073 334937125 334432423 333673656 332726300 331760377 330857217 330014586 329227298 328485012 327821463
3322.5 327821463 327217728 326491565 325616896 324765086 323998690 323342681 322805852 322207808 321431607 320592940
3342.9 320592940 319745600 318956435 318346769 317697376 316756129 315755308 315003276 314436883 313813925
3361.3 313813925 313107342 312564462 312182009 311603040 310672730 309671104 308895290 308302224 307784021
3379.6 307784021 307239950 306632727 306130648 305880815 305864662 305767238 305268288 304672658 304497689 304568887
3400 304568887 304291278 303646594 303160578 302976280 302874476 302762091 302540720 302209914 301991999 301933885
3420.4 301933885 301910996 301943690 302096426 302338809 302602261 302932590 303310692 303474456 303328365 303177714
3440.8 303177714 303260446 303559095 303988844 304394722 304759622 305175841 305666268 306276768 306986481 307583272
3461.2 307583272 308133036 308981329 310014576 310702056 310915947 311179280 311797291 312625974 313456565
3479.6 313456565 314097583 314666361 315393358 316170007 316890985 317676753 318605483 319638938 320593596
3497.9 320593596 321444720 322349340 323171377 323784560 324489117 325521231 326768398 327908933 328759819
3516.3 328759819 329503417 330425501 331672668 332915246 333820909 334680289 335771978 336997926 338300914
3534.6 338300914 339599162 340774417 342033744 343511552 345030695 346384376 347649723 349047422
3551 349047422 350603789 352239192 353990793 355886340 357749283 359332711 360953420 363491744 366497815
3569.3 366497815 368965685 371202558 373680681 376394093 379306793 382308245 385126919 387864769
3585.6 387864769 391078353 394604504 397758633 400823325 404234469 407891154 411596060 415264398
3601.9 415264398 418671399 421805590 425206333 428949356 432736605 436616212 440310746 444182694
3618.3 444182694 448851317 453193456 456548125 459463894 463274777 468116850 472239643 475957155
3634.6 475957155 479731560 483468324 487250954 490892410 494055063 497078001 501251459 506387770
3650.9 506387770 510445118 513778329 517770588 521949649 525501370 528718948 531771064 534455597
3667.2 534455597 537279010 540654778 543542743 546591938 550458729 553847015 556766391 559487522
3683.5 559487522 561926723 564398587 567209959 570028782 572571039 574860871 576903343 578774750
3699.8 578774750 580805421 582983494 584769607 586041093 587244809 589071989 591346562 593324065
3716.2 593324065 594985306 596535504 598072529 599640548 601273954 602773547 603835940 604717851
3732.5 604717851 605989337 607799649 609453619 610292673 610445261 611085474 612430871 613196731 614096403
3750.8 614096403 615958869 617613733 618625402 619625926 620973349 622160494 623098254 624069929 625108361
3769.2 625108361 626311421 627497375 628417552 629207015 630114198 631054580 631804466 632633388 633661687
3787.5 633661687 634656191 635500014 636091411 636619687 637254715 637653708 638257146 639318824 640122592
3805.9 640122592 641083300 642279863 643097103 643423915 643753409 644302666 644751608 645694554 646801054
3824.3 646801054 647531033 648180127 648695707 649154544 649718523 650143147 650501907 651175201 652110636 653130710
3844.6 653130710 653887987 654073954 653613746 653172553 654313862 655915320 656687915 656864107 656971991
3863 656971991 657490432 658048570 658292890 658804715 659620583 660481691 661063433 661173522 661459744 661973715
3883.4 661973715 662493944 663058817 663281739 663468719 664047778 664560735 664697647 664666295 664742231 665089726
3903.8 665089726 665840387 666622519 667145193 667528689 667717934 667686105 667776763 668109715 668386579 668586552
3924.2 668586552 668911278 669239998 669431925 669713974 670159757 670483828 670582473 670564055 670662522 670988739
3944.6 670988739 671298683 671529949 671828032 672126412 672355950 672561944 672760308 672980726 673260033 673522234
3965 673522234 673673153 673796356 673991203 674177408 674327910 674524605 674740255 674940944 675156415 675338745
3985.4 675338745 675444007 675544202 675687492 675861537 676086724 676329553
3997.6 676329553
##END=$$ End of the data block
