##TITLE=$$ Begin of the data block
##JCAMP-DX=5.00 $$ ACD/SpecManager v 10.08
##SPECTROMETER/DATA SYSTEM=Alpha
##DATE=23 Dec 2014 14:28:26
##DATA TYPE=INFRARED SPECTRUM
##DATA CLASS=XYDATA
##ORIGIN=
##OWNER=
##NPOINTS=1765
##FIRSTX=399.76428223
##LASTX=3997.64306641
##MAXX=3997.64306641
##MINX=399.76428223
##MAXY=0.82534760
##MINY=0.19493467
##XFACTOR=1.0000000000
##YFACTOR=1.000000000000000e-9
##FIRSTY=0.51689500
##DELTAX=2.03961372
##XUNITS=1/CM
##YUNITS=ARBITRARY UNITS
##XYDATA=(X++(Y..Y))
$$ plain form
399.8 516894996 511563778 507914901 505639315 504905403 505670846 507487655 509446621 510227203 509981930
418.1 509981930 509896696 509052634 506612360 503555655 500657022 497862965 494943976 491584092 488583326
436.5 488583326 487771183 490099162 495255828 501494229 506747901 510331333 512523353 514004290 515080214
454.8 515080214 515243590 513939917 511665463 509195924 506790996 504134417 500727534 496390074 491971910
473.2 491971910 488789201 486715496 485193938 484055936 483169794 482596129 482526094 482783705 482775658 481922656
493.6 481922656 480021626 477370173 474734664 472668529 470839292 468364209 464873344 460705638
509.9 460705638 456274271 451864809 447434157 442788005 438025504 433636755 430441767 429067343
526.2 429067343 429153472 429639667 430261791 431755096 435069263 440585941 447524816 454112262 458591700
$$ packed form
399.8E16894996n331218l648877k275586p33912P65443J816809J958966P80582k45273
418.1E09981930q5234q44062k440274l056705k898633k794057k918989l359884l000766
436.5D88583326q12143K327979N156666O238401N253672L583432K192020J480937J075924
454.8E15080214J63376j303673k274454k469539k404928k656579l406883m337460m418164
473.2D91971910l182709k073705j521558j138002q86142n73665p0035K57611q047q53002
493.6D81922656j901030k651453k635509k066135j829237k475083l490865m167706
509.9D60705638m431367m409462m430652m646152m762501m388749l194988j374424
526.2D29067343Q6129M86195O22124J493305L314167N516678O938875O587446M479438
$$ plain form
544.6 458591700 460333496 460187763 459404081 458298743 456473947 453454733 449020147 443461597 437302291
562.9 437302291 430782974 423632860 415951610 408923715 404116750 402527153 404301822 408974171
579.3 408974171 415627509 423124403 430598557 437544286 443651408 448504239 451306492 451937258 451332718
597.6 451332718 450625271 450555682 451119244 451730877 451894164 451860994 452465922 454295665 457275897 461005986
618 461005986 464919835 468569279 472116888 476030916 480355382 484464079 487663388 489721537 490978479
636.4 490978479 492209047 494007736 496135533 497863412 498841882 499368340 500087500 501488566 503482819
654.7 503482819 505399942 506606698 507128596 507527590 508091331 509322822 512043953 514408290 515684426
673.1 515684426 516734004 518169880 520187080 522531092 524584949 525777459 526133716 526174366 526298642
$$ packed form
544.6D58591700J741796j45733p83682j105338j824796l019214m434586n558550o159306
562.9D37302291o519317p150114p681250p027895m806965j589597J774669M672349
579.3D08974171O653338P496894P474154O945729O107122M852831K802253O30766o04540
597.6D51332718p07447o9589N63562O11633J63287l3170O04928J829743K980232L730089
618D61005986L913849L649444L547609L914028M324466M108697L199309K058149J256942
636.4D90978479J230568J798689K127797J727879R78470N26458P19160J401066J994253
654.7E03482819J917123J206756N21898L98994N63741J231491K721131K364337J276136
673.1E15684426J049578J435876K017200K344012K053857J192510L56257M0650J24276
$$ plain form
691.4 526298642 526253343 525259495 522765815 518998206 514836013 511298001 508993447 507975817 508012056
709.8 508012056 509078562 511462450 515387654 520846307 527572274 534784138 541665435 548020184
726.1 548020184 554027081 559909701 565571308 570514023 574212432 576483786 577674866 578221321 578091443
744.5 578091443 576733112 573596716 568721771 562806010 556693316 550958395 545788288 541191518
760.8 541191518 537382662 534983635 534903049 537832558 543817580 552109480 561651349 571613967 581410587
779.1 581410587 590790033 599640071 607560754 614044309 619027913 623031318 626931965 631436706
795.4 631436706 636653841 641995072 646566153 650003433 652682006 655126154 657435298 659214497
811.8 659214497 660029888 659986794 659542680 659099221 658699334 657737017 655353963 651195467 645645678
$$ packed form
691.4E26298642m5299r93848k493680l767609m162193l538012k304554j017630L6239
709.8E08012056J066506K383888L925204N458653O725967P211864O881297O354749
726.1E48020184O006897N882620N661607M942715L698409K271354J191080N46455j29878
744.5E78091443j358331l136396m874945n915761o112694n734921n170107m596770
760.8E41191518l808856k399027q0586K929509N985022Q291900R541869R962618R796620
779.1E81410587R379446Q850038P920683O483555M983604M003405L900647M504741
795.4F31436706N217135N341231M571081L437280K678573K444148K309144J779199
811.8F59214497Q15391m3094m44114m43459l99887r62317k383054m158496n549789
$$ plain form
830.1 645645678 639519632 633464098 627568066 621658385 615574062 609417498 603691876 598777592
846.4 598777592 594427764 589979768 584800899 578608990 571826220 565874517 563114226 565596700
862.8 565596700 573332667 584598422 597788572 611896873 625575960 636960328 644607306 648061574
879.1 648061574 647665858 644312859 639081538 632735193 625674605 618209779 610726655 603722274 597455144
897.4 597455144 591726482 585961401 579386175 571578622 562625289 552739322 542046964 530621707
913.7 530621707 518758059 507218838 497185677 489818066 485458821 483458847 482948542 483464450
930.1 483464450 485012233 487786710 491782665 496809453 502653658 508685648 513357460 514649272
946.4 514649272 511317730 503468692 491988212 477857172 461919427 444862276 427092910 408678323
$$ packed form
830.1F45645678o126046o055534n896032n909681o084323o156564n725622m914284
846.4E98777592m349828m447996n178869o191909o782770n951703k760291K482474
862.8E65596700P735967J1265755J3190150J4108301J3679087J1384368P646978L454268
879.1F48061574l95716l352999n231321o346345p060588p464826p483124p004381o267130
897.4E97455144n728662n765081o575226p807553q953333r885967j0692358j1425257
913.7E30621707j1863648j1539221j0033161p367611m359245j999974n10305N15908
930.1D83464450J547783K774477L995955N026788N844205O031990M671812J291812
946.4E14649272l331542p849038j1480480j4131040j5937745j7057151j7769366j8414587
$$ plain form
962.7 408678323 389564127 369795263 349524289 328964084 308420330 288312435 269178182
977 269178182 251598597 236148342 223311394 213245228 205796540 200637355 197356716 195570230
993.3 195570230 194934666 195142269 195931464 197005242 198027492 198672816 198771998 198419929 197885871 197559088
1013.7 197559088 197759539 198616400 200148791 202391088 205361366 208921403 212815613 216787204 220589459
1032 220589459 223940581 226543874 228204638 229076251 229555309 229993477 230697408 232028961 234482050
1050.4 234482050 238539264 244283840 251384020 259545833 268760979 279058516 289594263 297847599
1066.7 297847599 300336123 295286238 284858704 273794860 265801728 261806428 261038840 262529850
1083 262529850 265677392 270140052 275702775 282178283 289100081 295653224 301027834 304758489 306854814
$$ packed form
962.7D08678323j9114196j9768864k0270974k0560205k0543754k0107895j9134253
977B69178182j7579585j5450255j2836948j0066166p448688n159185l280639j786486
993.3A95570230o35564K07603P89195J073778J022250O45324R9182l52069n34058l26783
1013.7A97559088K00451Q56861J532391K242297K970278L560037L894210L971591L802255
1032B20589459L351122K603293J660764Q71613M79058M38168P03931J331553K453089
1050.4B34482050M057214N744576P100180Q161813R215146J0297537J0535747Q253336
1066.7B97847599K488524n049885j0427534j1063844p993132l995300p67588J491010
1083B62529850L147542M462660N562723O475508O921798O553143N374610L730655K096325
$$ plain form
1101.4 306854814 307894826 308877915 310766995 313956738 318157524 322764158 327199280 331001699
1117.7 331001699 333866566 335822344 337353498 339321882 342510134 347014308 351976454 355883241
1134 355883241 357269228 355410397 350516856 343411744 335140347 326640338 318655640 311799675 306565344
1152.4 306565344 303207844 301676810 301764816 303353578 306648374 312089980 320013076 330406636
1168.7 330406636 342882246 356800824 371513605 386550754 401740491 416961551 431755781
1183 431755781 445451260 457454830 467421383 475324124 481370449 485855371 489078462 491316944
1199.3 491316944 492968917 494624376 496860325 500032187 504163265 509015441 514259160 519567251
1215.6 519567251 524590433 528919935 532114506 533787787 533810139 532511294 530554652 528517067 526616573
$$ packed form
1101.4C06854814J040012R83089J889080L189743M200786M606634M435122L802419
1117.7C31001699K864867J955778J531154J968384L188252M504174M962146L906787
1134C55883241J385987j858831m893541p105112q271397q500009p984698o855965n234331
1152.4C06565344l357500j531034Q8006J588762L294796N441606P923096J0393560
1168.7C30406636J2475610J3918578J4712781J5037149J5189737J5221060J4794230
1183D31755781J3695479J2003570R966553P902741O046325M484922L223091K238482
1199.3D91316944J651973J655459K235949L171862M131078M852176N243719N308091
1215.6E19567251N023182M329502L194571J673281K2352j298845j956642k037585j900494
$$ plain form
1234 526616573 524780214 522901475 521095753 519800305 519535065 520500064 522384763 524616301 526768506
1252.3 526768506 528675973 530360401 531901300 533300579 534494221 535598695 536999226 538988709
1268.6 538988709 541459858 543928027 545731723 546412587 546043575 545115471 544157565 543425739 542805135
1287 542805135 541972995 540655911 538825631 536680877 534444153 532146931 529672444 526992619 524173737
1305.4 524173737 521410286 519068003 517293751 515855074 514393747 512675762 510745108 508536994
1321.7 508536994 505543470 501258910 495647013 489209175 482797921 477237076 472976685 470153272
1338 470153272 468792319 468561321 468856484 469390064 470039696 470587462 470818639 470592171 469903111 468844473
1358.4 468844473 467642874 466714054 466304690 466057837 465822458 465873301 466457009 467777729 469463795
$$ packed form
1234E26616573j836359j878739j805722j295448k65240R64999J884699K231538K152205
1252.3E26768506J907467J684428J540899J399279J193642J104474J400531J989483
1268.6E38988709K471149K468169J803696O80864l69012r28104r57906p31826o20604
1287E42805135q32140j317084j830280k144754k236724k297222k474487k679825k818882
1305.4E24173737k763451k342283j774252j438677j461327j717985j930654k208114
1321.7E08536994k993524m284560n611897o437838o411254n560845m260391k823413
1338D70153272j360953k30998K95163N33580O49632N47766K31177k26468o89060j058638
1358.4D68844473j201599r28820m09364k46853k35379N0843N83708J320720J686066
$$ plain form
1376.7 469463795 471006781 472436637 474126190 476699799 480849922 485754699 489467084 491584867
1393.1 491584867 492429644 492280185 491537243 490502536 489053905 487174034 485137612 482929349 480616957
1411.4 480616957 478518456 476712435 475164562 474301904 474257350 474723846 475641161 476835638 478360504
1429.8 478360504 480141461 481779367 483755648 486463219 488883168 490880638 492462873 493365794
1446.1 493365794 493524432 492911428 491509974 489423275 486717641 484839737 484881938 485874325 488363266
1464.5 488363266 492796957 498070925 504720569 514968991 526891768 537380576 546625257 555221915
1480.8 555221915 563374579 570503652 576947153 583793700 590990007 596691728 601236463 606220067
1497.1 606220067 611386061 615586936 618431866 620615602 624299407 628784597 632209420 634837329
$$ packed form
1376.7D69463795J542986J429856J689553K573609M150123M904777L712385K117783
1393.1D91584867Q44777j49459p42942j034707j448631j879871k036422k208263k312392
1411.4D80616957k098501j806021j547873q62658m4554M66496R17315J194477J524866
1429.8D78360504J780957J637906J976281K707571K419949J997470J582235R02921
1446.1D93365794J58638o13004j401454k086699k705634j877904M2201R92387K488941
1464.5D88363266M433691N273968O649644J0248422J1922777J0488808R244681Q596658
1480.8E55221915Q152664P129073O443501O846547P196307N701721M544735M983604
1497.1F06220067N165994M200875K844930K183736L683805M485190L424823K627909
$$ plain form
1513.4 634837329 636956513 639134705 641365588 644003272 646961927 649520099 652001739 654061019
1529.7 654061019 655543685 657166481 658654213 659150779 659521878 661066771 662943721 664483488 665321231
1548.1 665321231 665626943 665686965 665324450 664211333 662636220 662474811 662801504 662123322 660739362
1566.4 660739362 658911407 657093585 655597508 653568268 651060164 649271131 647658050 645591497
1582.8 645591497 643324733 640984595 638546050 636005580 633450150 630918503 628442228 625954449
1599.1 625954449 623298645 620535195 617727876 614808679 611770153 608755052 605634928 601953268
1615.4 601953268 598075926 595204711 592475891 589284718 586368203 583729565 581280112 579117239
1631.7 579117239 576900542 574969172 574498177 574693263 574801505 574742079 575070083 576641977 578168511
$$ packed form
1513.4F34837329K119184K178192K230883K637684K958655K558172K481640K059280
1529.7F54061019J482666J622796J487732M96566L71099J544893J876950J539767Q37743
1548.1F65321231L05712O0022l62515j113117j575113j61409L26693o78182j383960
1566.4F60739362j827955j817822j496077k029240k508104j789033j613081k066553
1582.8F45591497k266764k340138k438545k540470k555430k531647k476275k487779
1599.1F25954449k655804k763450k807319k919197l038526l015101l120124l681660
1615.4F01953268l877342k871215k728820l191173k916515k638638k449453k162873
1631.7E79117239k216697j931370m70995J95086J08242n9426L28004J571894J526534
$$ plain form
1650.1 578168511 579766572 583743811 587763965 590728641 593668222 597348690 601592362 605180204
1666.4 605180204 608916938 613940477 618874550 624023318 629935741 635092318 639273047 643757582
1682.7 643757582 650701940 657477796 662650347 667592525 671613038 675104260 678727508 682330966
1699 682330966 686667860 690213203 692799032 695520103 697958887 699799776 701111078 702246189 704397738
1717.4 704397738 707496762 709989011 711941600 713825762 715450704 716742098 717726707 719144464
1733.7 719144464 721407950 723223209 724837422 726796985 728857875 730857670 732925355 735768914
1750 735768914 739542961 742949367 745851099 748668194 751163006 753690064 756173313 758107781 759652674
1768.4 759652674 761005342 762659371 764742970 766493797 767844141 769189298 770592213 771871924
$$ packed form
1650.1E78168511J598061L977239M020154K964676K939581L680468M243672L587842
1666.4F05180204L736734N023539M934073N148768N912423N156577M180729M484535
1682.7F43757582O944358O775856N172551M942178M020513L491222L623248L603458
1699F82330966M336894L545343K585829K721071K438784J840889J311302J135111K151549
1717.4G04397738L099024K492249J952589J884162J624942J291394R84609J417757
1733.7G19144464K263486J815259J614213J959563K060890J999795K067685K843559
1750G35768914L774047L406406K901732K817095K494812K527058K483249J934468J544893
1768.4G59652674J352668J654029K083599J750827J350344J345157J402915J279711
$$ plain form
1784.7 771871924 772948146 773612320 774028897 775097430 776691794 777915120 778682888 779467404 780584931
1803 780584931 781779170 782792330 783592582 784371078 785195410 785929143 786675811 787587643 788374901 788771689
1823.4 788771689 788992465 789191067 789606452 790638983 791766167 792431414 792762280 792871118 792680800
1841.8 792680800 792617261 793310821 794226706 794766784 794937432 794986963 795200646 795610130 796071649 796382248
1862.2 796382248 796307147 795798898 795512259 796184897 797229886 797920763 798218548 798339725 798512816 798884571
1882.6 798884571 799420834 799873412 800086737 800257564 800438225 800669491 801183522 801784694 802137852 802174807
1903 802174807 802026093 801899374 802020907 802453339 802864134 802849054 802518129 802399516 802593708 803040385
1923.4 803040385 803638637 803977191 803940892 803790390 803793967 804041982 804393589 804527402 804350019 804242373
$$ packed form
1784.7G71871924J076222O64174M16577J068533J594364J223326P67768P84516J117527
1803G80584931J194239J013160Q00252P78496Q24332P33733P46668R11832P87258L96788
1823.4G88771689K20776J98602M15385J032531J127184O65247L30866J08838j90318
1841.8G92680800o3539O93560R15885N40078J70648M9531K13683M09484M61519L10599
1862.2G96382248p5101n08249k86639O72638J044989O90877K97785J21177J73091L71755
1882.6G98884571N36263M52578K13325J70827J80661K31266N14031O01172L53158L6955
1903H02174807j48714j26719J21533M32432M10795j5080l30925j18613J94192M46677
1923.4H03040385N98252L38554l6299j50502L577K48015L51607J33813j77383j07646
$$ plain form
1943.8 804242373 804454029 804859161 805349231 805796683 806030273 806056917 806055963 806207597 806561887 806930840
1964.2 806930840 807116926 807191193 807249725 807347536 807583451 807929456 808243454 808361650 808268547 808134854
1984.6 808134854 808141589 808305323 808486819 808618307 808668971 808601320 808534622 808610380 808788121 808876693 808694422
2007 808694422 808273017 807816625 807511806 807350636 807167232 806796610 806147516 805294394 804596364 804437041
2027.4 804437041 804572642 804440796 803911746 803207695 802600861 802253664 802147567 802059650 801761031 801293612
2047.8 801293612 800892651 800711989 800791025 801031590 801131368 800933838 800644755 800562680 800804019 801220596
2068.2 801220596 801525533 801533699 801325023 801178455 801288188 801624775 801959336 802030146 801845014 801670492
2088.6 801670492 801771402 802170873 802625716 802863121 802816689 802691460 802752733 803085446 803547144 803872943
$$ packed form
1943.8H04242373K11656M05132M90070M47452K33590K6644r54J51634L54290L68953
1964.2H06930840J86086P4267N8532R7811K35915L46005L13998J18196r3103j33693
1984.6H08134854O735J63734J81496J31488N0664o7651o6698P5758J77741Q8572j82271
2007H08694422m21405m56392l04819j61170j83404l70622o49094q53122o98030j59323
2027.4H04437041J35601j31846n29050p04051o06834l47197j06097q7917k98619m67419
2047.8H01293612m00961j80662P9036K40565R9778j97530k89083q2075K41339M16577
2068.2H01220596L04937Q166k08676j46568J09733L36587L34561P0810j85132j74522
2088.6H01670492J00910L99471M54843K37405m6432j25229O1273L32713M61698L25799
$$ plain form
2109 803872943 803912818 803768277 803683519 803834915 804169536 804452837 804479718 804274499 804068089 804069400 804296136
2131.4 804296136 804580748 804696918 804544032 804282784 804172158 804349542 804704666 804933906 804861486 804623663
2151.8 804623663 804533124 804787636 805287242 805740952 805985868 806095719 806235492 806575298 807199895 807938635
2172.2 807938635 808490157 808799148 809075832 809530497 810213268 810990632 811610818 811937332 812125266 812436759
2192.6 812436759 812972903 813621342 814173520 814497292 814663112 814886212 815347373 815989554 816578448 816963136
2213 816963136 817161441 817364812 817766368 818337083 818879545 819221675 819351256 819432259 819663644 820085049
2233.4 820085049 820542812 820835352 820911288 820915937 821045995 821378410 821800232 822090626 822144151 822090447
2253.8 822090447 822134733 822378397 822745860 823043466 823137105 823105216 823159993 823427081 823863268 824272335
$$ packed form
2109H03872943L9875j44541q4758J51396L34621K83301K6881k05219k06410J311K26736
2131.4H04296136K84612J16170j52886k61248j10626J77384L55124K29240p2420k37823
2151.8H04623663r0539K54512M99606M53710K44916J09851J39773L39806O24597P38740
2172.2H07938635N51522L08991K76684M54665O82771P77364O20186L26514J87934L11493
2192.6H12436759N36144O48439N52178L23772J65820K23100M61161O42181N88894L84688
2213H16963136J98305K03371M01556N70715N42462L42130J29581Q1003K31385M21405
2233.4H20085049M57763K92540P5936M649J30058L32415M21822K90394N3525n3704
2253.8H22090447M4286K43664L67463K97606R3639l1889N4777K67088M36187M09067
$$ plain form
2274.2 824272335 824462295 824452281 824454546 824630380 824945211 825232983 825310588 825165272 824994922 824983537
2294.6 824983537 825152576 825347602 825325668 825004935 824570894 824273705 824228466 824313998 824291289 824041367
2315 824041367 823567688 823016822 822662234 822592318 822571456 822294354 821716070 821151197 820927560 820940018
2335.4 820940018 820893049 820650756 820201993 819827795 820023417 820516825 820502758 819724739 818551481 817500591
2355.8 817500591 816783369 816516340 816616714 816751122 816802680 816874921 817123175 817662537 818361461 818934202
2376.2 818934202 819238663 819307864 819281220 819368780 819622695 819835782 819750667 819313586 818734646 818306267
2396.6 818306267 818160534 818149149 817982614 817496121 816794991 816167533 815800607 815596581 815303445 814729273
2417 814729273 813911021 813091516 812497973 812141955 811776757 811162233 810273945 809283555 808481693 808009207
$$ packed form
2274.2H24272335J89960j0014K265J75834L14831K87772P7605j45316j70350j1385
2294.6H24983537J69039J95026k1934l20733m34041k97189m5239Q5532k2709k49922
2315H24041367m73679n50866l54588o9916k0862k77102n78284n64873k23637J2458
2335.4H20940018m6969k42293m48763l74198J95622M93408j4067p78019j173258j050890
2355.8H17500591p17222k67029J00374J34408N1558P2241K48254N39362O98924N72741
2376.2H18934202L04461O9201k6644Q7560K53915K13087q5115m37081n78940m28379
2396.6H18306267j45733j1385j66535m86493p01130o27458l66926k04026k93136n74172
2417H14729273q18252q19505n93543l56018l65198o14524q88288r90390q01862m72486
$$ plain form
2437.4 808009207 807667732 807147443 806321800 805311322 804398775 803773940 803359926 802906394 802198231
2455.7 802198231 801249385 800303817 799617827 799221277 798894882 798383415 797601044 796694875 795953512 795524657
2476.1 795524657 795228004 794752181 794010043 793162882 792410076 791923821 791728079 791569054 791177452 790539622
2496.5 790539622 789845943 789377987 789229274 789148152 788863897 788347304 787727177 787190795 786885440 786726832
2516.9 786726832 786445677 785880625 785109520 784347415 783776581 783398032 783017159 782396853 781489730 780499995
2537.3 780499995 779680610 779116333 778663397 778096020 777275622 776272058 775342703 774656653 774147272
2555.6 774147272 773625016 772914171 771973729 770989716 770215154 769710183 769293308 768694639 767809927 766794860
2576 766794860 765912414 765310645 764919460 764489233 763801157 762906969 762077689 761539698 761281133 761073530
$$ packed form
2437.4H08009207l41475n20289q25643j010478r12547o24835m14014m53532p08163
2455.7H02198231r48846r45568o85990l96550l26395n11467p82371r06169p41363m28855
2476.1G95524657k96653m75823p42138q47161p52806m86255j95742j59025l91602o37830
2496.5G90539622o93679m67956j48713q1122k84255n16593o20127n36382l05355j58608
2516.9G86726832k81155n65052p71105p62105n70834l78549l80873o20306r07123r89735
2537.3G80499995q19385n64277m52936n67377q20398j003564r29355o86050n09381
2555.6G74147272n22256p10845r40442r84013p74562n04971m16875n98669q84712j015067
2576G66794860q82446o01769l91185m30227o88076q94188q29280n37991k58565k07603
$$ plain form
2596.4 761073530 760653853 759947062 759146154 758482814 758004904 757609487 757050931 756127834 754998922
2614.8 754998922 753970981 753135920 752371848 751482010 750315726 748910725 747497678 746262610 745194256
2633.2 745194256 744145811 742918909 741436183 739872634 738458753 737277567 736236155 735127330
2649.5 735127330 733804584 732306778 730848730 729635417 728651106 727693141 726564288 725204587 723775864
2667.8 723775864 722549617 721620977 720820606 719896138 718748868 717496157 716381073 715530157 714802325
2686.2 714802325 713961482 712881267 711609483 710335255 709267020 708388448 707444429 706244111 704808831
2704.5 704808831 703305364 701942265 700818777 699819624 698712111 697388947 695968807 694684982
2720.9 694684982 693677545 692858875 692048132 691096842 689965844 688839555 687965095 687342703 686747372
$$ packed form
2596.4G61073530m19677p06791q00908o63340m77910l95417n58556r23097j128912
2614.8G54998922j027941q35061p64072q89838j166284j405001j413047j235068j068354
2633.2G45194256j048445j226902j482726j563549j413881j181186j041412j108825
2649.5G35127330j322746j497806j458048j213313r84311r57965j128853j359701j428723
2667.8G23775864j226247r28640q00371r24468j147270j252711j115084q50916p27832
2686.2G14802325q40843j080215j271784j274228j068235q78572r44019j200318j435280
2704.5G04808831j503467j363099j123488r99153j107513j323164j420140j283825
2720.9F94684982j007437q18670q10743r51290j130998j126289q74460o22392n95331
$$ plain form
2739.2 686747372 685991168 685019672 683967710 683061361 682388067 681851327 681236207 680423915 679534495
2757.6 679534495 678760886 678216934 677843988 677382767 676652670 675717592 674747646 673898816 673203886 672502697
2778 672502697 671574056 670368016 669041574 667791486 666685104 665600419 664319336 662741363 660989404
2796.3 660989404 659263194 657656431 656072617 654308915 652287781 650104523 647895277 645758390
2812.6 645758390 643694460 641580760 639246464 636652410 633948803 631296456 628705859 626026154
2828.9 626026154 623105049 619957745 616694927 613396287 610079408 606645584 602903545 598735332
2845.3 598735332 594273925 589842200 585721195 582065165 578844249 575802207 572646976 569220304
2861.6 569220304 565425038 561126590 556182623 550604522 544609845 538445354 532327831 526498795
$$ packed form
2739.2F86747372p56204r71496j051962r06349o73294n36740o15120q12292q89420
2757.6F79534495p73609n43952l72946m61221p30097r35078r69946q48830o94930p01189
2778F72502697r28641j206040j326442j250088j106382j084685j281083j577973j751959
2796.3F60989404j726210j606763j583814j763702k021134k183258k209246k136887
2812.6F45758390k063930k113700k334296k594054k703607k652347k590597k679705
2828.9F26026154k921105l147304l262818l298640l316879l433824l742039m168213
2845.3E98735332m461407m431725m121005l656030l220916l042042l155231l426672
2861.6E69220304l795266m298448m943967n578101n994677o164491o117523n829036
$$ plain form
2877.9 526498795 521161079 516434133 512421370 509229779 506879270 505284190 504268885 503590524
2894.2 503590524 503001869 502313733 501480818 500516951 499338359 497810751 495829999 493321538 490234822
2912.6 490234822 486606330 482603759 478409886 474185109 470167249 466622055 463845223 462156713
2928.9 462156713 461707056 462514818 464587897 467852175 472167730 477381796 483267218 489539087 495961249
2947.2 495961249 502442181 509005368 515650809 522330940 528984070 535484970 541633666 547320426
2963.6 547320426 552632332 557681620 562461197 566940486 571155071 575186074 579154074 583105385
2979.9 583105385 586873710 590260386 593229532 595863700 598283350 600504160 602447629 604091704
2996.2 604091704 605369627 606190503 606637001 606848896 606835186 606548548 605970562 605055571 603772461
$$ packed form
2877.9E26498795n337716m726946m012763l191591k350509j595080j015305o78361
2894.2E03590524n88655o88136q32915r63867j178592j527608j980752k508461l086716
2912.6D90234822l628492m002571m193873m224777m017860l545194k776832j688510
2928.9D62156713m49657Q07762K073079L264278M315555N214066N885422O271869O422162
2947.2D95961249O480932O563187O645441O680131O653130O500900O148696N686760
2963.6E47320426N311906N049288M779577M479289M214585M031003L968000L951311
2979.9E83105385L768325L386676K969146K634168K419650K220810J943469J644075
2996.2F04091704J277923Q20876M46498K11895j3710k86638n77986r14991j283110
$$ plain form
3014.5 603772461 602216959 600525439 598742306 596823692 594675541 592290521 589830697 587423921
3030.9 587423921 585043490 582539856 579805434 576979160 574199796 571417272 568578959 565649748
3047.2 565649748 562636673 559600413 556529462 553452969 550456643 547493875 544464111 541367531
3063.5 541367531 538279951 535199285 532061219 528927922 525895596 522959948 520010591 516918719
3079.8 516918719 513770044 510697365 507636249 504559696 501478434 498294324 495043933 491946042
3096.1 491946042 489091516 486247063 483171523 480009407 477026880 474205136 471298665 468284786
3112.4 468284786 465400696 462659299 459863901 456904083 453849852 450880289 448010981 445134610
3128.8 445134610 442219824 439326882 436596394 434057295 431541920 428871870 426090300 423356384
$$ packed form
3014.5F03772461j555502j691520j783133j918614k148151k385020k459824k406776
3030.9E87423921k380431k503634k734422k826274k779364k782524k838313k929211
3047.2E65649748l013075l036260l070951l076493k996326k962768l029764l096580
3063.5E41367531l087580l080666l138066l133297l032326k935648k949357l091872
3079.8E16918719l148675l072679l061116l076553l081262l184110l250391l097891
3096.1D91946042k854526k844453l075540l162116k982527k821744k906471l013879
3112.4D68284786k884090k741397k795398k959818l054231k969563k869308k876371
3128.8D45134610k914786k892942k730488k539099k515375k670050k781570k733916
$$ plain form
3145.1 423356384 420726806 418286234 416018128 413604110 410897702 408201247 405692667 403276861
3161.4 403276861 400924534 398642421 396370441 394044936 391737133 389548928 387433290 385293931
3177.7 385293931 383117944 380970716 378927290 376981705 375085831 373181999 371198595 369160861
3194 369160861 367187858 365340859 363560230 361824334 360181123 358578652 356886953 355161518 353585720
3212.4 353585720 352117509 350604504 349047095 347500235 345985532 344546854 343191683 341906726
3228.7 341906726 340714157 339515150 338123232 336616218 335236490 334026933 332921743 331879824
3245 331879824 330822855 329645962 328446478 327423036 326513410 325527132 324469626 323481977 322570294
3263.4 322570294 321674317 320863843 320181608 319434136 318477273 317465067 316551179 315732300 314946175
$$ packed form
3145.1D23356384k629578k440572k268106k414018k706408k696455k508580k415806
3161.4D03276861k352327k282113k271980k325505k307803k188205k115638k139359
3177.7C85293931k175987k147228k043426j945585j895874j903832j983404k037734
3194C69160861j973003j846999j780629j735896j643211j602471j691699j725435j575798
3212.4C53585720j468211j513005j557409j546860j514703j438678j355171j284957
3228.7C41906726j192569j199007j391918j507014j379728j209557j105190j041919
3245C31879824j056969j176893j199484j023442r09626r86278j057506r87649r11683
3263.4C22570294q95977q10474o82235p47472r56863j012206r13888q18879p86125
$$ plain form
3281.7 314946175 314148307 313348025 312606364 312011212 311506808 310917765 310185701 309356868 308527559 307837933
3302.1 307837933 307324380 306809068 306066006 305080593 304034799 303108543 302309483 301557779 300853729
3320.5 300853729 300176471 299442559 298590660 297666281 296823382 296115756 295505583 294950753 294296622 293450475
3340.9 293450475 292546749 291696250 290950745 290353268 289703459 288797408 287825018 287055284 286463708 285856992
3361.3 285856992 285186261 284637392 284209341 283584207 282646388 281697959 280992597 280421853 279833823 279221684
3381.7 279221684 278672487 278279811 278076053 278004915 277840316 277385175 276880980 276748657 276838332 276590466
3402.1 276590466 275954157 275453895 275293916 275253564 275176227 274960041 274654508 274493784 274478883 274448633
3422.5 274448633 274462223 274646372 274996012 275337607 275640756 276025623 276278108 276184410 276038229 276178062
$$ packed form
3281.7C14946175p97868q00282p41661n95152n04404n89043p32064q28833q29309o89626
3302.1C07837933n13553n15312p43062r85413j045794r26256p99060p51704p04050
3320.5C00853729o77258p33912q51899r24379q42899p07626o10173n54830o54131q46147
3340.9B93450475r03726q50499p45505n97477o49809r06051r72390p69734n91576o06716
3361.3B85856992o70731n48869m28051o25134r37819r48429p05362n70744n88030o12139
3381.7B79221684n49197l92676k03758p1138j64599m55141n04195j32323Q9675k47866
3402.1B76590466o36309n00262j59979m0352p7337k16186l05533j60724j4901l0250
3422.5B74448633J3590J84149L49640L41595L03149L84867K52485r3698j46181J39833
$$ plain form
3442.9 276178062 276586980 277086467 277535170 277978510 278476715 279008180 279623598 280350894 281052619 281741440
3463.2 281741440 282646865 283693671 284451246 284784615 285129756 285801411 286753774 287760139 288532943
3481.6 288532943 289186209 290031582 290985733 291908950 292848647 293817222 294859529 295892209 296866745
3500 296866745 297904253 298876584 299658865 300517112 301687002 303076327 304344326 305312514 306247592
3518.3 306247592 307422638 308811605 310119152 311214209 312331349 313619524 315023333 316552788
3534.6 316552788 318093538 319467932 320871353 322450519 324088156 325637728 327154189 328834355
3551 328834355 330754399 332764924 334778398 336903304 339082360 341048330 342997313 345788002 349197268
3569.3 349197268 352250010 355003089 357845873 360887706 364155740 367551118 370811403 373963505
$$ packed form
3442.9B76178062M08918M99487M48703M43340M98205N31465O15418P27296P01725O88821
3463.2B81741440R05425J046806P57575L33369L45141O71655R52363J006365P72804
3481.6B88532943O53266Q45373R54151R23217R39697R68575J042307J032680R74536
3500B96866745J037508R72331P82281Q58247J169890J389325J267999R68188R35078
3518.3C06247592J175046J388967J307547J095057J117140J288175J403809J529455
3534.6C16552788J540750J374394J403421J579166J637637J549572J516461J680166
3551C28834355J920044K010525K013474K124906K179056J965970J948983K790689L409266
3569.3C49197268L052742K753079K842784L041833L268034L395378L260285L152102
$$ plain form
3585.6 373963505 377452999 381269872 384850323 388364851 392203838 396271735 400379479 404468477
3601.9 404468477 408338785 411952645 415823817 420066535 424303293 428528517 432612598 436824888
3618.3 436824888 441713691 446382314 450096011 453246117 457217038 462489009 467328340 471728414
3634.6 471728414 476054430 480208874 484283805 488167644 491553307 494688153 498861283 504228711
3650.9 504228711 508846045 512707710 517069399 521604002 525457859 528867304 532072842 534886479
3667.2 534886479 537691474 541023076 544022143 547081947 551054835 554855764 558167398 561060548
3683.5 561060548 563448071 565690935 568344593 571368098 574263453 576803088 578924537 580749214
3699.8 580749214 582750857 585064828 587066829 588459373 589688241 591667652 594313204 596563160
$$ packed form
3585.6C73963505L489494L816873L580451L514528L838987M067897M107744M088998
3601.9D04468477L870308L613860L871172M242718M236758M225224M084081M212290
3618.3D36824888M888803M668623L713697L150106L970921N271971M839331M400074
3634.6D71728414M326016M154444M074931L883839L385663L134846M173130N367428
3650.9E04228711M617334L861665M361689M534603L853857L409445L205538K813637
3667.2E34886479K804995L331602K999067L059804L972888L800929L311634K893150
3683.5E61060548K387523K242864K653658L023505K895355K539635K121449J824677
3699.8E80749214K001643K313971K002001J392544J228868J979411K645552K249956
$$ plain form
3716.2 596563160 598200023 599538386 600899100 602346718 603880584 605424762 606557548 607297182
3732.5 607297182 608364940 610391915 612602293 613885164 614225566 614917874 616474867 617513180 618501008
3750.8 618501008 620480120 622419000 623685002 624828279 626294971 627582014 628510416 629432321 630529821
3769.2 630529821 631992102 633521914 634624183 635357976 636139512 637126267 638049722 639036715 640165448
3787.5 640165448 641174614 642023921 642665148 643167853 643670976 643942475 644506514 645710230 646736443
3805.9 646736443 647918165 649295986 650122106 650256932 650325835 650736988 651197910 652388036 653838575
3824.3 653838575 654693305 655330241 655837119 656268716 656763911 657059491 657361805 658198357 659335017
3842.6 659335017 660489321 661441386 661764860 661149442 660394669 661493123 663323820 664427936 664875686
$$ packed form
3716.2E96563160J636863J338363J360714J447618J533866J544178J132786P39634
3732.5F07297182J067758K026975K210378J282871L40402O92308J556993J038313R87828
3750.8F18501008J979112J938880J266002J143277J466692J287043R28402R21905J097500
3769.2F30529821J462281J529812J102269P33793P81536R86755R23455R86993J128733
3787.5F40165448J009166Q49307O41227N02705N03123K71499N64039J203716J026213
3805.9F46736443J181722J377821Q26120J34826O8903M11153M60922J190126J450539
3824.3F53838575Q54730O36936N06878M31597M95195K95580L02314Q36552J136660
3842.6F59335017J154304R52065L23474o15418p54773J098454J830697J104116M47750
$$ plain form
3861 664875686 664957106 665255070 665718198 665966511 666501403 667467415 668556809 669226646 669233084 669472575
3881.4 669472575 670080662 670682669 671428442 671891034 672202408 672855735 673322916 673230052 673022270 673127234
3901.8 673127234 673617423 674576581 675556600 676126420 676431060 676558793 676507711 676617801 677006900 677302480
3922.1 677302480 677521646 677944601 678286314 678342938 678578913 679110169 679516554 679736435 679838657 679925203
3942.5 679925203 680193841 680485964 680728078 681100190 681519508 681847572 682073653 682208061 682332695 682586610
3962.9 682586610 682921469 683160365 683309913 683456779 683618784 683844030 684104502 684289336 684475243 684719384
3983.3 684719384 684923470 685072064 685205579 685367286 685544372 685676634 685843945
3997.6 685843945
$$ packed form
3861F64875686Q1420K97964M63128K48313N34892R66012J089394O69837O438K39491
3881.4F69472575O08087O02007P45773M62592L11374O53327M67181r2864k07782J04964
3901.8F73127234M90189R59158R80019N69820L04640J27733n1082J10090L89099K95580
3922.1F77302480K19166M22955L41713N6624K35975N31256M06385K19881J02222Q6546
3942.5F79925203K68638K92123K42114L72112M19318L28064K26081J34408J24634K53915
3962.9F82586610L34859K38896J49548J46866J62005K25246K60472J84834J85907K44141
3983.3F84719384K04086J48594J33515J61707J77086J32262J67311
3997.6F85843945
##END=$$ End of the data block
