##TITLE=$$ Begin of the data block
##JCAMP-DX=5.00 $$ ACD/SpecManager v 10.08
##SPECTROMETER/DATA SYSTEM=Alpha
##DATE=23 Dec 2014 14:28:26
##DATA TYPE=INFRARED SPECTRUM
##DATA CLASS=XYDATA
##ORIGIN=
##OWNER=
##NPOINTS=1765
##FIRSTX=399.76428223
##LASTX=3997.64306641
##MAXX=3997.64306641
##MINX=399.76428223
##MAXY=0.82609355
##MINY=0.19473094
##XFACTOR=1.0000000000
##YFACTOR=1.000000000000000e-9
##FIRSTY=0.51265013
##DELTAX=2.03961372
##XUNITS=1/CM
##YUNITS=ARBITRARY UNITS
##XYDATA=(X++(Y..Y))
399.8 512650132 508589864 504867375 502256572 501771450 502809763 504295290 505842209 506614923 506438851
418.1 506438851 506593049 506209910 503820240 500340164 497350693 494952261 492205232 488807410 485977650
436.5 485977650 485486150 488168031 493468106 499394536 504299939 507987738 510698617 512637854 513665378
454.8 513665378 513628423 512543440 510475695 507882297 505475819 502976954 499662459 495458156 491061449
473.2 491061449 487679332 485510856 484108210 483090460 482307643 481889367 481790036 481881648 481946498 481249094
493.6 481249094 479312271 476586580 473865032 471620947 469611257 467123479 463735908 459512234
509.9 459512234 454971522 450741231 446700931 442190588 437200010 432707131 429641366 428322434
526.2 428322434 428502440 429177940 429811984 431207150 434484631 440045178 447069228 453584939 457859129
544.6 457859129 459589213 459563643 458792359 457765877 456088692 453029186 448435754 442745686 436453849
562.9 436453849 429920882 422996193 415509224 408413947 403464705 401879877 403747827 408377469
579.3 408377469 414929390 422514170 430164248 437185943 443209141 447944731 450844854 451696604 451186538
597.6 451186538 450420558 450224161 450654149 451223463 451488405 451577663 452207178 454042703 457076132 460881799
618 460881799 464922965 468605071 471999139 475874931 480371773 484599829 487775922 489746839 490932345
636.4 490932345 492154509 493994683 496181279 497943878 498954266 499519080 500225484 501596928 503601074
654.7 503601074 505534410 506767392 507331789 507732034 508248091 509435236 512224913 514676452 515915751
673.1 515915751 516879261 518349767 520521939 522930086 524895072 525992393 526320755 526392281 526556611
691.4 526556611 526499033 525449872 522904158 519176602 515118659 511620939 509266675 508177519 508227706
709.8 508227706 509350359 511768878 515806437 521406412 528158367 535339117 542184532 548484921
726.1 548484921 554468572 560378313 566110671 571099997 574765801 576994777 578173399 578694582 578532517
744.5 578532517 577139795 573956311 569045067 563075125 556899071 551136255 545972109 541389823
760.8 541389823 537581027 535171270 535079181 538035631 544076681 552381933 561893821 571832001 581603169
779.1 581603169 590961874 599831104 607823730 614372015 619246125 623076260 627026141 631695151
795.4 631695151 636955202 642230392 646784961 650272191 652912438 655269682 657570899 659419060
811.8 659419060 660301387 660146832 659490526 659055531 658827901 657935083 655520856 651348412 645816624
830.1 645816624 639662027 633542836 627639651 621728182 615579724 609371006 603634953 598697186
846.4 598697186 594353974 589938939 584739268 578516901 571766555 565921307 563281596 565793872
862.8 565793872 573484659 584722579 597881794 611912072 625530601 636911213 644510508 647843778
879.1 647843778 647381246 644033611 638790905 632413387 625333488 617840230 610319614 603301585 597032368
897.4 597032368 591270745 585454941 578878403 571115851 562205613 552326143 541612267 530200005
913.7 530200005 518357694 506797791 496749133 489414990 485121906 483174145 482665449 483160764
930.1 483160764 484699011 487448901 491421700 496460319 502309084 508314788 512952983 514209747
946.4 514209747 510882080 503081679 491595030 477416903 461482555 444439024 426660269 408239245
962.7 408239245 389143646 369408160 349122733 328518718 307972401 287918329 268852890
977 268852890 251312584 235892177 223071709 212981790 205485493 200330809 197126508 195377678
993.3 195377678 194730937 194947481 195762813 196862176 197879225 198488086 198552489 198182493 197667331 197346300
1013.7 197346300 197501749 198358700 199966371 202261701 205224112 208756983 212595209 216497913 220284507
1032 220284507 223641396 226216897 227842689 228710935 229204580 229664415 230406463 231784537 234272048
1050.4 234272048 238333032 244054288 251136690 259308964 268533766 278801143 289250880 297413856
1066.7 297413856 299893558 294903487 284520060 273479551 265555173 261637539 260875434 262345642
1083 262345642 265503854 269983590 275542319 281966746 288810641 295331538 300717175 304454118 306564867
1101.4 306564867 307643592 308656603 310561091 313766927 317980438 322577566 326985151 330766737
1117.7 330766737 333601147 335521460 337040126 339022815 342255712 346807480 351766348 355628729
1134 355628729 356980264 355089366 350164026 343048245 334774226 326287299 318349451 311564773 306405902
1152.4 306405902 303100884 301576227 301636696 303215563 306511521 311936706 319861203 330278963
1168.7 330278963 342783451 356726706 371439546 386452615 401596040 416759431 431534588
1183 431534588 445269495 457312316 467279345 475172222 481212407 485673398 488853931 491085172
1199.3 491085172 492775440 494432449 496617705 499760628 503909290 508807778 514092684 519408107
1215.6 519408107 524433136 528775394 531956613 533579171 533569932 532290161 530352056 528313816 526425481
1234 526425481 524606526 522726893 520901024 519575775 519305766 520302057 522212744 524445653 526591003
1252.3 526591003 528504491 530207872 531768322 533168554 534336746 535425723 536832511 538834572
1268.6 538834572 541319489 543773651 545539975 546207488 545858622 544961035 544024169 543311954 542707384
1287 542707384 541864753 540527761 538695633 536570609 534341156 532040179 529592872 526940823 524127424
1305.4 524127424 521360517 519003093 517214954 515774786 514327466 512630463 510694087 508465111
1321.7 508465111 505482137 501213849 495595872 489162683 482753038 477177590 472927153 470137477
1338 470137477 468796760 468563944 468852460 469389558 470043689 470567495 470751256 470510423 469863683 468855172
1358.4 468855172 467679322 466756672 466315955 466018617 465773970 465855330 466463357 467786461 469435871
1376.7 469435871 470923096 472339600 474055260 476639867 480749279 485597521 489305794 491456866
1393.1 491456866 492316395 492159724 491411030 490355790 488873988 486988962 484983146 482802570 480506182
1411.4 480506182 478424996 476633489 475089967 474251837 474263668 474763304 475686878 476881772 478397161
1429.8 478397161 480169803 481812268 483815700 486559480 488965988 490917027 492485553 493405074
1446.1 493405074 493581891 493001550 491634637 489559382 486813515 484859079 484891385 485933274 488466680
1464.5 488466680 492902577 498160899 504767716 514952421 526857674 537361503 546615660 555222034
1480.8 555222034 563398719 570549846 576990962 583831429 591027260 596702814 601204574 606168032
1497.1 606168032 611381352 615653872 618521214 620683789 624377608 628899693 632327855 634944201
1513.4 634944201 637070835 639269114 641471326 644035161 646989942 649628043 652172089 654225886
1529.7 654225886 655687988 657320857 658846319 659393430 659802675 661333978 663186133 664701700 665515482
1548.1 665515482 665824115 665905178 665561140 664465010 662870049 662672758 663012564 662366927 661018491
1566.4 661018491 659201920 657357454 655838490 653812110 651323438 649546087 647927582 645838439
1582.8 645838439 643543780 641187251 638750851 636230290 633687437 631158412 628691256 626208425
1599.1 626208425 623558700 620802999 617987037 615076363 612086892 609102607 605952680 602207839
1615.4 602207839 598312736 595483065 592782199 589605033 586733699 584133983 581688344 579526722
1631.7 579526722 577315688 575411856 574980617 575187206 575298071 575275600 575684726 577284336 578752637
1650.1 578752637 580290318 584301770 588372648 591341555 594284058 597992480 602280915 605886102
1666.4 605886102 609582365 614572704 619541645 624724507 630639672 635806322 640004754 644492805
1682.7 644492805 651432753 658187628 663308978 668196261 672184587 675649345 679244459 682844222
1699 682844222 687209427 690769136 693328559 696021438 698444426 700261533 701572120 702730298 704844534
1717.4 704844534 707859457 710303664 712233186 714102924 715729356 717041314 718038559 719437301
1733.7 719437301 721686661 723513782 725143909 727117002 729188979 731181324 733218968 736025929
1750 736025929 739783049 743205488 746120930 748924196 751408637 753945053 756436348 758372486 759927928
1768.4 759927928 761293054 762938857 765009880 766761720 768134773 769515097 770930707 772189140
1784.7 772189140 773241341 773920357 774370909 775442302 777027547 778252006 779010952 779785275 780910075
1803 780910075 782108724 783106208 783892632 784671128 785484195 786204636 786968350 787904084 788681328 789060056
1823.4 789060056 789289594 789519966 789973497 791012466 792106450 792734861 793039143 793132544 792966962
1841.8 792966962 792956471 793667912 794569492 795110226 795317233 795397937 795591056 795967162 796427548 796726882
1862.2 796726882 796631753 796151638 795904875 796568871 797585428 798258841 798545003 798660457 798832595 799211979
1882.6 799211979 799767852 800241351 800461054 800612807 800787330 801031947 801540315 802118182 802442074 802466810
1903 802466810 802341998 802244842 802364171 802783132 803212643 803230584 802905560 802770913 802950203 803383827
1923.4 803383827 803972661 804325223 804322958 804197907 804217458 804474235 804814756 804925144 804744005 804654896
1943.8 804654896 804868996 805267394 805769742 806225300 806442857 806441367 806415439 806570172 806947589 807334125
1964.2 807334125 807523012 807583392 807626486 807695627 807916045 808309197 808670223 808781803 808665991 808518648
1984.6 808518648 808535218 808743954 808966517 809093356 809116364 809037864 808980405 809057057 809210718 809270859 809075832
2007 809075832 808657765 808223426 807941854 807776690 807580113 807203591 806549668 805708587 805031180 804872870
2027.4 804872870 805006683 804888368 804385722 803701043 803072512 802704155 802627146 802578747 802297711 801827192
2047.8 801827192 801400900 801195443 801263571 801480114 801572502 801417470 801160753 801081061 801327229 801737666
2068.2 801737666 802013338 802002251 801811874 801691651 801804483 802121818 802430451 802505553 802356780 802207470
2088.6 802207470 802293658 802669585 803129733 803368449 803322792 803228199 803327024 803679645 804127038 804421604
2109 804421604 804466665 804351568 804259002 804388404 804720342 804999173 805022120 804814696 804601729 804600954 804830372
2131.4 804830372 805108070 805206239 805045485 804802060 804729640 804927409 805274367 805508852 805464566 805256426
2151.8 805256426 805168211 805384099 805849314 806293190 806514919 806602180 806767702 807147503 807778955 808524489
2172.2 808524489 809108496 809431911 809682727 810134947 810850501 811630487 812222958 812535167 812728941 813046813
2192.6 813046813 813580990 814225495 814776719 815093398 815262258 815515876 816005886 816659033 817228675 817572474
2213 817572474 817758322 817968547 818367302 818936229 819481611 819843054 819997489 820071042 820286393 820719540
2233.4 820719540 821198463 821507812 821599901 821618140 821755469 822069347 822429538 822665691 822733283 822723866
2253.8 822723866 822795212 823058069 823443651 823759198 823856413 823809445 823871374 824167967 824593663 824966669
2274.2 824966669 825148642 825129747 825113952 825295150 825622618 825924337 826022923 825883150 825693190 825668037
2294.6 825668037 825868428 826093554 826054335 825727046 825308979 824991226 824902713 824968040 824946165 824709356
2315 824709356 824256599 823746800 823427141 823357821 823330581 823013783 822387040 821847320 821644664 821617067
2335.4 821617067 821578145 821380913 820949137 820607543 820838094 821353614 821366429 820605457 819416940 818345010
2355.8 818345010 817618728 817307770 817370474 817528546 817573726 817599595 817862809 818436861 819126546 819699168
2376.2 819699168 820023179 820093036 820065558 820162833 820408463 820602179 820509315 820069432 819490016 819065571
2396.6 819065571 818904698 818867505 818685472 818183422 817479432 816861153 816495895 816300154 816018522 815454781
2417 815454781 814665020 813880146 813295543 812920094 812539697 811919510 811020970 810042322 809273064 808809340
2437.4 808809340 808433414 807874024 807049155 806060314 805153906 804526269 804123521 803689539 802998900 802062869
2457.8 802062869 801117957 800421178 800011575 799678087 799165130 798389673 797497511 796757340 796299696 795963585
2478.1 795963585 795493901 794790804 793945312 793199599 792774856 792608500 792416215 791976810 791305304 790625036
2498.5 790625036 790186346 790028274 789934695 789661825 789133549 788489759 787964940 787683785 787549496 787312865
2518.9 787312865 786785007 785998523 785204828 784647763 784294784 783884585 783200860 782280445 781351805 780598581
2539.3 780598581 780053973 779576957 778953433 778098464 777112424 776207566 775532722 775031149 774502575 773776770
2559.7 773776770 772835076 771851897 771072686 770560801 770132899 769545972 768700302 767719746 766856790 766260147
2580.1 766260147 765835345 765354574 764661610 763793707 762981057 762444735 762169838 761938632 761513412 760821342
2600.5 760821342 760029733 759373546 758902788 758472085 757863224 756948590 755865872 754853547 753983915
2618.9 753983915 753194869 752325058 751177549 749790192 748401761 747162580 746069431 745007813 743808091
2637.2 743808091 742376804 740827322 739403844 738234878 737208068 736095190 734766126 733261406
2653.5 733261406 731793761 730595887 729643404 728684485 727532089 726172149 724771857 723592222 722708166
2671.9 722708166 721921206 720972359 719775200 718472123 717328846 716486096 715790153 714952171 713821054
2690.3 713821054 712495387 711224854 710179746 709296465 708365262 707201004 705792606 704309881 702941060
2708.6 702941060 701785564 700766563 699675381 698396444 697012424 695723772 694680095 693840981
2724.9 693840981 693038404 692092717 690954268 689822972 688956439 688359737 687785983 687005997 686000109
2743.3 686000109 684957087 684080541 683431864 682899237 682254612 681407332 680512190 679753840 679210722
2761.6 679210722 678803563 678312480 677598357 676702023 675782382 674990892 674319148 673597336 672649741 671460330
2782 671460330 670161545 668911874 667769432 666649163 665366948 663797677 662048101 660328746 658724904
2800.4 658724904 657140255 655390382 653377652 651194155 649010181 646896482 644813836 642659724
2816.7 642659724 640305042 637722552 635019541 632326424 629703641 627050221 624185979 621067882
2833 621067882 617793083 614476085 611148179 607694507 603936315 599789262 595359683 590915680 586762786
2851.4 586762786 583091915 579835653 576748073 573583305 570120931 566246152 561902344 556972682
2867.7 556972682 551429927 545423210 539208353 533073664 527248204 521900833 517165244 513135552
2884 513135552 509905696 507526994 505924761 504903078 504213989 503596425 502850890 501972556 501020730
2902.4 501020730 499885887 498360902 496356905 493855715 490793347 487178713 483149141 478896290
2918.7 478896290 474612683 470553488 467025548 464309484 462655246 462185383 462928474 464934796 468185186
2937 468185186 472541690 477813095 483725935 489969075 496365577 502869666 509458303 516116619 522825897
2955.4 522825897 529500425 536002100 542190433 547968626 553353190 558399081 563136816 567643464
2971.7 567643464 571960866 576074958 580073059 584029019 587807000 591220438 594224870 596886992
2988 596886992 599320650 601575434 603570938 605236650 606523097 607370675 607850671 608090937 608100832
3006.4 608100832 607842207 607289135 606371880 605081856 603558779 601939082 600198567 598231018 596018434
3024.7 596018434 593631685 591200531 588830054 586496353 584032416 581300259 578445077 575673759
3041.1 575673759 572954714 570157111 567240357 564257979 561213076 558087766 554990232 551973522
3057.4 551973522 548951268 545882106 542789578 539745927 536732376 533608854 530440092 527400434
3073.7 527400434 524474859 521529496 518448591 515280008 512161493 509091794 506005764 502859533
3090 502859533 499596059 496320695 493249595 490358591 487427801 484347641 481250852 478325099 475508481
3108.4 475508481 472604334 469662189 466829449 464022964 461132824 458138883 455084294 452110559
3124.7 452110559 449256212 446420908 443541318 440659583 437886983 435279667 432722390 429999530
3141 429999530 427140445 424375743 421760231 419292212 416970044 414548725 411869794 409178972 406654835
3159.4 406654835 404250473 401932538 399641782 397322685 394984633 392650992 390357792 388149709
3175.7 388149709 386006325 383882642 381741703 379615277 377631664 375770032 373875618 371919274
3192 371919274 369924963 367939621 366092801 364372402 362658173 360882163 359045595 357256979 355585128
3210.3 355585128 354026049 352563351 351092011 349529982 347981006 346535236 345110506 343685806
3226.7 343685806 342352718 341166586 340021342 338661104 337154329 335837334 334704787 333570033
3243 333570033 332442880 331309229 330072910 328850001 327780277 326791227 325751364 324671268 323690444
3261.3 323690444 322817326 321961015 321162134 320449769 319657147 318727165 317782432 316849351 315963775 315170765
3281.7 315170765 314410448 313646257 312903583 312261015 311721236 311110198 310317099 309400827 308522195 307859004
3302.1 307859004 307415038 306938171 306185603 305218101 304213732 303261667 302416235 301666766 300923765
3320.5 300923765 300170869 299452394 298662245 297740668 296885759 296191543 295560420 294963777 294317991 293504775
3340.9 293504775 292608559 291731149 290977359 290425450 289798260 288860917 287865847 287096709 286492616 285844594
3361.3 285844594 285148591 284632087 284238845 283613145 282663435 281684488 280957192 280415297 279882520 279287726
3381.7 279287726 278699994 278255433 278018236 277964056 277825326 277338564 276788592 276637316 276714146 276442707
3402.1 276442707 275798410 275306046 275151700 275134504 275079012 274876803 274588823 274406403 274343580 274297476
3422.5 274297476 274336576 274580091 274929553 275172204 275434047 275860816 276157945 276153386 276101530 276228666
3442.9 276228666 276571125 277035236 277460366 277889729 278398663 278928041 279530436 280282915 280991286 281650543
3463.2 281650543 282568693 283639699 284403473 284755141 285103291 285747319 286676943 287653029 288409919
3481.6 288409919 289122522 290032297 290972203 291830093 292731851 293710351 294776052 295870304 296910077
3500 296910077 297909439 298792124 299555123 300451159 301641166 303038061 304338127 305342466 306290656
3518.3 306290656 307451963 308841079 310158670 311221004 312303483 313598663 315049887 316632450
3534.6 316632450 318161339 319495827 320933163 322606117 324327767 325931728 327467918 329112530
3551 329112530 330945700 332901120 334944516 337125272 339309692 341242522 343183577 345980287 349400729
3569.3 349400729 352472067 355232388 358115345 361192614 364424974 367784321 371030807 374139905
3585.6 374139905 377592236 381447107 385121465 388716012 392570585 396648228 400815934 404979855
3601.9 404979855 408899456 412524641 416362882 420541674 424777269 429083169 433216035 437434971
3618.3 437434971 442323625 446960360 450659156 453863293 457898706 463206083 468070984 472444415
3634.6 472444415 476711243 480838299 484960496 488933980 492326289 495346457 499397844 504761577
3650.9 504761577 509441316 513333917 517668545 522200644 526116073 529572427 532761335 535538912
3667.2 535538912 538359344 541730940 544703603 547686875 551631033 555485845 558884203 561842740
3683.5 561842740 564271867 566523671 569118440 572111785 575016558 577537417 579650223 581483662
3699.8 581483662 583469093 585770667 587800086 589198470 590377867 592329264 594987392 597264886
3716.2 597264886 598939180 600293159 601601064 602979541 604544699 606204510 607436121 608202815
3732.5 608202815 609240353 611207664 613370359 614652872 614988446 615617931 617121518 618133247 619085968
3750.8 619085968 621084630 623111188 624471784 625647247 627069890 628313780 629251719 630221903 631337583
3769.2 631337583 632762671 634241998 635316491 636049092 636848330 637864530 638803661 639811397 640983582
3787.5 640983582 642022252 642831743 643389523 643892050 644472420 644764721 645292997 646481812 647462010
3805.9 647462010 648571491 649975300 650869310 651004553 651040673 651445627 651876330 653054357 654595077
3824.3 654595077 655547440 656220138 656725585 657141864 657635987 657920241 658174455 658973813 660111248
3842.6 660111248 661316097 662304580 662645221 662051857 661201835 662199855 664076209 665215552 665697277
3861 665697277 665891290 666291237 666732371 666938066 667472184 668362379 669358075 670038223 670070648 670265913
3881.4 670265913 670819759 671423614 672200263 672649503 672924042 673563838 674034119 673958600 673791766 673961580
3901.8 673961580 674500406 675454795 676418543 676996887 677322030 677444637 677361250 677458584 677850187 678150177
3922.1 678150177 678372860 678784013 679102421 679131866 679381609 679979980 680445910 680665314 680722654 680782080
3942.5 680782080 681030869 681257308 681450844 681842923 682295322 682691693 683002293 683164716 683271766 683461070
3962.9 683461070 683721185 683956802 684139609 684284806 684429049 684650958 684951067 685196638 685406744 685645461
3983.3 685645461 685821474 685961485 686158538 686361492 686502337 686631560 686815798
3997.6 686815798
##END=$$ End of the data block
