##TITLE=$$ Begin of the data block
##JCAMP-DX=5.00 $$ ACD/SpecManager v 10.08
##SPECTROMETER/DATA SYSTEM=Alpha
##DATE=23 Dec 2014 14:28:26
##DATA TYPE=INFRARED SPECTRUM
##DATA CLASS=XYDATA
##ORIGIN=
##OWNER=
##NPOINTS=1765
##FIRSTX=399.76428223
##LASTX=3997.64306641
##MAXX=3997.64306641
##MINX=399.76428223
##MAXY=0.82733262
##MINY=0.19507021
##XFACTOR=1.0000000000
##YFACTOR=1.000000000000000e-9
##FIRSTY=0.51431191
##DELTAX=2.03961372
##XUNITS=1/CM
##YUNITS=ARBITRARY UNITS
##XYDATA=(X++(Y..Y))
399.8E14311910n000353l515601j928509l02374Q64863J331807J420557J130045O47366
418.1E08959711J54137j054764k672076l358960k959192k757519k966494l140896k676070
436.5D87527877o74277K457320N250603O067783M984021L547967K465009J865089J170933
454.8E14662325l4213j283765k018511k396047k463043k578914l204107m204273m520893
473.2D91958559l417463k089470j184255q97646r77039o55890n5849K65717n096q42929
493.6D82098639j826018k472401k562523k319723k196103k611101l409535m090875
509.9D60610360m401088m234195m095912m538774m979491m572153l221453j332670
526.2D29234624J47015N39362N84811J332164L241330N684376P143140O619930M351169
$$ y = [514311910, 509311557, 505795956, 503867447, 503565073, 504429936, 505761743, 507182300, 508312345, 508959711, 509113848, 508059084, 505387008, 502028048, 499068856, 496311337, 493344843, 490203947, 487527877, 486853600, 489310920, 494561523, 500629306, 505613327, 509161294, 511626303, 513491392, 514662325, 514628112, 513344347, 511325836, 508929789, 506466746, 503887832, 500683725, 496479452, 491958559, 488541096, 486451626, 485267371, 484369725, 483392686, 482736796, 482680947, 482946664, 482941568, 482098639, 480272621, 477800220, 475237697, 472917974, 470721871, 468110770, 464701235, 460610360, 456209272, 451975077, 447879165, 443340391, 438360900, 433788747, 430567294, 429234624, 429381639, 429921001, 430505812, 431837976, 435079306, 440763682, 447906822, 454526752, 458877921]
544.6D58877921J649767k00808q98808j044571j664937l096461m580468n461604n951911
562.9D37628120o490290p280946p751018o960243m739403j639933J676351M634380
579.3D09077018O738157P697433P618576O919324N952418M773468L011584R39399n87880
597.6D52139497r38684j83195O09040O92636K51889L9846O21855J769573K999216L944367
618D61946040M098386L635436L483415L916562M334688M089355L165722J992583J236946
636.4D91899133J307338J853407K158731J826703J074732M86731O17445J385093K079904
654.7E04689217K047598J323044N71192L45349M93050J232385K775908K356529J197576
673.1E17031848J021147J598716K301216K484977J977623J069009K99990M6313J15872
$$ y = [458877921, 460527688, 460326880, 459428072, 458383501, 456718564, 453622103, 449041635, 443580031, 437628120, 431137830, 423856884, 416105866, 409145623, 404406220, 402766287, 404442638, 409077018, 415815175, 423512608, 431131184, 438050508, 444002926, 448776394, 451787978, 452727377, 452139497, 451200813, 451017618, 451626658, 452319294, 452571183, 452611029, 453232884, 455002457, 458001673, 461946040, 466044426, 469679862, 473163277, 477079839, 481414527, 485503882, 488669604, 490662187, 491899133, 493206471, 495059878, 497218609, 499045312, 500120044, 500606775, 501224220, 502609313, 504689217, 506736815, 508059859, 508631051, 508976400, 509469450, 510701835, 513477743, 515834272, 517031848, 518052995, 519651711, 521952927, 524437904, 526415527, 527484536, 527784526, 527830839, 527946711]
691.4E27946711r9540j004636k480627l823220m232467l567755k318322j042247L1888
709.8E09409785J121700K459347M010678N566716O829262P302045O895662O284356
726.1E49879551O003499N988359N771041M972220L629923K215445J210630N01096k52962
744.5E79918802j441539l166198m907966o050408o268203n774021n190611m656017
760.8E42463839l818870k365112l4332L007114O044924Q320928R567618R986878R840190
779.1E83013177R421170Q840382P916987O514489M909397L829300L822446M591048
795.4F32858396N336880N397439M634679L511846K662480K378940K269209J730144
811.8F60780013P84635o7174n05626m79281m40956j059711k462327m191279n594016
$$ y = [527946711, 527847171, 526842535, 524361908, 520538688, 516306221, 512738466, 510420144, 509377897, 509409785, 510531485, 512990832, 517001510, 522568226, 529397488, 536699533, 543595195, 549879551, 555883050, 561871409, 567642450, 572614670, 576244593, 578460038, 579670668, 580171764, 579918802, 578477263, 575311065, 570403099, 564352691, 558084488, 552310467, 547119856, 542463839, 538644969, 536279857, 536245525, 539252639, 545297563, 553618491, 563186109, 573172987, 583013177, 592434347, 601274729, 609191716, 615706205, 620615602, 624444902, 628267348, 632858396, 638195276, 643592715, 648227394, 651739240, 654401720, 656780660, 659049869, 660780013, 661564648, 661497474, 660991848, 660512567, 660071611, 659011900, 656549573, 652358294, 646764278]
830.1F46764278o213247o142140n956113o013274o220162o205559n715430m917800
846.4E99380553m334271m445136n178511o158352o782472n928993k662420K587020
862.8E66477418P799506J1275947J3190806J4075101J3553381J1216640P483780L323853
879.1F48396432m77850l434181n354166o472409p124662p483304p491827p007003o285250
897.4E97265780n799115n857229o591201p766127q936644r871721j0654867j1402309
913.7E30386567j1896253j1592268j0025383p326036m316002j904250m25308N16980
930.1D83418047J513303K745419L999889N021006N757571N915343M604221J286149
946.4E14260948l303767p829368j1505037j4187366j5969485j7079026j7829388j8458575
$$ y = [646764278, 640551031, 634408891, 628452778, 622439504, 616219342, 610013783, 604298353, 599380553, 595046282, 590601146, 585422635, 579264283, 572481811, 566552818, 563890398, 566477418, 574276924, 585552871, 598743677, 612818778, 626372159, 637588799, 645072579, 648396432, 647918582, 644484401, 639130235, 632657826, 625533164, 618049860, 610558033, 603551030, 597265780, 591466665, 585609436, 579018235, 571252108, 562315464, 552443743, 541788876, 530386567, 518490314, 506898046, 496872663, 489546627, 485230625, 483326375, 482901067, 483418047, 484931350, 487676769, 491676658, 496697664, 502455235, 508370578, 512974799, 514260948, 510957181, 503127813, 491622776, 477435410, 461465925, 444386899, 426557511, 408098936]
962.7D08098936j9083589j9733429k0279050k0553023k0501047k0062536j9102216
977B68784046j7520279j5344396j2767419j0040909p395402n069062l193214j747743
993.3A95705622o35415J98722P77498J060188J005515O41167Q5742l88921n47543l24190
1013.7A97578385J85147Q58576J587927K306521K975240L522083L830180L880098L739506
1032B20463663L329113K612636J708209Q89376M40717M26665P61181J420155K511144
1050.4B34562859M064932N727098P056162Q114218R198129J0262132J0431141Q141398
1066.7B97558069K464801n000859j0355622j0952413p871538l945440p78407J500904
1083B62619495L157497M409849N501807O433964O860912O516725N410790L789336K123355
$$ y = [408098936, 389015347, 369281918, 349002868, 328449845, 307948798, 287886262, 268784046, 251263767, 235919371, 223151952, 213111043, 205715641, 200646579, 197453365, 195705622, 195070207, 195268929, 196046427, 197106615, 198112130, 198753297, 198839039, 198450118, 197902575, 197578385, 197763532, 198622108, 200210035, 202516556, 205491796, 209013879, 212844059, 216724157, 220463663, 223792776, 226405412, 228113621, 229002997, 229443714, 229870379, 230631560, 232051715, 234562859, 238627791, 244354889, 251411051, 259525269, 268723398, 278985530, 289416671, 297558069, 300022870, 295022011, 284666389, 273713976, 265842438, 261896998, 261118591, 262619495, 265776992, 270186841, 275688648, 282122612, 288983524, 295500249, 300911039, 304700375, 306823730]
1101.4C06823730J055003J006901J903653L160119M135460M565447M419625L791809
1117.7C30861747K876550J985163J564085J999259L194630M471571M895836L833502
1134C55682343J345784j875848m903167p086397q244395q493572p960797o778061n138844
1152.4C06547046l293544j509607Q5234J607329L327876N446166P914603J0379523
1168.7C30504626J2451559J3899237J4702499J5056342J5210509J5191287J4741749
1183D31757808J3661056J1984498R957164P914156O050825M439473L160149K214998
1199.3D91140127J669854J690686K271354L187209M133702M863560N243003N276800
1215.6E19476295M995584M328072L172159J605213j8597j285016j942635k018571j843750
$$ y = [306823730, 307878733, 308885634, 310789287, 313949406, 318084866, 322650313, 327069938, 330861747, 333738297, 335723460, 337287545, 339286804, 342481434, 346953005, 351848841, 355682343, 357028127, 355152279, 350249112, 343162715, 334918320, 326424748, 318463951, 311685890, 306547046, 303253502, 301743895, 301829129, 303436458, 306764334, 312210500, 320125103, 330504626, 342956185, 356855422, 371557921, 386614263, 401824772, 417016059, 431757808, 445418864, 457403362, 467360526, 475274682, 481325507, 485764980, 488925129, 491140127, 492809981, 494500667, 496772021, 499959230, 504092932, 508956492, 514199495, 519476295, 524471879, 528799951, 531972110, 533577323, 533558726, 532273710, 530331075, 528312504, 526468754]
1234E26468754j763880j838446j814485j305282k18391J026153J885951K185166K102673
1252.3E26728213J900732J737655J598358J418411J210213J125097J376629J951516
1268.6E39046824K483606K483249J762569O49869l53753r09031r41217p15434o09577
1287E42897105q19802j289964j786232k090692k197326k285003k470136k682805k796888
1305.4E24478257k710343k334892j813889j475811j488864j722098j924932k218604
1321.7E08788824k999544m279077n609483o428778o379098n505561m188747k756714
1338D70641822j335025k55287K51383N14716O65694N40972J78665k62708o74754j018733
1358.4D69246745j172662r42737m62055k86996k36541O6101N81265J282185J631230
$$ y = [526468754, 524704874, 522866428, 521051943, 519746661, 519528270, 520554423, 522440374, 524625540, 526728213, 528628945, 530366600, 531964958, 533383369, 534593582, 535718679, 537095308, 539046824, 541530430, 544013679, 545776248, 546426117, 546072364, 545163333, 544222116, 543506682, 542897105, 542077303, 540787339, 539001107, 536910415, 534713089, 532428086, 529957950, 527275145, 524478257, 521767914, 519433022, 517619133, 516143322, 514654458, 512932360, 511007428, 508788824, 505789280, 501510203, 495900720, 489471942, 483092844, 477587283, 473398536, 470641822, 469306797, 469051510, 469302893, 469817609, 470483303, 471024275, 471202940, 470940232, 470265478, 469246745, 468074083, 467131346, 466669291, 466382295, 466145754, 466211855, 466793120, 468075305, 469706535]
1376.7D69706535J522780J448512J699924K553344M084945M818380L667354K101749
1393.1D91603523Q50976j28359p82907j111596j482189j883477k010644k122432k212524
1411.4D80720371k045095j788557j535147q20637R835M76033R02444J201152J537443
1429.8D78657842J782179J631558J980811K751618K449096J981199J579672R37640
1446.1D93751615J88262n85646j353264k031564k697349j938731J5647R95129K476841
1464.5D88820940M415095N281955O671667J0254622J1928200J0481477R198308Q558929
1480.8E55611193Q180499P192552O467700O814301P152081N684018M568458N013108
1497.1F06683910N173623M221023K872586K226889L720880M464924L406107K631367
$$ y = [469706535, 471229315, 472677827, 474377751, 476931095, 481016040, 485834420, 489501774, 491603523, 492454499, 492326140, 491543233, 490431637, 488949448, 487065971, 485055327, 482932895, 480720371, 478675276, 476886719, 475351572, 474530935, 474540770, 475016803, 475919247, 477120399, 478657842, 480440021, 482071579, 484052390, 486804008, 489253104, 491234303, 492813975, 493751615, 493939877, 493354231, 492000967, 489969403, 487272054, 485333323, 485348970, 486344099, 488820940, 493236035, 498517990, 505189657, 515444279, 527372479, 537853956, 547052264, 555611193, 563791692, 570984244, 577451944, 584266245, 591418326, 597102344, 601670802, 606683910, 611857533, 616078556, 618951142, 621178031, 624898911, 629363835, 632769942, 635401309]
1513.4F35401309K168715K253234K234518K571047K929091K600670K522230K053201
1529.7F54734015J486361J664460J554907N95450M44293J511812J799524J474679Q40067
1548.1F66105568L43383O3360l51787j054525j572967k62380L20196o15239j335323
1566.4F61640286j823186j846910j520097k027393k521276j816094j601219k044916
1582.8F46439195k281487k363921k409636k481103k549530k555966k475381k484917
1599.1F26837254k651513k752662k791226k875685l001869l013015l124058l684878
1615.4F02942348l850282k812743k692163l178298k890945k607524k418041k099872
1631.7E80392480k110183j812041m45545J74105J28031L934M21584J637697J561403
$$ y = [635401309, 637570024, 639823258, 642057776, 644628823, 647557914, 650158584, 652680814, 654734015, 656220376, 657884836, 659439743, 660035193, 660479486, 661991298, 663790822, 665265501, 666105568, 666448951, 666512311, 666160524, 665105999, 663533032, 663270652, 663590848, 662975609, 661640286, 659817100, 657970190, 656450093, 654422700, 651901424, 650085330, 648484111, 646439195, 644157708, 641793787, 639384151, 636903048, 634353518, 631797552, 629322171, 626837254, 624185741, 621433079, 618641853, 615766168, 612764299, 609751284, 606627226, 602942348, 599092066, 596279323, 593587160, 590408862, 587517917, 584910393, 582492352, 580392480, 578282297, 576470256, 576024711, 576198816, 576326847, 576330781, 576752365, 578390062, 579951465]
1650.1E79951465J692355M043221L948391K920925K979279L746152M263103L586829
1666.4F07131720L737986N024373M946649N168975N923271N149662M187942M511714
1682.7F45782292O907284O684303N097092M873812L979325L479302L616512L572464
1699F83992386M266262L496587K565742K680719K374172J797557J325428J176596K107739
1717.4G05783188K963364K403081J926362J876772J627624J305938R86516J387298
1733.7G20260143K229750J831294J659810J975417K046168K000332K088427K813936
1750G36905277L674090L339648K898872K830028K511323K542138K475500J947701J601338
1768.4G60725915J411617J652181K020836J717210J366854J367390J403153J258969
$$ y = [579951465, 581643820, 585687041, 589635432, 592556357, 595535636, 599281788, 603544891, 607131720, 610869706, 615894079, 620840728, 626009703, 631932974, 637082636, 641270578, 645782292, 652689576, 659373879, 664470971, 669344783, 673324108, 676803410, 680419922, 683992386, 688258648, 691755235, 694320977, 697001696, 699375868, 701173425, 702498853, 703675449, 705783188, 708746552, 711149633, 713075995, 714952767, 716580391, 717886329, 718872845, 720260143, 722489893, 724321187, 725980997, 727956414, 730002582, 732002914, 734091341, 736905277, 740579367, 743919015, 746817887, 749647915, 752159238, 754701376, 757176876, 759124577, 760725915, 762137532, 763789713, 765810549, 767527759, 768894613, 770262003, 771665156, 772924125]
1784.7G72924125J057565O98209M77672J067698J566768J222014P52985P51436J105666
1803G81624138J205147J015663P80701P56443Q11219P39455P65741R05454P74682M21286
1823.4G89799929K63869K38181M48465J026928J092553O47784L20732R2090j62304
1841.8G93768227l755O92964Q82208N22375J60217L4154J93059M19796N05745L13580
1862.2G97488570j07288m78268k23756O52075R71317O38962K72930J04427J68920M15385
1882.6G99903274O01589M79937K13444J65105J73569K12967M85241N97239L62575L0756
1903H03225696j58310j16050J43945M29332L91782L218k94387j16646J91629M39346
1923.4H04139555N63621L24726m768j00851M5955K70069L50236J21296j85669j25885
$$ y = [772924125, 773981690, 774679899, 775157571, 776225269, 777792037, 779014051, 779767036, 780518472, 781624138, 782829285, 783844948, 784625649, 785382092, 786193311, 786932766, 787698507, 788603961, 789378643, 789799929, 790063798, 790301979, 790750444, 791777372, 792869925, 793517709, 793838441, 793930531, 793768227, 793764472, 794457436, 795339644, 795862019, 796022236, 796056390, 796249449, 796669245, 797174990, 797488570, 797381282, 796903014, 796679258, 797331333, 798302650, 798941612, 799214542, 799318969, 799487889, 799903274, 800504863, 800984800, 801198244, 801363349, 801536918, 801749885, 802235126, 802832365, 803194940, 803225696, 803067386, 802951336, 803095281, 803524613, 803916395, 803919613, 803625226, 803508580, 803700209, 804139555, 804703176, 805027902, 805023134, 804922283, 804968238, 805238307, 805588543, 805709839, 805524170, 805398285]
1943.8H05398285J81854M04895N07116M45127K29061J9610j2636J69396L88682L85046
1964.2H08116436J90735O5684M5061J04785K67208L84450L21209R7454r6083j18732
1984.6H09378207J3888J80542K13742J33396J9311r1612o1512R6321J83702Q4638j86979
2007H09963644m28021m33982k43246j18018j99377m23670o82235q28504o48439j33097
2027.4H05825055J39773j27018n21481p00772o05166l36587r0420r3997l03864m45903
2047.8H02739620l94463j78457J04130K32160O3479j96457k63751o8366K54094M27842
2068.2H02719831K91288p152k06948j54078J14799L57628L30865O5208j64271j50203
2088.6H03196967J11341M03881M68433K46525n0128j20937Q2433L52800M57823L15487
$$ y = [805398285, 805580139, 805985034, 806492150, 806937277, 807166338, 807185948, 807173312, 807342708, 807731390, 808116436, 808307171, 808372855, 808417916, 808522701, 808789909, 809174359, 809495568, 809593022, 809496939, 809378207, 809392095, 809572637, 809786379, 809919775, 809939086, 809847474, 809785962, 809882283, 810065985, 810150623, 809963644, 809535623, 809101641, 808858395, 808740377, 808541000, 808117330, 807435095, 806606591, 805958152, 805825055, 805964828, 805837810, 805316329, 804615557, 804010391, 803673804, 803583384, 803489387, 803185523, 802739620, 802345157, 802166700, 802270830, 802502990, 802566469, 802370012, 802106261, 802037895, 802291989, 802719831, 803011119, 803003967, 802797019, 802642941, 802757740, 803115368, 803446233, 803511441, 803347170, 803196967, 803308308, 803712189, 804180622, 804427147, 804377019, 804256082, 804338515, 804691315, 805149138, 805464625]
2109H05464625M4406j32382q3208J39594L27945K88963L9637k14934k31862J1146K69949
2131.4H05923879K95341Q5592j64628k43067p4566J91450L31045K22563m3749j84656
2151.8H06339204m5657K51651M60446M15087K29120J09196J40607L49760O38008P63595
2172.2H09651017O00815L25024K47419M62294P17878P61330N65648K95103J95324L35455
2192.6H14157307N57602O60061N39363K91228J62304K73525N10216O53267N78880L72768
2213H18756521K11298K28524M04418N50330N17010L28958J36853R6500K43186M44592
2233.4H21918190M73678K80439O9917J0550J30594L25918L95298K53558M3332l4868
2253.8H23866606P2479K66075L79503L22521J24633l0220M1962K59101M22836M04179
$$ y = [805464625, 805509031, 805376649, 805293441, 805433035, 805760980, 806049943, 806089580, 805874646, 805642784, 805653930, 805923879, 806219220, 806304812, 806140184, 805897117, 805822551, 806014001, 806345046, 806567609, 806523860, 806339204, 806293547, 806545198, 807005644, 807420731, 807649851, 807759047, 807899654, 808249414, 808887422, 809651017, 810251832, 810576856, 810824275, 811286569, 812004447, 812765777, 813331425, 813626528, 813821852, 814157307, 814714909, 815374970, 815914333, 816205561, 816367865, 816641390, 817151606, 817804873, 818383753, 818756521, 818967819, 819196343, 819600761, 820151091, 820668101, 820997059, 821133912, 821230412, 821473598, 821918190, 822391868, 822672307, 822742224, 822752774, 822883368, 823209286, 823604584, 823858142, 823901474, 823866606, 823939085, 824205160, 824584663, 824907184, 825031817, 825001597, 825043559, 825302660, 825725496, 826129675]
2274.2H26129675K02000j4782k6703J70648L39926L09169R8228j25408j58727J9491
2294.6H26943517K02656J86443k8789k80500l77476k58803l3021J09494L0636k25663
2315H26268494m78446n15998l18825r5487n8114k89738n46575m91321j95265k7120
2335.4H23251605j01626k96175m68612l25918K50458N20170J9729p26759j130164j022041
2355.8H19970667o38008k08735K1100N5194L7431K4617J76966N00024O84023N38349
2376.2H21161628K18749j0789l4630J05202K37525J85728r3997m33802n81146m39763
2396.6H20314705j50203j3829j96099n09143o63936n68271l32415j87158k91288n84006
2417H16818357q32379q20458n76258l57985l92914o42300q93056r50218p58528m87566
$$ y = [826129675, 826331675, 826316893, 826290190, 826460838, 826800764, 827109933, 827208161, 827082753, 826924026, 826943517, 827146173, 827332616, 827303827, 827023327, 826645851, 826387048, 826354027, 826463521, 826494157, 826268494, 825790048, 825274050, 824955225, 824859738, 824801624, 824511886, 823965311, 823473990, 823278725, 823251605, 823149979, 822853804, 822385192, 822059274, 822309732, 822829902, 822849631, 822122872, 820992708, 819970667, 819332659, 819123924, 819145024, 819200218, 819237649, 819262266, 819439232, 819939256, 820623279, 821161628, 821380377, 821369588, 821334958, 821440160, 821677685, 821863413, 821769416, 821335614, 820754468, 820314705, 820164502, 820150673, 819954574, 819445431, 818781495, 818213224, 817880809, 817693651, 817402363, 816818357, 815985978, 815165520, 814589262, 814231277, 813838363, 813196063, 812303007, 811352789, 810594261, 810106695]
2437.4H10106695l94404n52595q24690j003682r02117n86688l82185m74632p32839
2455.7H04252863r35078r28759o80924l87728l14236n12182q00431r21309p40230m30107
2476.1G97601879l07799m60028p10786q28504p08938m31597j92583j95980m17948o32941
2496.5G92714775o71268m60684j56939q0765k86281n49316o60300n32985k63453j10745
2516.9G88942039k53916n90086q28564p72953n21302l51131m04775o40929r13978j007437
2537.3G82656968q05259n02467m19259n87166q52287j034557r57609o79493m64379
2555.6G76354492m91262p04884r13382r37819p50423n17249m40776o02246q66055r81689
2576G69148707q51988n97775m30763m88758p09415q71062p84874n00023k46406k25305
$$ y = [810106695, 809712291, 809159696, 808335006, 807331324, 806429207, 805842519, 805460334, 804985702, 804252863, 803317785, 802389026, 801708102, 801320374, 801006138, 800493956, 799693525, 798772216, 798031986, 797601879, 797294080, 796834052, 796123266, 795294762, 794585824, 794154227, 793961644, 793765664, 793347716, 792714775, 792043507, 791582823, 791425884, 791345119, 791058838, 790509522, 789849222, 789316237, 789052784, 788942039, 788688123, 788098037, 787269473, 786496520, 785975218, 785624087, 785219312, 784578383, 783664405, 782656968, 781851709, 781349242, 780929983, 780342817, 779490530, 778455973, 777498364, 776818871, 776354492, 775863230, 775158346, 774244964, 773307145, 772556722, 772039473, 771598697, 770996451, 770130396, 769148707, 768296719, 767698944, 767268181, 766779423, 766070008, 765198946, 764414072, 763914049, 763667643, 763442338]
2596.4G63442338m54903p19667p86602o36637m42863m05907o16312r32575j090824
2614.8G57356048j031876q60751p40647q62718j171410j393437j392543j244069j081466
2633.2G47577131j033366j180112j420379j540899j455426j231134j027465j057148
2649.5G37631202j329601j531839j441539j160860r33349r51230j174808j392424j407802
2667.8G26307750j190782r18984q05497r30608j154721j232504j082302q51333p43627
2686.2G17397392q54552j092434j263916j253844j077294r07362r42528j175046j423359
2704.5G07407057j507520j358688j089931r64165j097500j321673j419068j288652
2720.9F97359860j003683p97510q12411r85146j140535j082241q15332n98133o28292
$$ y = [763442338, 762987435, 762267768, 761481166, 760844529, 760401666, 759995759, 759379447, 758446872, 757356048, 756324172, 755463421, 754722774, 753860056, 752688646, 751295209, 749902666, 748658597, 747577131, 746543765, 745363653, 743943274, 742402375, 740946949, 739715815, 738688350, 737631202, 736301601, 734769762, 733328223, 732167363, 731234014, 730282784, 729107976, 727715552, 726307750, 725116968, 724197984, 723392487, 722461879, 721307158, 720074654, 718992352, 718141019, 717397392, 716542840, 715450406, 714186490, 712932646, 711855352, 710947990, 710005462, 708830416, 707407057, 705899537, 704540849, 703450918, 702486753, 701389253, 700067580, 698648512, 697359860, 696356177, 695558667, 694746256, 693761110, 692620575, 691538334, 690723002, 690124869, 689496577]
2739.2F89496577q38161j033067j046181q59678o26266n16355o02603p90894q90911
2757.6F82292461q08179n61774l72171m60863p05660q92937r11593p80940o76394p29441
2778F75392509r41337j204550j337111j254976j112222j109660j278937j553357j745343
2796.3F63855016j701891j562596j557231j755833k018690k184510k212525k149582
2812.6F48712158k089441k128660k345801k618968k724767k639055k549708k661407
2828.9F28954351k923548l151477l282725l328681l357351l470660l722488m115880
2845.3F01601541m453242m466712m159034l704726l297389l089785l155589l490925
2861.6E71784139l924907m364550m939556n581736o041348o247521o203055n896867
$$ y = [689496577, 688658416, 687625349, 686579168, 685719490, 685093224, 684576869, 683974266, 683183372, 682292461, 681484282, 680922508, 680550337, 680089474, 679383814, 678490877, 677579284, 676798344, 676121950, 675392509, 674451172, 673246622, 671909511, 670654535, 669542313, 668432653, 667153716, 665600359, 663855016, 662153125, 660590529, 659033298, 657277465, 655258775, 653074265, 650861740, 648712158, 646622717, 644494057, 642148256, 639529288, 636804521, 634165466, 631615758, 628954351, 626030803, 622879326, 619596601, 616267920, 612910569, 609439909, 605717421, 601601541, 597148299, 592681587, 588522553, 584817827, 581520438, 578430653, 575275064, 571784139, 567859232, 563494682, 558555126, 552973390, 546932042, 540684521, 534481466, 528584599]
2877.9E28584599n385637m736721m018307l250420k423883j636624j028538o98626
2894.2E05405843o43491p23124q10921r35674j181066j534045j990705k560378l134071
2912.6D91892368l619761m001051m247308m303813m072815l525734k728820j692772
2928.9D63700294m75287P85321K051115L279328M354537N241811N901426O265104O397873
2947.2D97501522O479770O609679O711184O730199O700993O560564O230295N800068
2963.6E49324274N409002N090356M815161M587532M384696M173756M043281M001021
2979.9E85829079L832877L459811L036976K686381K470434K331614K076626J704276
2996.2F07428074J316547Q95083N15104K73227O8307k03788n37515r19103j289130
$$ y = [528584599, 523198962, 518462241, 514443934, 511193514, 508769631, 507133007, 506104469, 505405843, 504762352, 504039228, 503228307, 502292633, 501111567, 499577522, 497586817, 495026439, 491892368, 488272607, 484271556, 480024248, 475720435, 471647620, 468121886, 465393066, 463700294, 463225007, 464010328, 466061443, 469340771, 473695308, 478937119, 484838545, 491103649, 497501522, 503981292, 510590971, 517302155, 524032354, 530733347, 537293911, 543524206, 549324274, 554733276, 559823632, 564638793, 569226325, 573611021, 577784777, 581828058, 585829079, 589661956, 593121767, 596158743, 598845124, 601315558, 603647172, 605723798, 607428074, 608744621, 609639704, 610154808, 610428035, 610496342, 610292554, 609755039, 608835936, 607546806]
3014.5F07546806j527369j618147j717507j929880k202510k415777k452612k365410
3030.9E91317594k323806k461672k706051k786517k736390k777397k868414k946139
3047.2E69711208k995491l029227l096819l090262l012181k999365l035486l072500
3063.5E45379877l071189l088593l166378l148258l030300k956331k965867l062904
3079.8E20890057l141701l106237l083944l127694l181279l241122l193378l024369
3096.1D95790333k906383k945691l100812l165275l032595k885372k898931k910405
3112.4D71944869k815694k818883k926021l022820l070712l011882k904892k840549
3128.8D48533416k851993k880007k782047k607018k585590k779513k912611k803534
$$ y = [607546806, 606019437, 604401290, 602683783, 600753903, 598551393, 596135616, 593683004, 591317594, 588993788, 586532116, 583826065, 581039548, 578303158, 575525761, 572657347, 569711208, 566715717, 563686490, 560589671, 557499409, 554487228, 551487863, 548452377, 545379877, 542308688, 539220095, 536053717, 532905459, 529875159, 526918828, 523952961, 520890057, 517748356, 514642119, 511558175, 508430481, 505249202, 502008080, 498814702, 495790333, 492883950, 489938259, 486837447, 483672172, 480639577, 477754205, 474855274, 471944869, 469129175, 466310292, 463384271, 460361451, 457290739, 454278857, 451373965, 448533416, 445681423, 442801416, 440019369, 437412351, 434826761, 432047248, 429134637, 426331103]
3145.1D26331103k611607k421231k306669k480090k776683k777576k539068k362788
3161.4D06055391k321303k343983k375930k369136k301454k223194k178043k179474
3177.7C87762874k171278k151340k146184k083332j981079j945466j948118j945943
3194C71390134j939744j879483j801103j748682j750290j757175j696705j646966j619816
3212.4C55550170j575768j548857j549422j546532j543254j509607j416713j303732
3228.7C43556285j182973j168728j361162j503706j409292j274467j197904j096040
3245C33362013j081645j230747j237661j021713r08285j020998j107752j006782r35227
3263.4C23811203r15318p55013o13957p15882r43988j070202r88394q25971q12382
$$ y = [426331103, 423719496, 421298265, 418991596, 416511506, 413734823, 410957247, 408418179, 406055391, 403734088, 401390105, 399014175, 396645039, 394343585, 392120391, 389942348, 387762874, 385591596, 383440256, 381294072, 379210740, 377229661, 375284195, 373336077, 371390134, 369450390, 367570907, 365769804, 364021122, 362270832, 360513657, 358816952, 357169986, 355550170, 353974402, 352425545, 350876123, 349329591, 347786337, 346276730, 344860017, 343556285, 342373312, 341204584, 339843422, 338339716, 336930424, 335655957, 334458053, 333362013, 332280368, 331049621, 329811960, 328790247, 327881962, 326860964, 325753212, 324746430, 323811203, 322895885, 322140872, 321526915, 320811033, 319867045, 318796843, 317808449, 316982478, 316170096]
3281.7C16170096q38071p78585p21425n94646n13852o68138q58158r20087q44925o30677
3302.1C08801532m57883n53548q11905r72837r75073r06944q86172q40992p07477o46353
3322.5C01042348p10338q55386r29505q23438p55430p13706n61088n83738q17597r08702
3342.9B93383420q52675p34985o01798p13676r80616r93341p38084n44697o02961p07745
3363.3B85912842n74351m20034n94198r36956r98735p62463n87821n48154n90563n94526
3383.7B79305041m69834k57998k7031r9629m73440n34147j51396N8800k41190n80430
3404.1B76528746m60744j85043q2969j02490k31565k87473j30385j8835n6773J8030
3424.5B74990499K43336L82423K92838K52396L65883K32011q7112r2477J90199M04298
$$ y = [316170096, 315332025, 314553440, 313832015, 313237369, 312723517, 312055379, 311197221, 310277134, 309432209, 308801532, 308343649, 307790101, 306978196, 306005359, 305030286, 304123342, 303237170, 302396178, 301688701, 301042348, 300332010, 299476624, 298547119, 297723681, 296968251, 296254545, 295693457, 295109719, 294292122, 293383420, 292530745, 291795760, 291193962, 290480286, 289499670, 288506329, 287768245, 287223548, 286620587, 285912842, 285338491, 284918457, 284324259, 283387303, 282388568, 281626105, 281038284, 280490130, 279899567, 279305041, 278835207, 278577209, 278550178, 278450549, 277977109, 277442962, 277291566, 277350366, 277109176, 276528746, 276068002, 275882959, 275799990, 275697500, 275465935, 275178462, 275048077, 275029242, 274972469, 274990499, 275233835, 275616258, 275909096, 276161492, 276527375, 276759386, 276672274, 276579797, 276769996, 277174294]
3444.9B77174294M65155M15116M09216N09053N79566O21021O98686O89745O89566R05752
3465.3B83157170J051456P82549L62933L31252O46472R61572R84848P20471O70850
3483.6B89669573R00328R46612Q81523R41723R79126J012176J046687J046121J047790
3502B98471659R17852P52956Q69304J173615J394332J338899J105458J045495J176148
3520.4C08245718J358539J303345J065702J106262J331627J472026J577169J528263
3536.7C18988651J368791J470387J673013J704335J577824J528860J698970J913339
3553C31924170J975805K025008K205640K241999J998097K019286K823382L376723L030032
3571.3C53620142K732515K845377L072530L304273L432482L277689L137917L487885
$$ y = [277174294, 277639449, 278054565, 278463781, 278972834, 279552400, 280173421, 280872107, 281561852, 282251418, 283157170, 284208626, 284991175, 285354108, 285685360, 286331832, 287293404, 288278252, 288998723, 289669573, 290569901, 291516513, 292398036, 293339759, 294318885, 295331061, 296377748, 297423869, 298471659, 299389511, 300142467, 301011771, 302185386, 303579718, 304918617, 306024075, 307069570, 308245718, 309604257, 310907602, 311973304, 313079566, 314411193, 315883219, 317460388, 318988651, 320357442, 321827829, 323500842, 325205177, 326783001, 328311861, 330010831, 331924170, 333899975, 335924983, 338130623, 340372622, 342370719, 344390005, 347213387, 350590110, 353620142, 356352657, 359198034, 362270564, 365574837, 369007319, 372285008, 375422925, 378910810]
3587.7C78910810L891974L694654L624499L928423M110008M131288M144161L922016
3604D10357833L622740L880918M268945M256636M240125M072696M206508M929275M687011
3622.3D48522687L727764L226608M061878N299866M795730M345208M325301M161954
3638.7D82466996M086762L932447L419608L152936M171789N282640M540205L826857
3655E14880240M292428M475236L868103L438175L227830K866387K866805L356934L012120
3673.3E46284258L056169L917575L732800L271342K911150K474368K352714K681792
3689.6E70682168K960682K859473K549827K141476J857936K030135K310812K006412
3706E89398921J425206J258731J956284K608359K266586J681745J344085J281321J370549
$$ y = [378910810, 382802784, 386497438, 390121937, 394050360, 398160368, 402291656, 406435817, 410357833, 413980573, 417861491, 422130436, 426387072, 430627197, 434699893, 438906401, 443835676, 448522687, 452250451, 455477059, 459538937, 464838803, 469634533, 473979741, 478305042, 482466996, 486553758, 490486205, 493905813, 497058749, 501230538, 506513178, 511053383, 514880240, 519172668, 523647904, 527516007, 530954182, 534182012, 537048399, 539915204, 543272138, 546284258, 549340427, 553258002, 556990802, 560262144, 563173294, 565647662, 568000376, 570682168, 573642850, 576502323, 579052150, 581193626, 583051562, 585081697, 587392509, 589398921, 590824127, 592082858, 594039142, 596647501, 598914087, 600595832, 601939917, 603221238, 604591787]
3724.3F04591787J581788J662671J227916Q16107J112580J933157K069593J277089
3740.6F16272688M39227P00056J414895R41694R79662J978576J940370J260996J154482
3759F27082646J524150J311660R09627R42707J140892J438379J469434J090049P58350
3777.3F37667894Q29935J085341R94146R57668J070380R94146Q51572O37293N06818
3795.7F45595193N21779K78532N32628J164078R93431J159668J393676Q43048J20580
3814.1F52602613Q9288N43594N76139J138091J402259R03189O50108M68373M23968
3832.4F58797622N13971L11195L16024Q19505J132249J199305R65774L03746n91457
3850.8F63767934p49827J027584J863480J156211M24266R8050L35097L87728J87278
$$ y = [604591787, 606173575, 607836246, 609064162, 609880269, 610992849, 612926006, 614995599, 616272688, 616711915, 617411971, 618826866, 619768560, 620748222, 622726798, 624667168, 625928164, 627082646, 628606796, 629918456, 630828083, 631770790, 632911682, 634350061, 635819495, 636909544, 637667894, 638497829, 639583170, 640577316, 641534984, 642605364, 643599510, 644451082, 645088375, 645595193, 646116972, 646395504, 646928132, 648092210, 649085641, 650245309, 651638985, 652482033, 652602613, 652691901, 653235495, 653811634, 654949725, 656351984, 657255173, 657905281, 658373654, 658797622, 659311593, 659622788, 659938812, 660758317, 661890566, 663089871, 664055645, 664359391, 663767934, 663018107, 664045691, 665909171, 667065382, 667489648, 667587698, 667922795, 668310523, 668497801]
3869.1F68497801O11245J022578J036226O17505N006K53857O09576N68807P03693M33862
3889.5F74360156K74122O41167N30422M053j38760J71125N35011R22084R29535N56767
3909.9F78785682K77102P5340m4227J21296L32892L18408L17216M27663K79605K2173
3930.3F80913150K39969O07192M86195J97172O3658J16289L04639K64883J72854L51071
3950.7F83717072M69685L89278K46644J48654J78277K51293K00331J24932J64151J92523
3971.1F86082840J78635K30551K69055J90735J68741J87397J51038J84536K30074J96814
3991.5F88070416J47522J12832J26898
3997.6F88457668
$$ y = [668497801, 669109046, 670131624, 671167850, 671785355, 671790361, 672044218, 672653794, 673222601, 673926294, 674360156, 674634278, 675275445, 675805867, 675809920, 675671160, 675842285, 676377296, 677299380, 678228915, 678785682, 679062784, 679138124, 679093897, 679215193, 679548085, 679866493, 680183709, 680611372, 680890977, 680913150, 681153119, 681760311, 682246506, 682443678, 682507336, 682623625, 682928264, 683193147, 683366001, 683717072, 684186757, 684576035, 684822679, 684971333, 685149610, 685400903, 685601234, 685726166, 685890317, 686082840, 686261475, 686492026, 686761081, 686951816, 687120557, 687307954, 687458992, 687643528, 687873602, 688070416, 688217938, 688330770, 688457668]
##END=$$ End of the data block
