##TITLE=$$ Begin of the data block
##JCAMP-DX=5.00 $$ ACD/SpecManager v 10.08
##SPECTROMETER/DATA SYSTEM=Alpha
##DATE=23 Dec 2014 10:50:12
##DATA TYPE=INFRARED SPECTRUM
##DATA CLASS=XYDATA
##ORIGIN=
##OWNER=
##NPOINTS=1765
##FIRSTX=399.76428223
##LASTX=3997.64306641
##MAXX=3997.64306641
##MINX=399.76428223
##MAXY=0.82833230
##MINY=0.19380458
##XFACTOR=1.0000000000
##YFACTOR=1.000000000000000e-9
##FIRSTY=0.51020974
##DELTAX=2.03961372
##XUNITS=1/CM
##YUNITS=ARBITRARY UNITS
##XYDATA=(X++(Y..Y))
399.8E10209739p539987p454038l024906K449662M028946R18626k225905j349926K552301
$$ 510209739 502669752 495215714 492190808 494640470 498669416 499588042 497362137 496012211 498564512
418.1D98564512L864556j317680o014257n651534j501113P35283j720161n452692n393505
$$ 498564512 502429068 501111388 495097131 489445597 487944484 488679767 486959606 481506914 476113409
436.5D76113409n74261N016386O774217L736049J092136K804905N759746M972577L81172
$$ 476113409 475539148 480555534 487329751 491065800 492157936 494962841 500722587 505695164 506076336
454.8E06076336l607094l286451J19835R19103k231270n858809o097704l025055m59790
$$ 506076336 502469242 499182791 499302626 500221729 497990459 492131650 486033946 483008891 482549101
473.2D82549101j434684m165888m695504j700551J900167K370506n40256l038586k138048
$$ 482549101 481114417 476948529 472253025 470552474 472452641 474823147 474282891 471244305 469106257
491.5D69106257N25773J118987j310825m261285m595876k060890k45214j897692n183548
$$ 469106257 469632030 470751017 469440192 465178907 460583031 458522141 458276927 456379235 451195687
509.9D51195687o272882m497528k590001l028989n185961o124258m170418m63367J714587
$$ 451195687 444922805 440425277 437835276 434806287 429620326 423496068 419325650 418862283 420576870
528.3D20576870Q57264o12885K10315L740550P217079P477224M672199J791269J211673
$$ 420576870 421434134 420821249 421031564 424772114 431989193 439466417 444138616 445929885 447141558
546.6D47141558K022892J312107j542121m184693m515916l214121k851725m790902
$$ 447141558 449164450 450476557 448934436 444749743 440233827 437019706 434167981 429377079
562.9D29377079p656664q991748p689118n034119k943307j685441r0182K949238O764025
$$ 429377079 421720415 412728667 405039549 400005430 397062123 395376682 395286500 398235738 404999763
581.3D04999763R093910Q454681O033957M147797L763944L549248J917065n07743j901030
$$ 404999763 414093673 422548354 428582311 432730108 436494052 440043300 441960365 441452622 439551592
599.6D39551592j193136O92487J441002K66909q37117j5736K150476L756255L677845
$$ 439551592 438358456 439050943 440491945 440758854 439921737 439906001 442056477 445812732 449490577
618D49490577K643824K459824L823310N362809N148381L152430J380711J474470K845317
$$ 449490577 452134401 454594225 458417535 463780344 468928725 472081155 473461866 474936336 477781653
636.4D77781653L333897K003789K45362k5242J356452K661556K320558O71596l68864
$$ 477781653 481115550 483119339 483364701 483339459 484695911 487357467 489678025 490349621 489980757
654.7D89980757M04239J994252K381057J125455J29640Q00788K264261K123624J484693
$$ 489980757 490384996 492379248 494760305 495885760 496015400 496816188 499080449 501204073 502688766
673.1E02688766P49707M76718J572847K905905K749801J082778l01600j59502P06077
$$ 502688766 503438473 503915191 505488038 508393943 511143744 512226522 511924922 511765420 512471497
691.4E12471497N75304j140475l287912m126906l339410k189219j830011j978606j324237
$$ 512471497 513046801 511906326 508618414 504491508 501152098 498962879 497132868 495154262 493830025
709.8D93830025P96318L446877N026162N158901M982054N511523O731093P575035O851554
$$ 493830025 494626343 498073220 503099382 508258283 513240337 518751860 525482953 533057988 539909542
728.1E39909542N027890L770530L822267M244983L574550J670719k56539j128494j316548
$$ 539909542 544937432 548707962 552530229 556775212 560349762 562020481 561763942 560635448 559318900
746.5E59318900k078831l833771n569577o138027n456388m383921l737331l264785
$$ 559318900 557240069 553406298 547836721 541698694 536242306 531858385 528121054 524856269
762.8E24856269k022624M82202L745973O510615P982970Q651733R359062J0023772
$$ 524856269 522833645 523315847 527061820 533572435 541555405 550207138 559566200 569589972
779.1E69589972R722472Q104801O036758M692614M531324M815162M612147M004002
$$ 569589972 579312444 587417245 593454003 598146617 602677941 607493103 612105250 616109252
795.4F16109252L809512M400849N123675M934251L678799K413153K018154K269089
$$ 616109252 619918764 624319613 629443288 634377539 638056338 640469491 642487645 644756734
811.8F44756734K233148J376927J52171n01335m93348q05199k040923l719329m954458
$$ 644756734 646989882 648366809 648518980 648017645 647524297 646719098 644678175 640958846 636004388
830.1F36004388n407750n491138n745768o125748o078423n317926m294932l680289
$$ 636004388 630596638 625105500 619359732 613233984 607155561 601837635 597542703 593862414
846.4E93862414l738403m141211m430891m609942m832983m628956k659977J760185
$$ 593862414 590124011 585982800 581551909 576941967 572108984 567480028 564820051 566580236
862.8E66580236P118583J1163950J3117253J3290525J2047768R850680P042170L607154
$$ 566580236 573698819 584862769 597980022 611270547 623318315 633168995 640211165 643818319
879.1F43818319k37227l576576n518556o162822o368220o682456o880045o498694n630970
$$ 643818319 643581092 640004516 634485960 628323138 621954918 615272462 608392417 601893723 596262753
897.4E96262753m999042n263686o324947p430970q150339q807898r866357j1142790
$$ 596262753 591263711 586000025 579675078 572244108 564093769 555285871 545419514 534276724
913.7E34276724j1852026j1298001r382188o782115m424304k678960j220733L61472
$$ 534276724 522424698 511126697 501744509 494962394 490538090 487859130 486638397 486999869
930.1D86999869J934499L071844L716767M352898N373895O164193N137384J449168
$$ 486999869 488934368 492006212 495722979 500075877 505449772 511613965 516751349 518200517
946.4E18200517l608823q029342j1092037j3304025j5258521j6927808j7968863j8475861
$$ 518200517 514591694 506562352 495470315 482166290 466907769 449979961 432011098 413535237
962.7D13535237j8948018j9670874k0507366k1027594k0947636k0421892j9583315
$$ 413535237 394587219 374916345 354408979 333381385 312433749 292011857 272428542
977B72428542j8270909j6325936j3765454j0798306p906213n485088l520384j914084
$$ 272428542 254157633 237831697 224066243 213267937 205361724 199876636 196356252 194442168
993.3A94442168o37591K78339Q28877J029476Q97706N22479N1678l41475n32642m45664
$$ 194442168 193804577 194082916 194911793 195941269 196838975 197361454 197413132 197071657 196539015 196093351
1013.7A96093351n1067O30975J440704K231061K879948L305957L577113L770858L815144
$$ 196093351 196042284 196673259 198113963 200345024 203224972 206530929 210108042 213878900 217694044
1032B17694044L438085K556637J510039P91028N79745P44090J062035J484856K325848
$$ 217694044 221132129 223688766 225198805 225989833 226569578 227313668 228375703 229860559 232186407
1050.4B32186407L801301N558804P032171Q129224R115845J0152042J0616332Q781850
$$ 232186407 235987708 241546512 248578683 256707907 265823752 275975794 286592126 295373976
1066.7B95373976L217191m643262j0546416j1432618q268982m149496r16154J389951
$$ 295373976 298591167 293947905 283401489 271968871 263699889 259550393 258634239 260024190
1083B60024190L161132M587949N789548O605416O708235O168991N200684L864676K323419
$$ 260024190 263185322 267773271 273562819 280168235 286876470 293045461 298246145 302110821 304434240
1101.4C04434240J060814P12096J576513L168315M489839M844844M281789L378004
$$ 304434240 305495054 306207150 307783663 310951978 315441817 320286661 324568450 327946454
1117.7C27946454K686233K385676K313405K450615L054738M111379M891813M289955
$$ 327946454 330632687 333018363 335331768 337782383 340837121 344948500 349840313 354130268
1134C54130268J813650j856088n328805p516801q330494q382619q024394p117421n543440
$$ 354130268 355943918 354087830 348759025 341242224 332911730 324529111 316504717 309387296 303843856
1152.4C03843856l524721j518845J03145J447052L055871N295783P993013J0515451
$$ 303843856 300319135 298800290 298903435 300350487 303406358 308702141 316695154 327210605
1168.7C27210605J2316942J3442874J4349073J5243978J5820414J5608817J4520407
$$ 327210605 339527547 352970421 367319494 382563472 398383886 413992703 428513110
1183D28513110J3077557J1847287J0701060Q985162O470800L865957K281666K048760
$$ 428513110 441590667 453437954 464139014 473124176 479594976 483460933 485742599 487791359
1199.3D87791359K379924K378047K032101K156317L325791N040645O070197N669534
$$ 487791359 490171283 492549330 494581431 496737748 500063539 505104184 511174381 516843915
1215.6E16843915M403234L388166K876937K144933O22571j286686k493322k384066
$$ 516843915 521247149 524635315 527512252 529657185 530279756 528993070 526499748 524115682
1231.9E24115682j627028j362264j818002k204478j611053k0683J495182J962185J611233
$$ 524115682 522488654 521126390 519308388 517103910 515492857 515472174 516967356 518929541 520540774
1250.3E20540774J430869J911223K484798K231062J115143K15352N56469J934230L012478
$$ 520540774 521971643 523882866 526367664 528598726 529713869 529929221 530485690 532419920 535432398
1268.6E35432398K739191J469553M07040K30789M48942J22369q25048j501560j280904
$$ 535432398 538171589 539641142 540048182 540278971 540727913 540850282 540025234 538523674 537242770
1287E37242770n31733k40028r87768k226114k823174k335608j550734j484752k212882
$$ 537242770 536711037 536471009 535483241 533257127 530433953 528098345 526547611 525062859 522849977
1305.4E22849977k848506k457857j317918o73414j116514k027809k471090k328396
$$ 522849977 520001471 517543614 516225696 515552282 514435768 512407959 509936869 507608473
1321.7E07608473k538144l807962n616725o666988o230056m773170l331631k527148
$$ 507608473 505070329 501262367 495645642 488978654 482748598 477975428 474643797 472116649
1338D72116649k019018j033962K40118J050800Q80211r7930r42528j073063p31706
$$ 472116649 470097631 469063669 469303787 470354587 471234798 471136868 470194340 469121277 468389571
1356.4D68389571n67884j054525j874298j779407p57486O3628L99113L12328K17706
$$ 468389571 467821687 466767162 464892864 463113457 462355971 462419599 462818712 463131040 463348746
1374.7D63348746O40124J309783J656413J746922K172739L264516M173041L901541
$$ 463348746 463988870 465298653 466955066 468701988 470874727 474139243 478312284 482213825
1391D82213825K714515Q43286p44074j279176j003027r76443j897693k723932k783447
$$ 482213825 484928340 485771626 485027552 483748376 482745349 481768906 479871213 477147281 474363834
1409.4D74363834k334118j560897j066834j469522j941771p27683P73400J424313J427293
$$ 474363834 472029716 470468819 469401985 467932463 465990692 465263009 466036409 467460722 468888015
1427.7D68888015J184970J376539K072096K824932K964080K219736J732290J628608
$$ 468888015 470072985 471449524 473521620 476346552 479310632 481530368 483262658 484891266
1444.1D84891266J614779J078606p5907r96858j294583j785725j763493K3931J182169
$$ 484891266 486506045 487584651 487508744 486511886 485217303 483431578 481668085 481692016 482874185
1462.4D82874185K145588L859908N735993P877350J0739326J0956586R335875Q885682
$$ 482874185 485019773 488879681 494615674 502493024 513232350 524188936 533524811 542410493
1478.7E42410493R067416Q794308P438123O421745O520748O817043N905688M994452
$$ 542410493 551477909 560272217 567710340 574132085 580652833 587469876 593375564 598370016
1495E98370016M368305L674745L707171L986597M169822L589451K190769K233088K970636
$$ 598370016 602738321 606413066 610120237 614106834 618276656 621866107 624056876 626289964 629260600
1513.4F29260600L377199L107130K193988J672506K045572K529502K295077J422941
$$ 629260600 632637799 635744929 637938917 639611423 641656995 644186497 646481574 647904515
1529.7F47904515P90715P09355J372636J798510J040042o57141p15256J04189O42001
$$ 647904515 648695230 649404585 650777221 652575731 653615773 652958632 652243376 652347565 652989566
1548.1F52989566L63887m84705j049698q63015j259446k363801j640440j870095k260089
$$ 652989566 653353453 652868748 651819050 650956035 649696589 647332788 645692348 643822253 641562164
1566.4F41562164k137959k088845j585364k106369l867268l188849j583218j402140
$$ 641562164 639424205 637335360 635749996 633643627 629776359 626587510 625004292 623602152
1582.8F23602152j947284k593160k677917k137005j607836j815557k560854l080249
$$ 623602152 621654868 619061708 616383791 614246786 612638950 610823393 608262539 605182290
1599.1F05182290l094911k791822k752603l374636m266321m303813l476143l466070
$$ 605182290 602087379 599295557 596542954 593168318 588901997 584598184 581122041 577655971
1615.4E77655971m423737l659606l071785l545583k961039k335072k377450j942694
$$ 577655971 573232234 569572628 566500843 562955260 559994221 557659149 555281699 553339005
1631.7E53339005j609445j903594j082062L159K65717M00126P18832J562178K209008
$$ 553339005 551729560 549825966 548743904 548747063 549012780 549412906 550131738 551693916 553902924
1650.1E53902924K305329K288580K518475L150225L943443M533768M449904L966748
$$ 553902924 556208253 558496833 561015308 564165533 568108976 572642744 577092648 581059396
1666.4E81059396M402042N473613N437136N355597N331695M930496N092621O056785
$$ 581059396 585461438 590935051 596372187 601727784 607059479 611989975 617082596 623139381
1682.7F23139381P340074N924284M617691M862130M976571N484164N537271M185140
$$ 623139381 630479455 636403739 641021430 645883560 650860131 656344295 661881566 666066706
1699F66066706L446579L255487L317177L166795K363860J867473J972139K406180K726138
$$ 666066706 669513285 672768772 676085949 679252744 681616604 683484077 685456216 687862396 690588534
1717.4F90588534K253413J564622J375735J802385K372026K583265K080977J104296
$$ 690588534 692841947 694406569 695782304 697584689 699956715 702539980 704620957 705725253
1733.7G05725253J024127J872062K417147K326191J992047K063274K617955L387869
$$ 705725253 706749380 708621442 711038589 713364780 715356827 717420101 720038056 723425925
1750G23425925L677130L078758K524972K505481K889574L306806K911508K100289J651406
$$ 723425925 727103055 730181813 732706785 735212266 738101840 741408646 744320154 746420443 748071849
1768.4G48071849J774192K210677K142966J523018R88245Q91268J309454J704037J582981
$$ 748071849 749846041 752056718 754199684 755722702 756710947 757602215 758911669 760615706 762198687
1786.7G62198687J139819P60079Q49604J343191J475751J005471M31657M96209J058816
$$ 762198687 763338506 764098585 764948189 766291380 767767131 768772602 769204259 769700468 770759284
1805.1G70759284J451791J240671O07967K99275O35862J141370J285552R00746L40640
$$ 770759284 772211075 773451746 774059713 774358988 774994850 776136220 777421772 778322518 778663158
1823.4G78663158K14518P05361J084268Q48234L66747Q2433K88427Q30233R76205L69430
$$ 778663158 778877676 779583037 780667305 781515539 781882286 781964719 782253146 783083379 784059584 784429014
1843.8G84429014k33591o2525M32789P94649O43254J17659j98841N7280N90801Q35121
$$ 784429014 784195423 784132898 784565687 785360336 786003590 786121249 785922408 785979688 786570489 787405610
1864.2G87405610M85063k09630l21388L26335P91312O82532K40624m9948J60455O64294
$$ 787405610 787890673 787681043 787359655 787685990 788477302 789159834 789400458 789350510 789510965 790175259
1884.6G90175259R02057N24580n4896j08003K85625O78778O40094J78039j91688m3810
$$ 790175259 791077316 791601896 791547000 791438997 791724622 792403400 793043494 793221533 793029845 792986035
1905G92986035L86119N48363K38836j82569k26140J45197N73933N14030K1637k81692
$$ 792986035 793372154 793920517 794159353 793976784 793750644 793895841 794469774 794983804 795005441 794723749
1925.4G94723749p3433L60489N59747K91109j61886k48670J33574N13851M69327Q8275
$$ 794723749 794650316 795010805 795570552 795861661 795699775 795451105 795584679 796098530 796567857 796656132
1945.8G96656132j90437l3021M07576O30200L93451m3750j82033J44601N47230N10991
$$ 796656132 796465695 796432674 796840250 797470450 797863901 797820151 797638118 797782719 798329949 798840940
1966.2G98840940R3102j78098l7968L33786N20408K81214j23739k29895O2406M02510
$$ 798840940 798934042 798755944 798717976 799051762 799572170 799853384 799729645 799499750 799562156 799964666
1986.6G99964666M07398N6982k84850k08796J67192L69250J35958k98678m50671k11716
$$ 799964666 800372064 800429046 800144196 799935400 800102592 800471842 800607800 800309122 799858451 799646735
2007G99646735Q6248O0678k97428o20722o20961m05550l08097n63800q59380n92232
$$ 799646735 799732983 799793661 799496233 798875511 798254550 797849000 797540903 796977103 796117723 795525491
2027.4G95525491j00732M9115q4818m01497o82175o17862k88069o1989j54614m37021
$$ 795525491 795424759 795473874 795389056 794987559 794305384 793687522 793399453 793337464 793182850 792745829
2047.8G92745829n00143k05278J26362J83105m8339k67506j74701J52051L50416K12014
$$ 792745829 792245686 792040408 792166770 792349875 792301536 792034030 791859329 792011380 792361796 792573810
2068.2G92573810q8036j83881K5094K51055K24232n245j84059r1970K20001L93867
$$ 792573810 792485774 792301893 792326987 792578042 792802274 792797029 792612970 792521000 792741001 793134868
2088.6G93134868K64883M351j18613L4869L18110M19974K00272o9738n4359J87337
$$ 793134868 793399751 793404102 793285489 793320358 793638468 794058442 794258714 794188976 794134617 794321954
2109G94321954L49045K70188K1875j42276m2320J71006K17736L5107j44661r7513J07944
$$ 794321954 794670999 794941187 794963062 794820786 794778466 794949472 795167208 795202315 795057654 794960141 795068085
2131.4G95068085K23577J28210o6161j51396n4896J16169J80603R1195k2233l9995
$$ 795068085 795291662 795419872 795353711 795202315 795147419 795263588 795444191 795535386 795513153 795473158
2151.8G95473158J13786L04281L05772J63436J07229K41279M41492N29587M95434M32909
$$ 795473158 795586944 795891225 796196997 796360433 796467662 796708941 797150433 797680020 798175454 798608363
2172.2G98608363M26590N41330O57558O24955M65631L41773M21882N97417O17802M70519
$$ 798608363 799034953 799576283 800233841 800858796 801324427 801666200 802088082 802685499 803303301 803773820
2192.6H03773820L27945L14593M19498N15699N14031M37677L43620L34621M54426N66661
$$ 803773820 804101765 804416358 804835856 805351555 805865586 806303263 806646883 806981504 807435930 808002591
2213H08002591N45621M24445L15845L20196M07696M64797L85880K25425J86264K77222
$$ 808002591 808548212 808972657 809288502 809608698 810016394 810481191 810867071 811092496 811278760 811555982
2233.4H11555982L51965L45469K72095K00808K24113L06309L12328K38597J70827J46747
$$ 811555982 811907947 812253416 812525511 812726319 812950432 813256741 813569069 813807666 813978493 814125240
2253.8H14125240J89721K85507L16739K46703J92762K07424K70486L50177L40998J99199
$$ 814125240 814314961 814600468 814917207 815163910 815356672 815564096 815834582 816184759 816525757 816724956
2274.2H16724956R1136J61588K92182L37183K93493J98245J77444K59578L10182L06487
$$ 816724956 816816092 816977680 817269862 817607045 817900538 818098783 818276227 818535805 818845987 819152474
2294.6H19152474K86282K40325K04742K88010M55797N25295M53532L55065L53336M94063
$$ 819152474 819438756 819679081 819883823 820171833 820627630 821152925 821606457 821961522 822314858 822808921
2315H22808921O59228P02142N87821L79086K98619M32909N16832K36809j76668k10285
$$ 822808921 823468149 824170291 824758112 825137198 825435817 825868726 826385558 826622367 826445699 826235414
2335.4H26235414L4451J62780m5001p03931j447439j060486K50578J263857J431226
$$ 826235414 826269865 826432645 826387644 825683713 824236274 823175788 823426366 824690223 826121449
2353.7H26121449J136005Q09789K65062l39150r46105j393974j514733j471936j349211
$$ 826121449 827257454 828067243 828332305 827993155 827047050 825653076 824138343 822666407 821317196
2372.1H21317196j269937j320779j315594j109898q06153n52713m49896m88341m59492
$$ 821317196 820047259 818726480 817410886 816300988 815494835 814942122 814492226 814003885 813544393
2390.4H13544393k27631j1742o2406l01361m71115m17590k25723j45197l09706n51342
$$ 813544393 813316762 813305020 813242614 812941253 812470138 812052548 811826825 811681628 811371922 810820580
2410.8H10820580o25849m90070l18706l33845n46217p14481o58393m65691l74198n64456
$$ 810820580 810194731 809704661 809385955 809052110 808505893 807791412 807133019 806667328 806293130 805728674
2431.2H05728674q40008q50976o29961m54247m82321o82294q69453q22366n81979m46618
$$ 805728674 804888666 804037690 803407729 802953482 802471161 801788867 800919414 800097048 799515069 799068451
2451.6G99068451n82039q01444q31962o35862l92437l67463o15716q37803p33972m42028
$$ 799068451 798486412 797684968 796853006 796217144 795824707 795457244 794841528 794003725 793269753 792827725
2472G92827725l36229n18501p81596q34644n91576l19064k98798m91440o24657n14388
$$ 792827725 792491496 791972995 791191399 790356755 789765179 789446115 789147317 788655877 788031220 787516832
2492.4G87516832k86281k01702l47555n51819n77867l49045j08123j55449l91245n57065
$$ 787516832 787230551 787028849 786681294 786129475 785551608 785202563 785094440 784938991 784547746 783990681
2512.8G83990681n39362l56615k31862l83496o74010p56025n37395l30806m29392p37905
$$ 783990681 783451319 783094704 782862842 782479346 781805336 781049311 780511916 780181110 779751718 779013813
2533.2G79013813r30489q10325n32388m48406o81460r59933r52840o85215m62413n14209
$$ 779013813 778083324 777272999 776740611 776292205 775610745 774650812 773697972 773012757 772550344 772036135
2553.6G72036135p62045r16660q33333o06000m63545n92351q46327q91089o64771m37438
$$ 772036135 771274090 770357430 769524097 768918097 768454552 767862201 767015874 766124785 765460014 765022576
2574G65022576m78745p36117q79943p25270m46379l57926n56886p86483p56562m54128
$$ 765022576 764543831 763807714 762927771 762202501 761756122 761398196 760841310 760054827 759298265 758844137
2594.4G58844137j96099k71559n32210o70969o09935m77075m75347o89089r67265j058638
$$ 758844137 758648038 758376479 757844269 757173300 756563365 756086290 755610943 754921854 753954589 752895951
2614.8G52895951q90255p24017q42095j140892j316011j239538j059115j041890j256465
$$ 752895951 752005696 751281679 750439584 749298692 747982681 746743143 745684028 744642138 743385673
2633.2G43385673j472474j468360j291394j163841j217365j374125j455426j354278
$$ 743385673 741913199 740444839 739153445 737989604 736772239 735398114 733942688 732588410
2649.5G32588410j175165j107454j223207j419782j440823j223624j032114j078367
$$ 732588410 731413245 730305791 729082584 727662802 726221979 724998355 723966241 722887874
2665.8G22887874j278401j351893j168906r47237r14216j056493j210093j173497r56594
$$ 722887874 721609473 720257580 719088674 718141437 717227221 716170728 714960635 713787138 712830544
2684.1G12830544q07405q98838j120985j224458j123488r65655r81092j201153j389384
$$ 712830544 712023139 711124301 710003316 708778858 707655370 706689715 705708623 704507470 703118086
2702.5G03118086j357258j196742j094996j137734j294851j379311j240611j038552
$$ 703118086 701760828 700564086 699469090 698331356 697036505 695657194 694416583 693378031
2718.8F93378031r94920j094223j190245j135289r45688p92205q09491r52124r90570
$$ 693378031 692383111 691288888 690098643 688963354 688017666 687225461 686415970 685463846 684473276
2737.2F84473276q54075p21395p36594q59976r66549r36627p51019n96225o12497p29323
$$ 684473276 683619201 682897806 682161212 681301236 680334687 679398060 678647041 678050816 677438319 676708996
2757.6F76708996q14378p49469n67436n00202o59526q74936r38416q03351o79851q33153
$$ 676708996 675894618 675145149 674577713 674077511 673417985 672543049 671604633 670801282 670121431 669288278
2778F69288278j117409j212537j129806j035631j082897j310944j519561j554668j493693
$$ 669288278 668170869 666958332 665828526 664792895 663709998 662399054 660879493 659324825 657831132
2796.3F57831132j515209j680851j852930j927137j936496j919090j966775k160489
$$ 657831132 656315923 654635072 652782142 650855005 648918509 646999419 645032644 642872155
2812.6F42872155k361000k406895k347469k336622k462804k683341k848924k860427
$$ 642872155 640511155 638104260 635756791 633420169 630957365 628274024 625425100 622564673
2828.9F22564673k830684k909779l096640l293217l449320l596008l773868m037381
$$ 622564673 619733989 616824210 613727570 610434353 606985033 603389025 599615157 595577776
2845.3E95577776m308283m366755m108549l620863l165900k997399l118932l408253
$$ 595577776 591269493 586902738 582794189 579173326 576007426 573010027 569891095 566482842
2861.6E66482842l768563m206121m784227n373716n754173n866587n788624n602300
$$ 566482842 562714279 558508158 553723931 548350215 542596042 536729455 530940831 525338531
2877.9E25338531n319357m820705m043579l139675k292752j648307j236260r47892
$$ 525338531 520019174 515198469 511154890 508015215 505722463 504074156 502837896 501890004
2894.2E01890004p39098o74903p80583j018256j325071j637637j961231k368987k906620
$$ 501890004 501150906 500476003 499695420 498677164 497352093 495714456 493753225 491384238 488477618
2912.6D88477618l522784m025668m193336m058450l773600l310919k576887j599253
$$ 488477618 484954834 480929166 476735830 472677380 468903780 465592861 463015974 461416721
2928.9D61416721m61489Q11398K097518L235221M233002N114258N772531O097942O156415
$$ 461416721 460955232 461766630 463864148 467099369 471332371 476446629 482219160 488317102 494473517
2947.2D94473517O175935O259144O306052O279170O210923O051064N728364N339265
$$ 494473517 500649452 506908596 513214648 519493818 525704741 531755805 537484169 542823434
2963.6E42823434N023360M716814M356503M085005L986656L975809L998041L927410
$$ 542823434 547846794 552563608 556920111 561005116 564991772 568967581 572965622 576893032
2979.9E76893032L629803L252328K961933K732992K509833K163946J680077J331091
$$ 576893032 580522835 583775163 586737096 589470088 591979921 594143867 595823944 597155035
2996.2E97155035J118004Q17537M40538J6868l67641n27323o03914q97586j339972
$$ 597155035 598273039 599090576 599531114 599547982 599180341 598653018 598049104 597151518 595811546
3014.5E95811546j692236j882672j968503k023816k151012k366841k505482k503037
$$ 595811546 594119310 592236638 590268135 588244319 586093307 583726466 581220984 578717947
3030.9E78717947k443314k531886k781510k858341k774119k787173k913952l046453
$$ 578717947 576274633 573742747 570961237 568102896 565328777 562541604 559627652 556581199
3047.2E56581199l094971l087819l039240k962947l018618l164291l193736l116250
$$ 556581199 553486228 550398409 547359169 544396222 541377604 538213313 535019577 531903327
3063.5E31903327l016770l017247l156364l247023l162801k911925k754212k946436
$$ 531903327 528886557 525869310 522712946 519465923 516303122 513391197 510636985 507690549
3079.8E07690549l174722l193558l188461l127515l021032l079563l187537l123552
$$ 507690549 504515827 501322269 498133808 495006293 491985261 488905698 485718161 482594609
3096.1D82594609k933293k869159k978385l013432k925902k889872k944261k869546
$$ 482594609 479661316 476792157 473813772 470800340 467874438 464984566 462040305 459170759
3112.4D59170759k705068k730131k844304k921104k987444k977729k870083k755344
$$ 459170759 456465691 453735560 450891256 447970152 444982708 442004979 439134896 436379552
3128.8D36379552k759695k832920k743780k523959k473861k655476k763361k629578
$$ 436379552 433619857 430786937 428043157 425519198 423045337 420389861 417626500 414996922
3145.1D14996922k472669k398640k350032k436400k613216k608597k462656k371907
$$ 414996922 412524253 410125613 407775581 405339181 402725965 400117368 397654712 395282805
3161.4C95282805k334446k289533k214164k174407k209664k217799k155155k103478
$$ 395282805 392948359 390658826 388444662 386270255 384060591 381842792 379687637 377584159
3177.7C77584159k074450k050370k027839j974136j877963j819313j863301j928717
$$ 377584159 375509709 373459339 371431500 369457364 367579401 365760088 363896787 361968070
3194C61968070j953929j899094j765787j670778j668930j683980j647950j576155j520306
$$ 361968070 360014141 358115047 356349260 354678482 353009552 351325572 349677622 348101467 346581161
3212.4C46581161j487583j471311j517027j534760j438111j367778j365215j307308
$$ 346581161 345093578 343622267 342105240 340570480 339132369 337764591 336399376 335092068
3228.7C35092068j183749j143276j286149j419336j385242j265913j140535j066267
$$ 335092068 333908319 332765043 331478894 330059558 328674316 327408403 326267868 325201601
3245C25201601j062423j112431j142085j070768r80884j006722j052320r83119q96215
$$ 325201601 324139178 323026747 321884662 320813894 319833010 318826288 317773968 316790849 315894634
3263.4C15894634q61913p71702o54638p42882r41843j005322r54747q64148q16733
$$ 315894634 315032721 314261019 313606381 312863499 311921656 310916334 309961587 309097439 308280706
3281.7C08280706q18073p72745o71744n78642n76854o89536q32617r07541q12232n83232
$$ 308280706 307462633 306689888 306018144 305439502 304862648 304173112 303340495 302432954 301620722 301037490
3302.1C01037490m44650n73337q79854j053274j007438r24438r01222q73983p85679
$$ 301037490 300592840 300019503 299139649 298086375 297078937 296154499 295253277 294379294 293593615
3320.5B93593615o87211o62029p89196r42140r21250q26359p37339o48856p14719q89480
$$ 293593615 292906404 292244375 291455179 290513039 289591789 288765430 288028091 287379235 286664516 285775036
3340.9B85775036r36777r00745q44389p15584p32779r49979j029551q59052o94096
$$ 285775036 284838259 283937514 283093125 282377541 281644762 280694783 279665232 278806180 278112084
3359.2B78112084p46280p85142n55873m17710o74396j011998j015186p68453o32972
$$ 278112084 277365804 276580662 276024789 275607079 274932683 273920685 272905499 272137046 271504074
3377.6B71504074o13451o53356o96242n58108k56002k6792j63764n36293n92053k10195
$$ 271504074 270890623 270237267 269541025 268982917 268726915 268700123 268536359 268000066 267408013 267197818
3398B67197818N3703k45213o41018n31346k25603q1569o5119k15530l60191k68906
$$ 267197818 267251521 267006308 266365290 265833944 265608341 265526772 265461653 265246123 264885932 264617026
3418.4B64617026j52320j21563M976J73718K66165K59161L09676M25577K78443m0621
$$ 264617026 264464706 264343143 264348119 264521837 264788002 265047163 265356839 265782416 266060859 266020238
3438.8B66020238q4489J40339L16203L40789L29375L89070M78923O06209P71195Q08537
$$ 266020238 265935749 266076088 266392291 266733080 267062455 267451525 267930448 268536657 269307852 270116389
3459.2B70116389O10471N50657Q80480J089603P55995K86788K58595N71668R68665
$$ 270116389 270726860 271277517 272157997 273247600 274003595 274290383 274548978 275120646 276089311
3477.5B76089311J045912O81400N97924Q98779R21667P51316Q26299R99898J072764
$$ 276089311 277135223 277816623 278414547 279313326 280234993 280986309 281812608 282812506 283885270
3495.9B83885270J045496J030594R58830P42465P08342R01371J089960J254827J190960
$$ 283885270 284930766 285961360 286920190 287662655 288370997 289272368 290362328 291617155 292808115
3514.2B92808115R27002Q97526J147479J404286J306951R64731Q73893J115889J384198
$$ 292808115 293735117 294632643 295780122 297184408 298491359 299456090 300329983 301445872 302830070
3532.6C02830070J494110J382232J242697J459122J701206J514315J219899J372277
$$ 302830070 304324180 305706412 306949109 308408231 310109437 311623752 312843651 314215928
3548.9C14215928J571805J557618J725107J950592K040953K149433K153337J874327
$$ 314215928 315787733 317345351 319070458 321021050 323062003 325211436 327364773 329239100
3565.2C29239100J945377K601653K842277K642125K608538K797067L047377L323823
$$ 329239100 331184477 333786130 336628407 339270532 341879070 344676137 347723514 351047337
3581.5C51047337L463864L078193K587139L132463L645152L497243L560692L857136
$$ 351047337 354511201 357589394 360176533 363308996 366954148 370451391 374012083 377869219
3597.9C77869219L801494L740401L890037L719509L510624L758252M057914M253715
$$ 377869219 381670713 385411114 389301151 393020660 396531284 400289536 404347450 408601165
3614.2D08601165M245132L948033M102141M466831M439622L910244L291607L953308
$$ 408601165 412846297 416794330 420896471 425363302 429802924 433713168 437004775 440958083
3630.5D40958083M571497M414231M268109M200727M201681M327804M312157L841341
$$ 440958083 445529580 449943811 454211920 458412647 462614328 466942132 471254289 475095630
3646.8D75095630L395348L989846M508346M147500M060060M327208M086017L808260
$$ 475095630 478490978 482480824 486989170 491136670 495196730 499523938 503609955 507418215
3663.1E07418215L939271L678143K988935L349006L543854K685904K991140L622234
$$ 507418215 511357486 515035629 518024564 521373570 524917424 527603328 530594468 534216702
3679.4E34216702L526509L542483L528475K956689K030611K074063K647757K747834
$$ 534216702 537743211 541285694 544814169 547770858 549801469 551875532 554523289 557271123
3695.8E57271123K536595K153635J902282K295375K650261K288043J414121J035034
$$ 557271123 559807718 561961353 563863635 566159010 568809271 571097314 572511435 573546469
3712.1E73546469J922906K436340K195715J856327J599610J417458J514674J973509
$$ 573546469 575469375 577905715 580101430 581957757 583557367 584974825 586489499 588463008
3728.4E88463008K054394J512468P89046Q93712J834154K096176R77695L4988J292527
$$ 588463008 590517402 592029870 592818916 593712628 595546782 597642958 598620653 598655641 599948168
3746.7E99948168J567960M71413R62794J932501J636386R96352J167595J456857J206517
$$ 599948168 601516128 601987541 602950335 604882836 606519222 607515574 608683169 610140026 611346543
3765.1F11346543J005292P76171Q06928J314998J514673J195431P41899P96139R14097
$$ 611346543 612351835 613128006 613934934 615249932 616764605 617960036 618701935 619498074 620412171
3783.5F20412171Q33750R59038J112700J194715J115144R22501J026153O64056R8824
$$ 620412171 621245921 622204959 623317659 624512374 625627518 626550019 627576172 628240228 628339052
3801.8F28339052P90298Q45671N47767J228332J525402Q79169L46958Q03411M51684
$$ 628339052 629129350 629975021 630522788 631751120 633276522 634155691 634502649 635306060 635757744
3820.2F35757744J74046R82046R85980Q27372Q50618P96914R11236N57423k146L01659
$$ 635757744 635931790 636913836 637899816 638727188 639577806 640374720 641285956 641843379 641841233 642142892
3840.6F42142892P15315R16183J178503J291514O37114j137674q09908J378715J582325
$$ 642142892 642858207 643774390 644952893 646244407 646881521 645743847 644933939 646312654 647894979
3858.9F47894979R33885L64840M25697P43508K53558J7703M53054Q00550R79722M79102
$$ 647894979 648828864 649193704 649619401 650362909 650616467 650634170 651087224 651887774 652867496 653346598
3879.3F53346598K55764N71191L86834N35965N57363M6790L40521R38952O96302N7816
$$ 653346598 653602362 654173553 654560387 655096352 655653715 655700505 656041026 656979978 657676280 657734096
3899.7F57734096k39909j43408M09066R06289P81655N05805M00603J46627o2525K36511
$$ 657734096 657494187 657350779 657759845 658666134 659447789 659953594 660354197 660500824 660438299 660674810
3920.1F60674810M61281K19941J47104L56257K93076J43945K80857L58761K74360K24113
$$ 660674810 661136091 661356032 661503136 661859393 662152469 662296414 662577271 662936032 663210392 663434505
3940.5F63434505K07723L17931L32296J40845J93298M31717M41730K37405P1526O5207
$$ 663434505 663642228 663960159 664292455 664433300 664626598 665058315 665500045 665737450 665808976 665874183
3960.9F65874183K10643L58105L33070K37525J83105J07527J23620L03984L43502K29895
$$ 665874183 666084826 666442931 666776001 667013526 667196631 667304158 667427778 667731762 668075264 668305159
3981.3F68305159J86979J46807J01626J61409K06292J61349J86742K68638
$$ 668305159 668492138 668638945 668740571 668901980 669108272 669269621 669456363 669725001
3997.6F69725001
$$ 669725001
##END=$$ End of the data block
