##TITLE=$$ Begin of the data block
##JCAMP-DX=5.00 $$ ACD/SpecManager v 10.08
##SPECTROMETER/DATA SYSTEM=Alpha
##DATE=23 Dec 2014 10:50:12
##DATA TYPE=INFRARED SPECTRUM
##DATA CLASS=XYDATA
##ORIGIN=
##OWNER=
##NPOINTS=1765
##FIRSTX=399.76428223
##LASTX=3997.64306641
##MAXX=3997.64306641
##MINX=399.76428223
##MAXY=0.82971781
##MINY=0.19416745
##XFACTOR=1.0000000000
##YFACTOR=1.000000000000000e-9
##FIRSTY=0.51435506
##DELTAX=2.03961372
##XUNITS=1/CM
##YUNITS=ARBITRARY UNITS
##XYDATA=(X++(Y..Y))
399.8E14355063q193373p777125l311008K514481M351080Q80301k435744j006842L284395
418.1E02661228L658891j926482o097078n697280j659453N68777j977593n873352n644858
436.5D78012800j78396N507588O560534L366470J215965K651185N180508M961610R95695
454.8E08273959l199339l485322k74598Q47458k064228n784750o060510k910346m45605
473.2D84896719j592457m291922m770040j840502J796752K346098o15894l164620k173155
491.5D70590979O34700J171440j404226m309893m516959k066761m58092k010285n086214
509.9D52544689o312609m641383k548844k894282n133897o092877m084438m51535J543850
528.3D21928674O66857p00742J91003L739714P289678P637829M789770J864105J234919
$$ y = [514355063, 506161690, 498384565, 495073557, 497588038, 501939118, 502819419, 500383675, 499376833, 502661228, 506320119, 504393637, 498296559, 492599279, 490939826, 491508603, 489531010, 483657658, 478012800, 477834404, 483341992, 489902526, 493268996, 494484961, 497136146, 502316654, 507278264, 508273959, 505074620, 501589298, 501314700, 502162158, 500097930, 494313180, 488252670, 485342324, 484896719, 483304262, 479012340, 474242300, 472401798, 474198550, 476544648, 475928754, 472764134, 470590979, 471225679, 472397119, 470992893, 466683000, 462166041, 460099280, 459641188, 457630903, 452544689, 446232080, 441590697, 439041853, 436147571, 431013674, 424920797, 420836359, 420384824, 421928674, 422595531, 421894789, 422085792, 425825506, 433115184, 440753013, 445542783, 447406888, 448641807]
546.6D48641807J950204J326174j419008m201055m707485l431052k992392m827976
562.9D30339217p532298q768529p629335n114377k913713j515090K6613K962679O733209
581.3D06588376Q958965Q281708N845427L951908L756552L722013K071768m65125j958281
599.6D40753311j216620O47813J252979J71184p52538Q1718K238870L795296L604054
618D50576067K551436K445907L913522N521982N273670L189207J315653J337319K725661
636.4D78850424L352702K136826L03925r0331J279622K657861K351880P06136l43323
654.7D91205722L90619J942009K276420J061202K20626R97961K291321J999498J485169
673.1E03870547P91192M21226J496375K949535K871096J133144l79860l18170N84662
$$ y = [448641807, 450592011, 451918185, 450499177, 446298122, 441590637, 438159585, 435167193, 430339217, 422806919, 414038390, 406409055, 401294678, 398380965, 396865875, 396892488, 399855167, 406588376, 415547341, 423829049, 429674476, 433626384, 437382936, 441104949, 443176717, 442711592, 440753311, 439536691, 440184504, 441437483, 441608667, 440856129, 440937847, 443176717, 446972013, 450576067, 453127503, 455573410, 459486932, 465008914, 470282584, 473471791, 474787444, 476124763, 478850424, 482203126, 484339952, 484643877, 484553546, 485833168, 488491029, 490842909, 491549045, 491205722, 491596341, 493538350, 495814770, 496875972, 497096598, 498094559, 500385880, 502385378, 503870547, 504661739, 505082965, 506579340, 509528875, 512399971, 513533115, 513153255, 512835085, 513419747]
691.4E13419747N36085j084865l125965m040659l401518k262532j891524j981735j192421
709.8D94974613R09925L407031M998237N239606N040705N509973O700754P550478O875932
728.1E41207254N028725L723740L798068M226625L540277J627267k68817j122594j435876
746.5E60324669k261281l847659n461097o091058n455613m361331l714204l299117
762.8E25833309k097011M82261L834665O573737P944524Q602321R392917J0061860
779.1E70628583R712577Q080423O017447M665136M500687M842520M676342M044950
795.4F17168665L862917M490078N170166M910171L654361K376080J955032K217531
811.8F45805001K177000J345635J80065n03957n92708q95501k003371l613234m918218
$$ y = [513419747, 513955832, 512870967, 509745002, 505704343, 502302825, 500040293, 498148769, 496167034, 494974613, 495884538, 499291569, 504289806, 509529412, 514570117, 520080090, 526780844, 534331322, 541207254, 546235979, 549959719, 553757787, 557984412, 561524689, 563151956, 562883139, 561760545, 560324669, 558063388, 554215729, 548754632, 542663574, 537207961, 532846630, 529132426, 525833309, 523736298, 524218559, 528053224, 534626961, 542571485, 551173806, 560566723, 570628583, 580341160, 588421583, 594439030, 599104166, 603604853, 608447373, 613123715, 617168665, 621031582, 625521660, 630691826, 635601997, 639256358, 641632438, 643587470, 645805001, 647982001, 649327636, 649507701, 649003744, 648411036, 647515535, 645512164, 641898930, 636980712]
830.1F36980712n483269n611837n794883o087005o078005n394339m344106l663600
846.4E94523668l720522m132747m408777m613221m858255m585505k578556J747370
862.8E67373455P029175J1080146J3047159J3229012J2031019R902001P092773L596604
879.1F44381344k63571l587544n555213o227136o412267o706119o900847o480813n598485
897.4E96649349n025804n310357o314576p426381q212387q839548r825528j1132001
913.7E34562767j1884928j1285901r353280o766767m407137k681822j210123L73959
930.1D87346768J931489L074020L706455M331440N353928O162464N149007J429617
946.4E18485188l660380q065105j1107981j3324201j5280008j6926617j7958373j8477201
$$ y = [636980712, 631497443, 625885606, 620090723, 614003718, 607925713, 602531374, 598187268, 594523668, 590803146, 586670399, 582261622, 577648401, 572790146, 568204641, 565626085, 567373455, 574402630, 585482776, 598529935, 611758947, 623789966, 633691967, 640784740, 644381344, 644117773, 640530229, 634975016, 628747880, 622335613, 615629494, 608728647, 602247834, 596649349, 591623545, 586313188, 579998612, 572572231, 564359844, 555520296, 545694768, 534562767, 522677839, 511391938, 502038658, 495271891, 490864754, 488182932, 486972809, 487346768, 489278257, 492352277, 496058732, 500390172, 505744100, 511906564, 517055571, 518485188, 514824808, 506759703, 495651722, 482327521, 467047513, 450120896, 432162523, 413685322]
962.7D13685322j8949181j9675314k0489663k0980984k0933509k0429731j9540101
977B72686839j8213868j6301036j3749212j0818839p920548n437360l478854j923055
993.3A94844067o76617K69294Q85710J099527R07913M63843p60l59133n79923m97326
1013.7A96356595m8355O65576J503497K282426K869740L290891L602922L784195L772631
1032B18080118L398091K575561J542539P82460N70193P84725J103460J484141K314523
1050.4B32635811L798604N558550P010818Q075461R085059J0166198J0613352Q743316
1066.7B95687169L200859m618734j0519952j1397392q223295m115253r04233J346737
1083B60455906L120572M625559N823999O579876O696999O177008N166978L830284K347052
$$ y = [413685322, 394736141, 375060827, 354571164, 333590180, 312656671, 292226940, 272686839, 254472971, 238171935, 224422723, 213603884, 205683336, 200245976, 196767122, 194844067, 194167450, 194436744, 195322454, 196421981, 197329894, 197793737, 197792977, 197433844, 196853921, 196356595, 196308240, 196973816, 198477313, 200759739, 203629479, 206920370, 210523292, 214307487, 218080118, 221478209, 224053770, 225596309, 226378769, 226948962, 227733687, 228837147, 230321288, 232635811, 236434415, 241992965, 249003783, 257079244, 266164303, 276330501, 286943853, 295687169, 298888028, 294269294, 283749342, 272351950, 264128655, 260013402, 259109169, 260455906, 263576478, 268202037, 274026036, 280605912, 287302911, 293479919, 298646897, 302477181, 304824233]
1101.4C04824233J106918P52151J613110L158868M427343M798174M270882L375262
1117.7C28326941K712279K412617K289594K429932L073633M131883M869729M239679
1134C54486287J781821j860380n316228p506043q329510q383900q010000p095009n521357
1152.4C04245681l485293j501739P9662J465857L131896N339116P966757J0449499
1168.7C27691436J2259275J3417869J4334113J5223235J5820026J5633017J4533013
1183D28911984J3078004J1845291J0716319R016275O464869L830284K258181K046824
1199.3D88168031K394438K381086K008438K159745L382623N071282O047607N667865
1215.6E17281115M421473L368198K846361K129256N85735j330137k500355k382458
$$ y = [304824233, 305931151, 306683302, 308296412, 311455280, 315882623, 320680797, 324951679, 328326941, 331039220, 333451837, 335741431, 338171363, 341244996, 345376879, 350246608, 354486287, 356268108, 354407728, 349091500, 341585457, 333255947, 324872047, 316862047, 309767038, 304245681, 300760388, 299258649, 299338311, 300804168, 303936064, 309275180, 317241937, 327691436, 339950711, 353368580, 367702693, 382925928, 398745954, 414378971, 428911984, 441989988, 453835279, 464551598, 473567873, 480032742, 483863026, 486121207, 488168031, 490562469, 492943555, 494951993, 497111738, 500494361, 505565643, 511613250, 517281115, 521702588, 525070786, 527917147, 530046403, 530632138, 529302001, 526801646, 524419188]
1231.9E24419188j632213j327396j771390k192140j598954j6689J479387J967430J633406
1250.3E20960629J452267J926720K473772K211928J124025K47061N71310J910627K991855
1268.6E35870194K733887J447975M10319K90870M93944J08838q70168j547575j282990
1287E37655294m90546k08378r86695k238334k822399k334773j567364j506925k223074
1305.4E23276806k816796k402783j302659o95587j127719k027095k480745k341032
1321.7E08082390k547503l823697n633831o669164o199956m724562l301233k513886
1338D72668558k022773j065373K12818J053721Q91835j10269r72092j079113p00533
1356.4D68876779n31524j025737j857310j798183q07077J4335L90679L49343K60889
$$ y = [524419188, 522786975, 521459579, 519688189, 517496049, 515897095, 515880406, 517359793, 519327223, 520960629, 522412896, 524339616, 526813388, 529025316, 530149341, 530396402, 530967712, 532878339, 535870194, 538604081, 540052056, 540462375, 540753245, 541247189, 541356027, 540485859, 538938284, 537655294, 537164748, 536956370, 535969675, 533731341, 530908942, 528574169, 527006805, 525499880, 523276806, 520460010, 518057227, 516754568, 516058981, 514931262, 512904167, 510423422, 508082390, 505534887, 501711190, 496077359, 489408195, 483208239, 478483677, 475182444, 472668558, 470645785, 469580412, 469793230, 470846951, 471738786, 471628517, 470656425, 469577312, 468876779, 468345255, 467319518, 465462208, 463664025, 462856948, 462871283, 463261962, 463611305, 463872194]
1374.7D63872194O69927J312732J622111J719087K176881L256619M131019L878713
1391D82639283K735734Q63939p46965j293868j042247j012742j916379k747267k787054
1409.4D74692434k312034j549363j052142j418233j897275p38293P37667J398325J452416
1427.7D69313502J240492J409412K122283K897739K943635K120644J646668J609265
1444.1D85303640J671583J122206r3698j006246j235396j682817j766503n9039J154542
1462.4D83408272K163023L831178N705088P946998J0843277J0949195R271443Q839130
1478.7E42957604R046316Q800507P479548O493092O554126O761730N863249N029560
1495E98985732M428684L682494L687442M000902M266977L686846K129495K161205K963304
$$ y = [463872194, 464542121, 465854853, 467476964, 469196051, 471372932, 474629551, 478760570, 482639283, 485375017, 486238956, 485491991, 484198123, 483155876, 482143134, 480226755, 477479488, 474692434, 472380400, 470831037, 469778895, 468360662, 466463387, 465725094, 466462761, 467861086, 469313502, 470553994, 471963406, 474085689, 476983428, 479927063, 482047707, 483694375, 485303640, 486975223, 488097429, 488003731, 486997485, 485762089, 484079272, 482312769, 482253730, 483408272, 485571295, 489402473, 495107561, 503054559, 513897836, 524847031, 534118474, 542957604, 552003920, 560804427, 568283975, 574777067, 581331193, 588092923, 593956172, 598985732, 603414416, 607096910, 610784352, 614785254, 619052231, 622739077, 624868572, 627029777, 629993081]
1513.4F29993081L409028L162563K282679J714885J981616K458692K243638J409829
1529.7F48656011Q31604P26878J365781J879037J162946o82175q18074L338N82277
1548.1F53707623L63768m44532r77814p40111j107395k418100j794041j962602k287566
1566.4F42339230k109647k089977j622141k098739l874719l256977j620948j428306
1582.8F24237776j990974k608538k644956k080798j572549j819671k578437l086209
1599.1F05855644l082216k767265k735078l373683m276991m307448l429533l393530
1615.4E78489900m441142l717363l063679l511727k954841k351820k407253j941264
1631.7E54100811j522958j795709j102805o6698K40207M62174Q59559J658082K260327
$$ y = [629993081, 633402109, 636564672, 638847351, 640562236, 642543852, 645002544, 647246182, 648656011, 649487615, 650214493, 651580274, 653459311, 654622257, 653940082, 653122008, 653125346, 653707623, 654071391, 653626859, 652649045, 651908934, 650801539, 648383439, 646589398, 644626796, 642339230, 640229583, 638139606, 636517465, 634418726, 630544007, 627287030, 625666082, 624237776, 622246802, 619638264, 616993308, 614912510, 613339961, 611520290, 608941853, 605855644, 602773428, 600006163, 597271085, 593897402, 589620411, 585312963, 581883430, 578489900, 574048758, 570331395, 567267716, 563755989, 560801148, 558449328, 556042075, 554100811, 552577853, 550782144, 549679339, 549612641, 549852848, 550315022, 551174581, 552832663, 555092990]
1650.1E55092990K370239K185702K345085L106654M004598M601180M433274L958345
1666.4E82098067M459023N494237N414069N354822N345702M968822N166471O148398
1682.7F24449611P326483N784214M514754M839182N030930N560815N572260M215478
1699F67293727L429413L176511L264308L130376K346516J896143K051711K514124K723515
1717.4F91826344K096951J451075J334369J783848K370417K598107K151966J207947
1733.7G06821024J001001J810908K408326K336502K008796K086579K654553L389835
1750G24517524L588677L005802K529681K541423K921820L296196K877832K113759J704276
1768.4G49096990J855015K270162K072931J396537R38952R23633J339376J710236J583457
$$ y = [555092990, 557463229, 559648931, 561994016, 565100670, 569105268, 573706448, 578139722, 582098067, 586557090, 592051327, 597465396, 602820218, 608165920, 613134742, 618301213, 624449611, 631776094, 637560308, 642075062, 646914244, 651945174, 657505989, 663078249, 667293727, 670723140, 673899651, 677163959, 680294335, 682640851, 684536994, 686588705, 689102829, 691826344, 693923295, 695374370, 696708739, 698492587, 700863004, 703461111, 705613077, 706821024, 707822025, 709632933, 712041259, 714377761, 716386557, 718473136, 721127689, 724517524, 728106201, 731112003, 733641684, 736183107, 739104927, 742401123, 745278955, 747392714, 749096990, 750952005, 753222167, 755295098, 756691635, 757630587, 758554220, 759893596, 761603832, 763187289]
1786.7G63187289J143098P66993Q39173J327038J499236J073599M60922M32969J004278
1805.1G71734595J463294J269043O12080K77996O07908J123845J283884R17375L78848
1823.4G79668868K55405P41482J112044Q20339L09884O2466K95580Q35478J001775
1841.8G85103321L90709k70367j16706L92973P79093O42240J13487j92404Q1122O10054
1862.2G87533522Q48293N34296j44541l35634K58267P61509O94573K37524q3208J62304
1882.6G90466905P21216R36150N18680o3598j11818L03208O84142O00756J47879j88649
1903G94014871k5332M23134N60224J85906k41875k25246J99258O00100M86016L517
1923.4G95980573k69175o3240L65734N74052K94387j71899k62678J24752N30005M80711
$$ y = [763187289, 764330387, 765097380, 765936553, 767263591, 768762827, 769836426, 770297348, 770730317, 771734595, 773197889, 774466932, 775079012, 775357008, 775964916, 777088761, 778372645, 779290020, 779668868, 779924273, 780665755, 781777799, 782598138, 782908022, 782970488, 783266068, 784101546, 785103321, 785494030, 785223663, 785106957, 785499930, 786279023, 786921263, 787034750, 786842346, 786923468, 787533522, 788381815, 788916111, 788771570, 788435936, 788694203, 789455712, 790150285, 790387809, 790304601, 790466905, 791188121, 792124271, 792642951, 792579353, 792467535, 792770743, 793454885, 794055641, 794203520, 794014871, 793989539, 794412673, 794972897, 795158803, 794916928, 794691682, 794890940, 795491040, 795977056, 795980573, 795711398, 795648158, 796013892, 796587944, 796882331, 796710432, 796447754, 796572506, 797102511, 797583222]
1943.8G97583222P7010k09332m2140M19974O36637L78788n5611j71781J81258N94139
1964.2G99392164N41627R0420k03192m6432L19719M80175K69831j24395k31862J05202
1984.6H00593257M44889L94046J5021l23236k27392J82152M00066J56820k92957m47154
2005H00895512j99735O8188J3530k97189n95152o13988l80695k77876n59986q68797
2025.4G97183812o12378j20283N9486p0811m21464p12872o36577k74360p212r5129
2045.8G94292212m05789n27203k63333J13427K17319j4305k60413j77503J62125L52442
2066.2G93488979K20478n7876k02060n6148K09988K63333N2154j52469j07348J54972
2086.6G93814003L34502K73943O4611q9049K8252L29554M44293K15769n6326m4942
$$ y = [797583222, 797660232, 797450900, 797408760, 797828734, 798465371, 798844159, 798788548, 798616767, 798798025, 799392164, 799933791, 800024211, 799821019, 799774587, 800094306, 800574481, 800844312, 800719917, 800488055, 800593257, 801038146, 801432192, 801447213, 801123977, 800896585, 801078737, 801478803, 801635623, 801342666, 800895512, 800695777, 800763965, 800777495, 800480306, 799885154, 799271166, 798890471, 798612595, 798052609, 797183812, 796571434, 796451151, 796510637, 796439826, 796018362, 795305490, 794668913, 794394553, 794387341, 794292212, 793886423, 793359220, 793095887, 793209314, 793426633, 793412328, 793151915, 792974412, 793136537, 793488979, 793709457, 793651581, 793449521, 793393373, 793603361, 793866694, 793918848, 793766379, 793659031, 793814003, 794148505, 794422448, 794487059, 794398010, 794426262, 794755816, 795200109, 795415878, 795359552, 795314610]
2106.9G95314610J76609L10242K17378Q523j04367j4544J92106K49624M3452j72556
2127.3G96221077j37686R7990K51174J49846p3433j62006m3153J47581K03311O6817
2147.7G96721518q3625o7890J41919L42488L29196J68682R9420K17557M16339N44846
2168.1G98830450N36084M51207M25339N47528O73592O31630M68016L46959M03642N68569
2188.5H03883016O17683M95434L51369L11494L92079M95732N15223M34220L55661L71754
2208.9H08223665M54068N39303N36501M25339L18944L20614M00066M68552M19438K62320
2229.3H12368810K03073K84612L40283L23296K64346J91272K02894K88785L19302K54988
2249.7H15041661J76788J61528J98186K82943L38197K66254J73449J81079K60294L49581
$$ y = [795314610, 795491219, 795801461, 796018839, 796027362, 795922995, 795908451, 796100557, 796350181, 796393633, 796221077, 796083391, 796181381, 796432555, 796582401, 796508968, 796346962, 796303809, 796451390, 796654701, 796721518, 796637893, 796570003, 796711922, 797054410, 797383606, 797552288, 797651708, 797869265, 798285604, 798830450, 799366534, 799817741, 800243080, 800790608, 801464200, 802095830, 802563846, 802910805, 803314447, 803883016, 804500699, 804996133, 805347502, 805658996, 806051075, 806546807, 807062030, 807496250, 807851911, 808223665, 808677733, 809217036, 809753537, 810178876, 810497820, 810818434, 811218500, 811687052, 812106490, 812368810, 812571883, 812856495, 813196778, 813520074, 813784420, 813975692, 814178586, 814467371, 814786673, 815041661, 815218449, 815379977, 815578163, 815861106, 816199303, 816465557, 816639006, 816820085, 817080379, 817429960]
2270.1H17429960L47018K00510Q9586J55330K74956L28183L10779K29001J99198K60175
2290.5H19824696K86281K79665K61426K05278J85013L20077N23388N45442M16100L51012
2310.9H23198378L80874M98175O53804O62327M89175L31938L85404N55515N33819J59085
2331.3H27848494j97768j28269J26242J64211j02281o99819j442790j119375K07424
2349.7H24656069J294315J518905J175881Q02457K70188l85463r89020j444757j622021
2368H25276554j456917j232326j232445j339853j329303j122295p95782n13494m26471
2386.4H15827668n04196m96268k53976j9192n0783k69592m55380m30047k42830j51157
2406.8H12954247l04401n34713n91874m68254l40879l74258n63443p06195o40274m57346
$$ y = [817429960, 817776978, 817977488, 818067074, 818222404, 818497360, 818825543, 819136322, 819365323, 819564521, 819824696, 820110977, 820390642, 820652068, 820857346, 821042359, 821362436, 821885824, 822431266, 822847366, 823198378, 823579252, 824077427, 824731231, 825393558, 825882733, 826214671, 826600075, 827155590, 827689409, 827848494, 827650726, 827522457, 827648699, 827812910, 827710629, 827010810, 825568020, 824448645, 824656069, 825950384, 827469289, 828645170, 829447627, 829717815, 829332352, 828343332, 826898575, 825276554, 823819637, 822587311, 821354866, 820015013, 818685710, 817563415, 816767633, 816254139, 815827668, 815323472, 814827204, 814573228, 814554036, 814503253, 814233661, 813778281, 813348234, 813105404, 812954247, 812649846, 812115133, 811523259, 811055005, 810714126, 810339868, 809776425, 809070230, 808429956, 807972610]
2427.2H07972610l86000n53965p91967q23856o40273m66823n00381p04766q63313q00312
2447.6H01440954n72443m45246n97537q32558q49247o40511m02510l67701n96166q17478
2467.9G95319557p25150m34637l19123n08249p79390q09670n67615l28541l33130n27322
2488.3G89986730o31571n12064k95043j96814l34025n50389n79715l60250j32740j57714
2508.7G86236405l74257n50688n30064l28123k04921l86417o89983p59661n46873l39031
2529.1G81526387m11749p11084r20057q23498n62846m81010o97672r55939r48489o89149
2549.5G74324894m49836m68493p37190r49502q53777n81264m51386o11067q71301r08017
2569.9G67443061o62267m32015m88460p26759q41558p17938m87030l69429n09143p37310
$$ y = [807972610, 807586610, 807032645, 806240678, 805416822, 804776549, 804309726, 803809345, 803104579, 802241266, 801440954, 800868511, 800423265, 799825728, 798993170, 798143923, 797503412, 797100902, 796733201, 796137035, 795319557, 794594407, 794159770, 793840647, 793332398, 792553008, 791743338, 791175723, 790847182, 790514052, 789986730, 789355159, 788843095, 788548052, 788351238, 788017213, 787466824, 786887109, 786526859, 786394119, 786236405, 785862148, 785311460, 784781396, 784453273, 784248352, 783861935, 783171952, 782412291, 781865418, 781526387, 781114638, 780403554, 779483497, 778659999, 778097153, 777616143, 776918471, 775962532, 775014043, 774324894, 773875058, 773406565, 772669375, 771719873, 770866096, 770284832, 769833446, 769222379, 768351078, 767443061, 766780794, 766348779, 765860319, 765133560, 764292002, 763574064, 763087034, 762717605, 762208462, 761471152]
2590.3G61471152p32958m63903k38717l10421n55098o80089n83469m41969m90069p37071
2610.7G56237388r75073j010179q60870p26462q19981j126825j336515j255632j064896
2629.1G47060955j044333j258851j480400j459003j259207j147688j237392j409650
2645.4G36764431j482129j357913j159549j114607j259505j427532j414239j192331
2661.7G26356626j011908j083196j285731j349509j162112r16958q88705j071870j218260
2680.1G16368377j143753r52900q60691r40144j112759j206934j130820r82880r63569
2698.4G07073927j159966j393199j406610j217902j071989j106978j267016j363814
2714.7F97086453j265347j067280r70722j064121j202226j165092r54747p64370p82192
$$ y = [761471152, 760738194, 760274291, 760035574, 759725153, 759170055, 758489966, 757906497, 757464528, 756974459, 756237388, 755262315, 754252136, 753391266, 752664804, 751844823, 750717998, 749381483, 748125851, 747060955, 746016622, 744757771, 743277371, 741818368, 740559161, 739411473, 738174081, 736764431, 735282302, 733924389, 732764840, 731650233, 730390728, 728963196, 727548957, 726356626, 725344718, 724261522, 722975791, 721626282, 720464170, 719547212, 718658507, 717586637, 716368377, 715224624, 714271724, 713411033, 712470889, 711358130, 710151196, 709020376, 708037496, 707073927, 705913961, 704520762, 703114152, 701896250, 700824261, 699717283, 698450267, 697086453, 695821106, 694753826, 693783104, 692718983, 691516757, 690351665, 689396918, 688632548, 687850356]
2733.1F87850356r49383j009047q91864p32899o99103q24213r59158r47237p76231
2751.4F80061221o27637o41107p35998p87914p15614n63144n37157o90639q41022q79765
2771.8F73041224q27014p65264q42035j037359j147628j119375j070142j130104j325190
2790.2F63777113j514316j561582j498937j478374j632154j864493j978278j980305
2806.5F50268674j940906j945436k128124k368093k432704k358556k341389k478183
2822.8F32275283k686619k824963k833008k803803k883076l107906l362536l497601
2839.1F08275771l567040l738165m050195m353166m415333m131794l621936l176272
2855.5E77221870l014803l124773l405511l792704m275798m842639n379796n735875
$$ y = [687850356, 686900973, 685891926, 685000062, 684267163, 683568060, 682743847, 681784689, 680837452, 680061221, 679433584, 678792477, 678056479, 677268565, 676552951, 675989807, 675452650, 674762011, 673920989, 673041224, 672214210, 671448946, 670606911, 669569552, 668421924, 667302549, 666232407, 665102303, 663777113, 662262797, 660701215, 659202278, 657723904, 656091750, 654227257, 652248979, 650268674, 648327768, 646382332, 644254208, 641886115, 639453411, 637094855, 634753466, 632275283, 629588664, 626763701, 623930693, 621126890, 618243814, 615135908, 611773372, 608275771, 604708731, 600970566, 596920371, 592567205, 588151872, 584020078, 580398142, 577221870, 574207067, 571082294, 567676783, 563884079, 559608281, 554765642, 549385846, 543649971]
2871.8E43649971n873084n835414n660355n347967m807710m005254l098070k285004
2888.1E06737113j684666j278698r61661p19190o45518p83265j047015j341611j664222
2906.5D96611267j986056k341986k879709l541261m060298m232705m078507l746242
2922.8D69744503l279387k577186j604021m45395Q27103K084643L213823M235536N133241
2941.1D77332860N767495O080389O184071O223053O280541O332576O322205O222725
2957.4E26745915O048859N785048N407154N027831M696369M358172M107893M029810
2973.8E66207051M033506M032850L917635L603280L250062L009498K815604K565563
2990.1E93435049K159238J673758J362979J140595Q05974M25517L7730l05474m92274
$$ y = [543649971, 537776887, 531941473, 526281118, 520933151, 516125441, 512120187, 509022117, 506737113, 505052447, 503773749, 502812088, 502092898, 501447380, 500664115, 499617100, 498275489, 496611267, 494625211, 492283225, 489403516, 485862255, 481801957, 477569252, 473490745, 469744503, 466465116, 463887930, 462283909, 461838514, 462665617, 464750260, 467964083, 472199619, 477332860, 483100355, 489180744, 495364815, 501587868, 507868409, 514200985, 520523190, 526745915, 532794774, 538579822, 543986976, 549014807, 553711176, 558069348, 562177241, 566207051, 570240557, 574273407, 578191042, 581794322, 585044384, 588053882, 590869486, 593435049, 595594287, 597268045, 598631024, 599771619, 600577593, 601003110, 601040840, 600735366, 600243092]
3008.4F00243092o11484q91626j342416j721919j902818j966536j988113k088786k349317
3026.8E85380077k549946k520680k411545k494931k744377k862513k828478k813280
3043.1E64154327k884030l014327l098607l085434l021240k980292l076434l210366
3059.4E39783597l175497l069580l000021l030896l206014l294647l152847k925754
3075.7E14928341k808988k896905l098667l250062l264845l120511k982408l088802
3092.1D90417153l246546l136814k909928k885819l018081l046751k933443k861291
3108.4D66378480k934009k908140k725333k700955k836227k985358l073365k998561
3124.7D43216532k843737k740234k754540k810746k692670k512127k541125k723962
$$ y = [600243092, 599631608, 598739982, 597397566, 595675647, 593772829, 591806293, 589818180, 587729394, 585380077, 582830131, 580309451, 577897906, 575402975, 572658598, 569796085, 566967607, 564154327, 561270297, 558255970, 555157363, 552071929, 549050689, 546070397, 542993963, 539783597, 536608100, 533538520, 530538499, 527507603, 524301589, 521006942, 517854095, 514928341, 512119353, 509222448, 506123781, 502873719, 499608874, 496488363, 493505955, 490417153, 487170607, 484033793, 481123865, 478238046, 475219965, 472173214, 469239771, 466378480, 463444471, 460536331, 457810998, 455110043, 452273816, 449288458, 446215093, 443216532, 440372795, 437632561, 434878021, 432067275, 429374605, 426862478, 424321353, 421597391]
3141D21597391k776116k632975k509445k438337k392143k486348k616167k570778k455414
3159.4C98719668k391517k335310k264738k199739k199322k247989k265334k205700
3175.7C80610019k107501k019912k007335k060295k026975j898020j822442j865029
3192C64802510j925558j923651j863718j770556j710594j704216j688212j652538j597047
3210.3C48966420j511634j483530j523822j558662j541674j450866j370370j371116
3226.7C37154746j367718j242191j090347j184494j396924j393288j258701j169622
3243C27051461j120657j115054j170158j174003j053095r55343r87917j023889r84460
3261.3C17466885r33439q72463p64101o63996p55757r51439r99809r31650q37445q10206
$$ y = [421597391, 418821275, 416188300, 413678855, 411240518, 408848375, 406362027, 403745860, 401175082, 398719668, 396328151, 393992841, 391728103, 389528364, 387329042, 385081053, 382815719, 380610019, 378502518, 376482606, 374475271, 372414976, 370388001, 368489981, 366667539, 364802510, 362876952, 360953301, 359089583, 357319027, 355608433, 353904217, 352216005, 350563467, 348966420, 347454786, 345971256, 344447434, 342888772, 341347098, 339896232, 338525862, 337154746, 335787028, 334544837, 333454490, 332269996, 330873072, 329479784, 328221083, 327051461, 325930804, 324815750, 323645592, 322471589, 321418494, 320463151, 319475234, 318451345, 317466885, 316533446, 315660983, 314896882, 314232886, 313477129, 312525690, 311525881, 310594231, 309756786, 308946580]
3281.7C08946580q31455p98583p28339o17177n77509o91235q07762q71539q32618o40094
3302.1C01550269n12898o36726q68321j015931j014740r07868q56757q58456p85053
3320.5B94093519o90072o95318q42780r69082r33975q59499p53939o28323p06732q86440
3340.9B86127359r10789q83043q11726o55472p29561j028627j096189q56519o52999
3359.2B78502434o94215p69734n82427m21345o54370j008928j037031p74652o24567
3377.6B71935165o66320p16359o64294n11497k65509k9832j41948n19306n93513k37018
3398B67589569O229k97010p04169n73814j95057m1306o4641k03699l17335k18034j16258
3420.4B64864475j37955l2723J98245L16560K53588K76565M08918K66492n8770j13666
$$ y = [308946580, 308115125, 307316542, 306588203, 305971026, 305393517, 304702282, 303894520, 303022981, 302190363, 301550269, 301037371, 300400645, 299532324, 298516393, 297501653, 296593785, 295737028, 294878572, 294093519, 293403447, 292708129, 291865349, 290896267, 289962292, 289102793, 288348854, 287720531, 287013799, 286127359, 285216570, 284333527, 283521801, 282866329, 282136768, 281108141, 280011952, 279155433, 278502434, 277808219, 277038485, 276456058, 276034713, 275380343, 274371415, 273334384, 272559732, 271935165, 271268845, 270552486, 269888192, 269376695, 269111186, 269081354, 268939406, 268420100, 267826587, 267589569, 267595798, 267298788, 266594619, 266020805, 265825748, 265784442, 265719801, 265516102, 265198767, 264980733, 264864475, 264726520, 264693797, 264892042, 265208602, 265462190, 265738755, 266147673, 266414165, 266355395, 266241729]
3440.8B66241729J46777L91155L93510L01003L49641M70192N55098O82234Q07435O57379
3461.2B70996153N58377R05603J124352P66754L08901K89589N86302R50366J008034
3479.6B77494431O78420O27607Q97824Q96186P69466Q63016R77188J043171J064122
3497.9B85311431J057267R91315P84069P19219Q52496J012802J224845J212985R66728
3516.3B94133157R62972J203120J378655J233608R43422R13292J145333J390398J491576
3534.6C04795533J384765J287550J513243J716226J503885J204163J387387J631081
3551C16423833J597643J695663J928329K100826K207458K163172J878023J901984K547651
3569.3C34444582K870292K716809K658219K798855L036201L344357L508329L104985
$$ y = [266241729, 266388506, 266779661, 267173171, 267474174, 267823815, 268294007, 268849105, 269531339, 270338774, 270996153, 271554530, 272460133, 273584485, 274351239, 274660140, 274949729, 275536031, 276486397, 277494431, 278172851, 278800458, 279698282, 280594468, 281363934, 282226950, 283204138, 284247309, 285311431, 286368698, 287360013, 288144082, 288863301, 289715797, 290728599, 291953444, 293166429, 294133157, 295096129, 296299249, 297677904, 298911512, 299854934, 300768226, 301913559, 303303957, 304795533, 306180298, 307467848, 308981091, 310697317, 312201202, 313405365, 314792752, 316423833, 318021476, 319717139, 321645468, 323746294, 325953752, 328116924, 329994947, 331896931, 334444582, 337314874, 340031683, 342689902, 345488757, 348524958, 351869315, 355377644, 358482629]
3585.6C58482629K546907L092318L731698L617972L564388L804534L802538L800422
3601.9C86443406L972233L797620L585994L790856M023850M231781M257321L931493
3618.3D18034554M071950M491479M501789L972888L286690L869146M541695M421085
3634.6D51191276M250348M188925M250795M425287M403323L929972L463358L960431
3650.9D84063715M485339M178941M061013M302353M082799L788769L885210L678143
3667.2E16526282L095567L453076L567338K616882K891481L599763L542841L557682
3683.5E42850912L560781K967835J959860K036154K714396K831578K583384K181709
3699.8E63686609J888454K234698K619743K299249J430094J027763J908779K473355
$$ y = [358482629, 361029536, 364121854, 367853552, 371471524, 375035912, 378840446, 382642984, 386443406, 390415639, 394213259, 397799253, 401590109, 405613959, 409845740, 414103061, 418034554, 422106504, 426597983, 431099772, 435072660, 438359350, 442228496, 446770191, 451191276, 455441624, 459630549, 463881344, 468306631, 472709954, 476639926, 480103284, 484063715, 488549054, 492727995, 496789008, 501091361, 505174160, 508962929, 512848139, 516526282, 519621849, 523074925, 526642263, 529259145, 532150626, 535750389, 539293230, 542850912, 546411693, 549379528, 551339388, 553375542, 556089938, 558921516, 561504900, 563686609, 565575063, 567809761, 570429504, 572728753, 574158847, 575186610, 577095389, 579568744]
3716.2E79568744K255082J851260J549602J386285J504063K007723K133191J542270
3732.5E93798220P53284R01937J880467K123177R52482K4438J378775J645327M40239
3750.8F03898346Q49069J872003J619815R32873J081466J444281J273155J106381Q68261
3769.2F14945650Q54790J318753J498818J189888P20501P39396Q84592Q30174R47296
3787.5F23929858J101613J210690J169264R67801J021623O80387J56045P88689Q25465
3805.9F31851435N45501J180351J469255Q92937M09901Q25226L87729P3730R98199
3824.3F38634264J077652Q58307Q79407Q90374R61066N13136p4148K58803P03156R04024
3844.6F45606041J164794J308143O92070j060069p50124J387715J602769R91702L44872
$$ y = [579568744, 581823826, 583675086, 585224688, 586610973, 588115036, 590122759, 592255950, 593798220, 594551504, 595453441, 597333908, 599457085, 600409567, 600434005, 601812780, 603458107, 603898346, 604747415, 606619418, 608239233, 609172106, 610253572, 611697853, 612971008, 614077389, 614945650, 615800440, 617119193, 618618011, 619807899, 620528400, 621267796, 622152388, 622982562, 623929858, 625031471, 626242161, 627411425, 628379226, 629400849, 630081236, 630237281, 631025970, 631851435, 632396936, 633577287, 635046542, 635939479, 636349380, 637174606, 637562335, 637636065, 638634264, 639711916, 640570223, 641449630, 642340004, 643301070, 643814206, 643740058, 643998861, 644702017, 645606041, 646770835, 648078978, 648771048, 647710979, 646960855, 648348570, 649951339, 650943041, 651287913]
3863F51287913L09050O80805K46405K2948M69029Q05140R92238M98235K76864N74529
3883.4F56163156L04580M65750N51582L8981L88861J001120O76751K3007k07484j18971
3903.8F59287333L38018P84874P16985N57184M55022Q8334j24276K40564M66884K52783
3924.2F63063705K38121M47630L11375R7275K65419M08650L42428K42711J85787L18468
3944.6F65921569L06308N2869R8050L75271M63843K97249J43945J76132K47240L00944
3965F68383420K93731J84298J27494J74344K23398K50935K22505J96337K16723K23696
3985.4F70496881K23696K12789J76668J34587J63377K42352
3997.6F71650350
$$ y = [651287913, 651596963, 652277768, 652524173, 652547121, 653016150, 653821290, 654813528, 655311763, 655588627, 656163156, 656467736, 656933486, 657485068, 657524049, 657912910, 658914030, 659590781, 659613788, 659406304, 659287333, 659625351, 660410225, 661127210, 661684394, 662139416, 662227750, 662103474, 662344038, 662810922, 663063705, 663301826, 663749456, 664060831, 664158106, 664423525, 664832175, 665174603, 665417314, 665603101, 665921569, 666227877, 666280746, 666378796, 666754067, 667217910, 667515159, 667659104, 667835236, 668082476, 668383420, 668677151, 668861449, 668988943, 669163287, 669386685, 669637620, 669860125, 670056462, 670273185, 670496881, 670720577, 670933366, 671110034, 671244621, 671407998, 671650350]
##END=$$ End of the data block
