##TITLE=$$ Begin of the data block
##JCAMP-DX=5.00 $$ ACD/SpecManager v 10.08
##SPECTROMETER/DATA SYSTEM=Alpha
##DATE=23 Dec 2014 10:50:12
##DATA TYPE=INFRARED SPECTRUM
##DATA CLASS=XYDATA
##ORIGIN=
##OWNER=
##NPOINTS=1765
##FIRSTX=399.76428223
##LASTX=3997.64306641
##MAXX=3997.64306641
##MINX=399.76428223
##MAXY=0.83052582
##MINY=0.19400226
##XFACTOR=1.0000000000
##YFACTOR=1.000000000000000e-9
##FIRSTY=0.51169008
##DELTAX=2.03961372
##XUNITS=1/CM
##YUNITS=ARBITRARY UNITS
##XYDATA=(X++(Y..Y))
399.8E11690080p345855p862628l581196K487004M348070J063466j903773o64323L222435
$$ 511690080 504344225 496481597 492900401 495387405 499735475 500798941 498895168 498230845 501453280
418.1E01453280L458798k262711o301344n417108j241893P03574j944304n623311n430311
$$ 501453280 504912078 502649367 496348023 490930915 489689022 490392596 488448292 482824981 477394670
436.5D77394670l88086N218715O549299L286868R50068K745390N522967N010843Q04186
$$ 477394670 477006584 482225299 488774598 492061466 493011534 495756924 501279891 506290734 507094920
454.8E07094920l465534l579616O2406J257002j927077n841762o290824l089070k78771
$$ 507094920 503629386 500049770 500112176 501369178 499442101 493600339 487309515 484220445 483941674
473.2D83941674j297503m218728m962504j968175J897872K503812n25504l133536k196133
$$ 483941674 482644171 478425443 473462939 471494764 473392636 475896448 475370944 472237408 470041275
491.5D70041275O53088J276136j365662m359901m583806k114594m48406j939207n015343
$$ 470041275 470694363 471970499 470604837 466244936 461661130 459546536 459098130 457158923 452143580
509.9D52143580o311417m764646k679557k852291m989981n962223m140109o78301J514495
$$ 452143580 445832163 441067517 438387960 435535669 430545688 424583465 420443356 419765055 421279550
528.3D21279550Q07017o59377K23428L871739P413328P687509M703760J615882J004726
$$ 421279550 422086567 421427190 421650618 425522357 432935685 440623194 445326954 446942836 447947562
546.6D47947562J914114J363873j426041m178167m611849l296405k901018m792661
$$ 447947562 449861676 451225549 449799508 445621341 441009492 437713087 434812069 430019408
562.9D30019408p532209q768797p570564n020082k886057j646251r1314K973944O709069
$$ 430019408 422487199 413718402 406147838 401127756 398241699 396595448 396504134 399478078 406187147
581.3D06187147Q907199Q266866N883783M153818L924996L610879J920581n27799k011747
$$ 406187147 415094346 423361212 429244995 433398813 437323809 440934688 442855269 442327470 440315723
599.6D40315723j246363O95885J409113L22878o81281Q0109K202749L777951L549159
$$ 440315723 439069360 439765245 441174358 441497236 440815955 440896064 443098813 446876764 450425923
618D50425923K472788K527922M140079N582422N065084K956927J276999J507521K914667
$$ 450425923 452898711 455426633 459566712 465149134 470214218 473171145 474448144 475955665 478870332
636.4D78870332L291875J962513L61711L9250J324147K760201K430201O52730m06593
$$ 478870332 482162207 484124720 484486431 484525681 485849828 488610029 491040230 491692960 491286367
654.7D91286367M42833K006829K272874J060068J70589Q59499K284437K159536J532734
$$ 491286367 491729200 493736029 496008903 497068971 497239560 498099059 500383496 502543032 504075766
673.1E04075766P55787M57286J555026K925754K792835J089334l41475k55167O15000
$$ 504075766 504831553 505288839 506843865 509769619 512562454 513651788 513310313 513055146 513670146
691.4E13670146N93365j052857l228247m132032l374636k216757j872986j991958j289069
$$ 513670146 514263511 513210654 509982407 505850375 502475739 500258982 498385996 496394038 495104969
709.8D95104969Q07404L471345N161911N309582M952490N416870O792724P691861O876230
$$ 495104969 495912373 499383718 504545629 509855211 514807701 520224571 527017295 534709156 541585386
728.1E41585386N002618L775656L861070M261136L558635J625777l21448j155079j375019
$$ 541585386 546588004 550363660 554224730 558485866 562044501 563670278 563348830 562193751 560818732
746.5E60818732k239645l942489n582035o158709n490363m428864l746450l224790
$$ 560818732 558579087 554636598 549054563 542895854 537405491 532976627 529230177 526005387
762.8E26005387j976728N91159L867686O559431Q003771Q656741R341240R983360R663821
$$ 526005387 524028659 524619818 528487504 535046935 543050706 551707447 561048687 571032047 580695868
781.2E80695868Q083879O104351M769146M500151M757106M647851M054666L788530
$$ 580695868 588779747 594884098 599653244 604153395 608910501 613558352 617613018 621401548
797.5F21401548M397273N158186M923165L639043K376198K007723K302051K247393
$$ 621401548 625798821 630957007 635880172 639519215 641895413 643903136 646205187 648452580
813.8F48452580J345217J34230n16415n66602r08970k109349l737390m981101n491316
$$ 648452580 649797797 649932027 649415612 648849010 647940040 645830691 642093301 637112200 631620884
832.2F31620884n592942n819500o215393o203711n379916m257917l640354l747224
$$ 631620884 626027942 620208442 613993049 607789338 602409422 598151505 594511151 590763927
848.5E90763927m141450m367471m540384m840493m619658k571941J787186P046759
$$ 590763927 586622477 582255006 577714622 572874129 568254471 565682530 567469716 574516475
864.8E74516475J1067093J3005614J3188124J2006759R855807P031679L543496l35335
$$ 574516475 585583568 598589182 611777306 623784065 633639872 640671551 644215047 643879712
881.1F43879712l661871n594611o229222o383002o689608o906152o484687n623937
$$ 643879712 640217841 634623230 628394008 622011006 615321398 608415246 601930559 596306622
897.4E96306622n042076n293071o333948p434129q141399q816659r898603j1188328
$$ 596306622 591264546 585971475 579637527 572203398 564061999 555245340 545346737 534158409
913.7E34158409j1872948j1240542r308040o760478m417687k640933j187384L30269
$$ 534158409 522285461 511044919 501736879 494976401 490558714 487917781 486730397 487060666
930.1D87060666J895279L073632L735513M385769N387724O107330N036771J357913
$$ 487060666 488955945 492029577 495765090 500150859 505538583 511645913 516682684 518040597
946.4E18040597l681540q062899j1091143j3327628j5306503j6945392j7970800j8481672
$$ 518040597 514359057 506296158 495205015 481877387 466570884 449625492 431654692 413173020
962.7D13173020j8916696j9644738k0509898k0994991k0906985k0414919j9576996
$$ 413173020 394256324 374611586 354101688 333106697 312199712 291784793 272207797
977B72207797j8242360j6229450j3602644j0700807p889376n472704l519327j920387
$$ 272207797 253965437 237735987 224133343 213432536 205543160 200070456 196551129 194630742
993.3A94630742o28486L25113Q90285J041532Q50767M63113K4959l43248n16623m00305
$$ 194630742 194002256 194327369 195217654 196259186 197109953 197573066 197598025 197254777 196738154 196337849
1013.7A96337849k3067O00487J422882K254888K882511L288835L572524L783643L815904
$$ 196337849 196314782 196915269 198338151 200593039 203475550 206764385 210336909 214120552 217936456
1032B17936456L406197K521798J481548P82087O36578Q34718J094148J468316K330452
$$ 217936456 221342653 223864451 225345999 226128086 226764664 227599382 228693530 230161846 232492298
1050.4B32492298L807932N529314O985471Q070156R064287J0142028J0622472Q772939
$$ 232492298 236300230 241829544 248815015 256885171 265949458 276091486 286713958 295486897
1066.7B95486897L218860m586786j0456324j1365592q251817m160732r29236J370996
$$ 295486897 298705757 294118971 283662647 272297055 264045238 259884506 258955270 260326266
1083B60326266L178627M674673N846738O554276O642789O142020N164743L837764K330571
$$ 260326266 263504893 268179566 274026304 280580580 287223369 293365389 298530132 302367896 304698467
1101.4C04698467J087338P51972J619250L164559M430861M798352M273385L387362
$$ 304698467 305785805 306537777 308157027 311321586 315752447 320550799 324824184 328211546
1117.7C28211546K710670K397508K277940K414584L082902M177898M906743M236401
$$ 328211546 330922216 333319724 335597664 338012248 341095150 345273048 350179791 354416192
1134C54416192J751065j898617n342900p523388q336753q343488p960945p085323n503148
$$ 354416192 356167257 354268640 348925740 341402352 333065599 324722111 316761166 309675843 304172695
1152.4C04172695l431797j441151J19179J448840L059805N292683P981450J0487020
$$ 304172695 300740898 299299747 299418926 300867766 303927571 309220254 317201704 327688724
1168.7C27688724J2284189J3403684J4296472J5220106J5856445J5651673J4517218
$$ 327688724 339972913 353376597 367673069 382893175 398749620 414401293 428918511
1183D28918511J3063073J1855602J0731459R012162O445408L810853K259910K074689
$$ 428918511 441981584 453837186 464568645 473580807 480026215 483837068 486096978 488171667
1199.3D88171667K420693K375782K007961K177686L374785N058885O045043N651236
$$ 488171667 490592360 492968142 494976103 497153789 500528574 505587459 511632502 517283738
1215.6E17283738M411757L368377K832353K120257N87702j341939k520860k374470
$$ 517283738 521695495 525063872 527896225 530016482 530604184 529262245 526741385 524366915
1231.9E24366915j579344j296401j797438k206266j573741K3842J500845J941800J591444
$$ 524366915 522787571 521491170 519693732 517487466 515913725 515937567 517438412 519380212 520971656
1250.3E20971656J433194J947641K518296K234340J121461K40684N84185J942575K996087
$$ 520971656 522404850 524352491 526870787 529105127 530226588 530467272 531051457 532994032 535990119
1268.6E35990119K701700J425266M16696K88427M81844J31428q21948j533329j322747
$$ 535990119 538691819 540117085 540533781 540822208 541304052 541435480 540613532 539080203 537757456
1287E37757456n22852k11835r83238k223432k803147k315640j553416j500428k228499
$$ 537757456 537234604 537022769 536039531 533816099 531012952 528697312 527143896 525643468 523414969
1305.4E23414969k832412k400101j280248o92844j153469k050698k497911k349139
$$ 523414969 520582557 518182456 516902208 516209364 515055895 513005197 510507286 508158147
1321.7E08158147k531945l792525n610555o673992o206333m698366l271342k517044
$$ 508158147 505626202 501833677 496223122 489549130 483342797 478644431 475373089 472856045
1338D72856045k052605j073718K47627J074374Q58098j60068r88811j045138o48618
$$ 472856045 470803440 469729722 469977349 471051723 471909821 471749753 470760942 469715804 469067186
1356.4D69067186n12779j046121j887679j808315p97421J4633L62575L15845K47478
$$ 469067186 468554407 467508286 465620607 463812292 463014871 463029504 463392079 463707924 463955402
1374.7D63955402O67215J322597J641601J714468K144397L235221M128694L851146
$$ 463955402 464622617 465945214 467586815 469301283 471445680 474680901 478809595 482660741
1391D82660741K697944Q71808p26819j300633j024336r72867j924634k784938k779871
$$ 482660741 485358685 486230493 485503674 484203041 483178705 482205838 480281204 477496266 474716395
1409.4D74716395k261251j497597j037329j433581j902551p30186P58350J418739J436263
$$ 474716395 472455144 470957547 469920218 468486637 466584086 465853900 466612250 468030989 469467252
1427.7D69467252J212568J413971K135813K896369K935826K115578J660347J640349
$$ 469467252 470679820 472093791 474229604 477125973 480061799 482177377 483837724 485478073
1444.1D85478073J683504J102417j13308r98229j201391j635164j730472n6684J140297
$$ 485478073 487161577 488263994 488150686 487152457 485951066 484315902 482585430 482528746 483669043
1462.4D83669043K155572L845304N711794P935226J0834277J0922491R228349Q823991
$$ 483669043 485824615 489669919 495381713 503316939 514151216 525073707 534302056 543126047
1478.7E43126047R052634Q799076P486880O556630O657243O783664N788684M943669
$$ 543126047 552178681 560977757 568464637 575021267 581678510 588462174 594250858 599194527
1495E99194527M384756L701389L740668M070282M346967L709197K072453K117872K954662
$$ 599194527 603579283 607280672 611021340 615091622 619438589 623147786 625220239 627338111 630292773
1513.4F30292773L432274L180027K279580J741469K010464K451241K241373J417816
$$ 630292773 633725047 636905074 639184654 640926123 642936587 645387828 647629201 649047017
1529.7F49047017Q35657P49588J397073J880706J151502o55711q00609M589N94020
$$ 649047017 649882674 650632262 652029335 653910041 655061543 654405832 653605223 653609812 654203832
1548.1F54203832L46542m94957j004279p42734j109302k414524j784086j941085k274871
$$ 654203832 654550374 654055417 653051138 652308404 651199102 648784578 647000492 645059407 642784536
1566.4F42784536k112627k090991j629173k116025l878951l228843j596749j419485
$$ 642784536 640671909 638580918 636951745 634835720 630956769 627727926 626131177 624711692
1582.8F24711692k000749k641380k663433k073705j570225j846731k628922l098071
$$ 624711692 622710943 620069563 617406130 615332425 613762200 611915469 609286547 606188476
1599.1F06188476l042996k738058k718747l353715m262865m286766l424287l415048
$$ 606188476 603145480 600407422 597688675 594334960 590072095 585785329 582361042 578945994
1615.4E78945994m430174l672421l030062l493130k951563k352834k397298j919151
$$ 578945994 574515820 570843399 567813337 564320207 561368644 559015810 556618512 554699361
1631.7E54699361j497984j766860j086116q1181K26914M87864R36330J709282K246738
$$ 554699361 553201377 551434517 550348401 550267220 550494134 550981998 551918328 553627610 555874348
1650.1E55874348K376556K241731K379417L120363M030645M643082M436553L932953
$$ 555874348 558250904 560492635 562872052 565992415 570023060 574666142 579102695 583035648
1666.4E83035648M490793N587935N441368N310595N309164M962147N161941O140470
$$ 583035648 587526441 593114376 598555744 603866339 609175503 614137650 619299591 625440061
1682.7F25440061P347882N819559M528999M821480M994034N539000N568326M212797
$$ 625440061 632787943 638607502 643136501 647957981 652952015 658491015 664059341 668272138
1699F68272138L433585L187299L259301L100335K305329J855910K032518K528429K754033
$$ 668272138 671705723 674893022 678152323 681252658 683557987 685413897 687446415 689974844 692728877
1717.4F92728877K107024J434565J309872J769304K369284K609730K164841J207471
$$ 692728877 694835901 696270466 697580338 699349642 701718926 704328656 706493497 707700968
1733.7G07700968R92179J805186K421916K333164J946866K034903K676606L445983
$$ 707700968 708693147 710498333 712920249 715253413 717200279 719235182 721911788 725357771
1750G25357771L606021K983392K513587K559006K952397L300369K838492K075971J724481
$$ 725357771 728963792 731947184 734460771 737019777 739972174 743272543 746111035 748187006 749911487
1768.4G49911487J915872K301753K047241J363635R34183R45926J369715J706302J544833
$$ 749911487 751827359 754129112 756176353 757539988 758474171 759420097 760789812 762496114 764040947
1786.7G64040947J129270P93576Q67665J324296J479268J057148M59671M51684J026749
$$ 764040947 765170217 765963793 766831458 768155754 769635022 770692170 771151841 771603525 772630274
1805.1G72630274J478911J275062O02782K68042O19352J143575J274287Q80480L49939
$$ 772630274 774109185 775384247 775987029 776255071 776874423 778017998 779292285 780172765 780522704
1823.4G80522704K46287P41124J125514Q49068L15965M5061L04401Q72492J026750
$$ 780522704 780768991 781510115 782635629 783484697 783800662 783845723 784150124 785022616 786049366
1841.8G86049366M00186k69473j20342L80099P53701O33776J26898j76430J04309O28829
$$ 786049366 786449552 786180079 786059737 786439836 787193537 787827313 787954211 787777781 787882090 788510919
1862.2G88510919Q42929N11884j76728l68893K43426P70867P11381K50339o3955J77085
$$ 788510919 789353848 789865732 789689004 789320111 789563537 790334404 791045785 791296124 791232169 791409254
1882.6G91409254P24614R56297N43713p9036j34348L07500O92308N95212J24812k02417
$$ 791409254 792133868 793090165 793633878 793554842 793420494 793727994 794420302 795015514 795140326 794937909
1903G94937909o616M43697N56290J84416k20179k19762J71661N83589M96507j490k87950
$$ 794937909 794931293 795374990 795931280 796115696 795895517 795675755 795847416 796431005 796927512 796926022 796638072
1925.4G96638072l8505M13775N79834K74539j82986k53320J60218N67376M83334M1128
$$ 796638072 796599567 797013342 797593176 797867715 797684729 797431409 797591627 798159003 798642337 798683465
1945.8G98683465k39015l6895M33147O32584L64840o1751j61946J91808N93364N46396
$$ 798683465 798444450 798407555 798840702 799473286 799838126 799776375 799614429 799806237 800399601 800945997
1966.2H00945997J19508j74344n4538L25679N17846K62320j51337k40445Q2374M43220
$$ 800945997 801065505 800891161 800836623 801162302 801680148 801942468 801791131 801550686 801633060 802076280
1986.6H02076280M33266L8982l30270k27332J95623L97086J34230k99931m29332j84238
$$ 802076280 802509546 802548528 802218258 801990926 802186549 802583635 802717865 802417934 801988602 801804364
2007H01804364Q9049M3154l03567o20424o20067l77417k81930n85735q87394n92768
$$ 801804364 801893413 801936567 801633000 801012576 800392509 800015092 799733162 799147427 798260033 797667265
2027.4G97667265q5175P8320o9916m15683p05540o27756k58565k7835j63138m42743
$$ 797667265 797582090 797660410 797590494 797174811 796469271 795841515 795582950 795555115 795391977 794949234
2047.8G94949234m85123k22146Q9168J89007l875k46703j64390K05219L88384J83046
$$ 794949234 794464111 794241965 794331133 794520140 794516265 794269562 794105172 794310391 794698775 794881821
2068.2G94881821j10865j83105j4127K13146K59817N9545j51515r3639J93894L65973
$$ 794881821 794770956 794587851 794573724 794786870 795046687 795106232 794954717 794861078 795054972 795420945
2088.6G95420945K57373K2113r2387N2094L35217M27961J88112r3341p4565J99497
$$ 795420945 795678318 795700431 795608044 795660138 795995355 796423316 796611428 796518087 796443522 796643019
2109G96643019L76939K71619J0192j42216j4425K43962K75612K3067j80364j23501
$$ 796643019 797019958 797291577 797301769 797159553 797145128 797389090 797664702 797687769 797507405 797383904
2129.4G97383904J05441K52843J45018q7976j77026m8936J28806J84298R1433m4823
$$ 797383904 797489345 797742188 797887206 797799230 797622204 797573268 797702074 797886372 797977805 797932982
2149.8G97932982o6697J16289L45289L62039J98424J25587K54452M37736N11527M99785
$$ 797932982 797866285 797982574 798327863 798689902 798888326 799013913 799268365 799706101 800217628 800717413
2170.2H00717413M52459M12107M93169O42717O73949N17309L53217M02093N74887O20842
$$ 800717413 801169872 801581979 802075148 802717865 803391814 803909123 804262340 804664433 805239320 805860162
2190.6H05860162M81426L24607L24250M45246N18144M99904M21345L38256L62337M90725
$$ 805860162 806341588 806666195 806990445 807435691 807953835 808453739 808875084 809213340 809575677 810066402
2211H10066402N80072N45025M38750L40223L13461L73781M41790L88324K35200J90973
$$ 810066402 810646474 811191499 811630249 811970472 812283933 812657714 813099504 813487828 813723028 813914001
2231.4H13914001L02434L72052L40998K83659K02834J92881K82407L24547K80440K03669
$$ 813914001 814216435 814588487 814929485 815213144 815415978 815608859 815891266 816215813 816496253 816699922
2251.8H16699922J48714J99973L18885L19779K12848J69873K00630K60830L52263L67820
$$ 816699922 816848636 817048609 817367494 817687273 817900121 818069994 818270624 818531454 818883717 819251537
2272.2H19251537K19822P5758J28984K85149L55899L20375K11656J47164K17736L07321
$$ 819251537 819471359 819547117 819676101 819961250 820317149 820637524 820849180 820996344 821214080 821521401
2292.5H21521401L37482K87652J88112J83225L26276M83095M98295L93868L38196L91126
$$ 821521401 821858883 822146535 822334647 822517872 822844148 823327243 823825538 824219406 824557602 824948728
2312.9H24948728N08905O27696O19888M70877K88487K63929M65989N06938J10089k12013
$$ 824948728 825457633 826085329 826705217 827176094 827464581 827728510 828194499 828701437 828811526 828599513
2333.3H28599513j04964O8784J10447n9128o32286j287103r39250K21312J147509J318693
$$ 828599513 828494549 828563333 828673780 828614652 827982366 826695263 825756013 825977325 827124834 828443527
2353.7H28443527J017392P44462L20434k41696r10938j462400j544416j355708j174807
$$ 828443527 829460919 830205381 830525815 830284119 829373181 827910781 826366365 825010657 823835850
2372.1H23835850j135528j244784j286447j087963p55608m99964m41492n19156m77970
$$ 823835850 822700322 821455538 820169091 819081128 818325520 817825556 817384064 816864908 816386938
2390.4H16386938k16961n9n3704k83241m61996m29928k33770j38342l17276n76079
$$ 816386938 816169977 816169918 816116214 815832973 815370977 814941049 814707279 814568937 814251661 813675582
2410.8H13675582o33478m77552l03269l30150n51223p08581o38961m38154l52144n53251
$$ 813675582 813042104 812564552 812261283 811931133 811379910 810671329 810032368 809594214 809242070 808688819
2431.2H08688819q48174q87572o49691m30644m72009p03811q76785q08835n57482m27127
$$ 808688819 807840645 806953073 806303382 805872738 805400729 804696918 803820133 803011298 802453816 802026689
2451.6H02026689o08385q59379q58367n97060l45110l75092o33121q21114p10129m30763
$$ 802026689 801418304 800558925 799700558 799103498 798758388 798383296 797750175 796929061 796218932 795788169
2472G95788169l31938n21541p97391q39174n65648k97487l25322n41329o38664m82678
$$ 795788169 795456231 794934690 794137299 793298125 792732477 792434990 792109668 791568339 790929675 790446997
2492.4G90446997k44260j89722l61621n50389n57542l63469j53125j81138m14670n72622
$$ 790446997 790202737 790013015 789651394 789101005 788543463 788179994 788026869 787845731 787431061 786858439
2512.8G86858439n01871k99453k24054m07338o66917p33435n45382l45648m18901p10428
$$ 786858439 786356568 786057115 785833061 785425723 784758806 784025371 783479989 783134341 782715440 782005012
2533.2G82005012r08136p99239n20825m66526p29799r72808r41157o71208m16696m76420
$$ 782005012 781096876 780297637 779776812 779310286 778580487 777607679 776666522 775995314 775578618 775102198
2553.6G75102198p93218r68874q00192n20766m68016o67751q76367q71777o39498m29631
$$ 775102198 774308980 773340106 772539914 772019148 771551132 770883381 770007014 769135237 768495739 768066108
2574G68066108m97579p65324q89420p12336m48107l71933n30958p04408o63221m29988
$$ 768066108 767568529 766803205 765913785 765201449 764753342 764381409 763850451 763146043 762482822 762052834
2594.4G62052834k51889l40462n81920o96361n91695m30704m52876p10964r97722j044869
$$ 762052834 761800945 761460483 760878563 760182202 759590507 759159803 758706927 757995963 756998241 755953372
2614.8G55953372q49724p10011q51095j160621j338244j240015j041591j030266j262188
$$ 755953372 755103648 754393637 753542542 752381921 751043677 749803662 748762071 747731805 746469617
2633.2G46469617j496971j481712j254677j107514j212597j427472j500308j351953
$$ 746469617 744972646 743490934 742236257 741128743 739916146 738488674 736988366 735636413
2649.5G35636413j157045j126349j266599j413822j380980j167596j015901j107097
$$ 735636413 734479368 733353019 732086420 730672598 729291618 728124022 727108121 726001024
2665.8G26001024j304984j343787j159191r34839q90016j042128j186848j140952r63688
$$ 726001024 724696040 723352253 722193062 721258223 720368207 719326079 718139231 716998279 716034591
2684.1G16034591q53419r35018j139105j222431j093686r53197r92239j201987j397491
$$ 716034591 715181172 714246154 713107049 711884618 710790932 709837735 708845496 707643509 706246018
2702.5G06246018j372993j190483j075089j137793j319170j389265j227916j029729
$$ 706246018 704873025 703682542 702607453 701469660 700150490 698761225 697533309 696503580
2718.8F96503580r90808j082957j172900j128734r43183p93159q41678r93490j010358
$$ 696503580 695512772 694429815 693256915 692128181 691184998 690391839 689550161 688556671 687546313
2737.2F87546313q55267p06375p09951q42929r62019r37462p71939o36637o68288p64370
$$ 687546313 686691046 685984671 685274720 684431791 683469772 682532310 681760371 681123734 680455446 679691076
2757.6F79691076p65800o42479n02944n32508p28488q88586q97765q12053p59960q58426
$$ 679691076 678925276 678282797 677779853 677247345 676518857 675630271 674732506 673920453 673160493 672302067
2778F72302067j057863j147687j092256j027405j077771j290083j535892j624108j545369
$$ 672302067 671244204 670096517 669004261 667976856 666899085 665609002 664073110 662449002 660903633
2796.3F60903633j494944j617849j827598j948357j959920j945316j989484k169669
$$ 660903633 659408689 657790840 655963242 654014885 652054965 650109649 648120165 645950496
2812.6F45950496k362907k385139k321065k352237k501369k693057k845943k869964
$$ 645950496 643587589 641202450 638881385 636529148 634027779 631334722 628488779 625618815
2828.9F25618815k815306k888500l130496l362894l487229l590405l767789m046678
$$ 625618815 622803509 619915009 616784513 613421619 609934390 606343985 602576196 598529518
2845.3E98529518m346967m431129m162907l671050l220380l030002l133833l435433
$$ 598529518 594182551 589751422 585588515 581917465 578697085 575667083 572533250 569097817
2861.6E69097817l829539m295707m832148n359650n738675n888462n879224n741536
$$ 569097817 565268278 560972571 556140423 550780773 545042098 539153636 533274412 527532876
2877.9E27532876n408764m837335m044234l134787k300859j682281j266241r52423
$$ 527532876 522124112 517286777 513242543 510107756 507806897 506124616 504858375 503905952
2894.2E03905952p08342o46174p92384j051843j342147j633913j971483k389610k923727
$$ 503905952 503197610 502551436 501759052 500707209 499365062 497731149 495759666 493370056 490446329
2912.6D90446329l562420m080713m235506m079640l766060l295988k573699j577556
$$ 490446329 486883909 482803196 478567690 474488050 470721990 467426002 464852303 463274747
2928.9D63274747m26203Q06213K070814L242612M258394N114168N749017O090999O194263
$$ 463274747 462848544 463654757 465725571 468968183 473226577 478340745 484089762 490180761 496375024
2947.2D96375024O246567O318569O361008O361723O271958O064296N768836N443692
$$ 496375024 502621591 508940160 515301168 521662891 527934849 533999145 539767981 545211673
2963.6E45211673N118012M754067M387617M144013M052102M037500M055023L972471
$$ 545211673 550329685 555083752 559471369 563615382 567667484 571704984 575760007 579732478
2979.9E79732478L663778L282845L027797K847552K607584K210200J713037J376510
$$ 579732478 583396256 586679101 589706898 592554450 595162034 597372234 599085271 600461781
2996.2F00461781J167774Q60691M64797M4644l02672m90427o13094q73386j307309
$$ 600461781 601629555 602490246 602955043 602999687 602697015 602206588 601593494 600720108 599412799
3014.5E99412799j697838j891613j941622j979291k133072k371609k507031k475559
$$ 599412799 597714961 595823348 593881726 591902435 589769363 587397754 584890723 582415164
3030.9E82415164k406598k532780k798497k860606k780557k807200k916217l029763
$$ 582415164 580008566 577475786 574677289 571816683 569036126 566228926 563312709 560282946
3047.2E60282946l092468l098011l066421l004431l033460l168702l212332l108562
$$ 560282946 557190478 554092467 551026046 548021615 544988155 541819453 538607121 535498559
3063.5E35498559k984344l010154l193558l300666l183723k925396k808869k991616
$$ 535498559 532514215 529504061 526310503 523009837 519826114 516900718 514091849 511100233
3079.8E11100233l202320l237009l208637l128409l028244l104687l244310l172249
$$ 511100233 507897913 504660904 501452267 498323858 495295614 492190927 488946617 485774368
3096.1D85774368k946049k869666l015369l097713k991974k885282k917051k893329
$$ 485774368 482828319 479958653 476943284 473845571 470853597 467968315 465051264 462157935
3112.4D62157935k728284k715706k868861k994925l066450l025800k894253k794206
$$ 462157935 459429651 456713945 453845084 450850159 447783709 444757909 441863656 439069450
3128.8D39069450k787441k826303k733469k545953k518714k693116k813489k715557
$$ 439069450 436282009 433455706 430722237 428176284 425657570 422964454 420150965 417435408
3145.1D17435408k555102k437324k371222k452373k609283k606571k470135k377779
$$ 417435408 414880306 412442982 410071760 407619387 405010104 402403533 399933398 397555619
3161.4C97555619k351015k326638k275586k231657k220601k224177k186060k114803
$$ 397555619 395204604 392877966 390602380 388370723 386150122 383925945 381739885 379625082
3177.7C79625082k078027k060741k041042k035856j990288j904399j870393j895845
$$ 379625082 377547055 375486314 373445272 371409416 369419128 367514729 365644336 363748491
3194C63748491j921863j879036j784116j716316j707643j716286j691669j604825j494349
$$ 363748491 361826628 359947592 358163476 356447160 354739517 353023231 351331562 349726737 348232388
3212.4C48232388j473426j530171j576543j560688j489490j431525j399040j338959
$$ 348232388 346758962 345228791 343652248 342091560 340602070 339170545 337771505 336432546
3228.7C36432546j214206j133263j252383j390785j347363j256704j194924j107514
$$ 336432546 335218340 334085077 332832694 331441909 330094546 328837842 327642918 326535404
3245C26535404j082450j184792j193344j033962r53168j016080j050234r85116r13203
$$ 326535404 325452954 324268162 323074818 322040856 321087688 320071608 319021374 318036258 317123055
3263.4C17123055q99046q34674o68257o90013r29744j032233r50902q54850q36343
$$ 317123055 316224009 315389335 314721078 314031065 313101321 312069088 311118186 310263336 309426993
3281.7C09426993q41081q03620p53402o41346n58973o56902q14826r08643q66502o62059
$$ 309426993 308585912 307782292 307028890 306387544 305828571 305171669 304356843 303448200 302581698 301919639
3302.1C01919639m88520n82873q65430j053661j059145r53525q34882p84517p87377
$$ 301919639 301431119 300848246 299982816 298929155 297870010 296916485 296081603 295297086 294509709
3320.5B94509709p53731o90817p88302r92566r96471q48442p47114o73771p25627r17167
$$ 294509709 293755978 293065161 292276859 291284293 290287822 289439380 288692266 288018495 287292868 286375701
3340.9B86375701r56356q62777p81715o75679p53551j006603j055360q58754o95676
$$ 286375701 285419345 284556568 283774853 283099174 282345623 281339020 280283660 279424906 278729230
3359.2B78729230p20173p70032o17892m66913o53118r88036j015127p68810o38456
$$ 278729230 278009057 277239025 276621133 276154220 275501102 274513066 273497939 272729129 272090673
3377.6B72090673o47366o70284o61909n20408k29448m650j64717n61446o36876k49654
$$ 272090673 271443307 270773023 270111114 269590706 269361258 269356608 269191891 268630445 267993569 267743915
3398B67743915N4390k40148o80238n77926k36780r9629j19030k33531k92301j82987
$$ 267743915 267798305 267558157 266877919 266299993 266063213 265963584 265844554 265611023 265318722 265135735
3418.4B65135735j13100j13040p45J72347K89381K55554K69175M22359K90483p1079
$$ 265135735 265022635 264909595 264908850 265081197 265370578 265626132 265895307 266317666 266608149 266537070
3438.8B66537070j24424J40935L56436L82900L53038M07010M94063N66006O65188P63297
$$ 266537070 266412646 266553581 266910017 267292917 267645955 268052965 268547028 269113034 269778222 270541519
3459.2B70541519O59078N87613Q71449J083613Q01325L18169K35498N61744R66788
$$ 270541519 271200597 271788210 272659659 273743272 274544597 274862766 275098264 275660008 276626796
3477.5B76626796J038342O90729O18726R12487R40651Q07285Q60274R46105R84102
$$ 276626796 277665138 278355867 278974593 279887080 280827731 281635016 282495290 283441395 284425497
3495.9B84425497R90123J039892J042128Q40813P36683Q51780J013279J223505J220763
$$ 284425497 285415620 286455512 287497640 288338453 289075136 289926916 290940195 292163700 293384463
3514.2B93384463R55224R38028J232058J449376J308948J003086R17018J118153J361013
$$ 293384463 294339687 295277715 296509773 297959149 299268097 300271183 301188201 302306354 303667367
3532.6C03667367J471132J403212J323491J563192J797259J569032J202762J325459
$$ 303667367 305138499 306541711 307865202 309428394 311225653 312794685 313997447 315322906
3548.9C15322906J563221J595378J771837K011598K125114K201020K164394J880765
$$ 315322906 316886127 318481505 320253342 322264940 324390054 326591074 328755468 330636233
3565.2C30636233J965582K658338K891958K667665K632380K776473L024310L391773
$$ 330636233 332601815 335260153 338152111 340819776 343452156 346228629 349252939 352644712
3581.5C52644712L556847L167242K698064L215760L727645L578275L572017L829867
$$ 352644712 356201559 359368801 362066865 365282625 369010270 372588545 376160562 379990429
3597.9C79990429L821790L808975L972888L811658L590077L790110M054725M283905
$$ 379990429 383812219 387621194 391594082 395405740 398995817 402785927 406840652 411124557
3614.2D11124557M307091L977746M116684M504681M495621L985494L358662L953547
$$ 411124557 415431648 419409394 423526078 428030759 432526380 436511874 439870536 443824083
3630.5D43824083M525095M355728M283071M316598M288227M354506M378379L992438
$$ 443824083 448349178 452704906 456987977 461304575 465592802 469947308 474325687 478318125
3646.8D78318125L522038L944487M399448M079283M063010M370362M107713L814757
$$ 478318125 481840163 485784650 490184098 494263381 498326391 502696753 506804466 510619223
3663.1E10619223L959060L726721L071665L434480L606140K679169K884269L537774
$$ 510619223 514578283 518305004 521376669 524811149 528417289 531096458 533980727 537518501
3679.4E37518501L514171L550768L521859K973378K064824K079070K681315K811611
$$ 537518501 541032672 544583440 548105299 551078677 553143501 555222571 557903886 560715497
3695.8E60715497K606868K216757J883685K225518K656699K373099J522243J051545
$$ 560715497 563322365 565539122 567422807 569648325 572305024 574678123 576200366 577251911
3712.1E77251911J796901K364815K248883J904488J616299J465559J511872J907646
$$ 577251911 579048812 581413627 583662510 585566998 587183297 588648856 590160728 592068374
3728.4E92068374K032519J528501Q09729R28998J847327K083599J007438J50740J369179
$$ 592068374 594100893 595629394 596439123 597368121 599215448 601299047 602306485 602457225 603826404
3746.7F03826404J553952L87371Q45194J907825J699507J008213J114726J480699J277744
$$ 603826404 605380356 605767727 606612921 608520746 610220253 611228466 612343192 613823891 615101635
3765.1F15101635J016975P58529Q04722J334429J536965J194418P15196P64250R13442
$$ 615101635 616118610 616877139 617681861 619016290 620553255 621747673 622462869 623227119 624140561
3783.5F24140561Q44955R58443J115024J177788J075446R32038J108468P46488J18673
$$ 624140561 624985516 625943959 627058983 628236771 629312217 630244255 631352723 632099211 632217884
3801.8F32217884P73490Q40246N00083J136244J497983R93073N06223Q43823M18007
$$ 632217884 632991374 633831620 634331703 635467947 636965930 637959003 638465226 639309049 639727056
3820.2F39727056Q5712R18090J016617Q55684Q70705Q74757J026333O32047k9981K52664
$$ 639727056 639812768 640730858 641747475 642603159 643473864 644348621 645374954 646007001 645977020 646229684
3840.6F46229684O92428Q99434J179516J303434O92785j038015q56578J250684J572371
$$ 646229684 646922112 647821546 649001062 650304496 650997281 649959266 649102688 650353372 651925743
3858.9F51925743J013815M16994M04656O97613K43068M4226M49896P69496R98139M90904
$$ 651925743 652939558 653356552 653761208 654458821 654701889 654746115 655196011 655965507 656963646 657454550
3879.3F57454550K10464N87344M31598N23328N44668M6611L22163R42468P90417J91629
$$ 657454550 657665014 658252358 658683956 659207284 659751952 659798563 660120726 661063194 661853611 662045240
3899.7F62045240k05278k13444K73168P47263P00355N46992M38630J29223m351L00169
$$ 662045240 661839962 661626518 661899686 662646949 663347304 663894296 664332926 664462149 664457798 664757967
3920.1F64757967M42505K58148K41398L40641K15769J67906L39508L69787K99990K60771
$$ 664757967 665200472 665458620 665700018 666040659 666256428 666424334 666763842 667133629 667433619 667694390
3940.5F67694390K00093K58684K58207J32024K23935L96550L53455J79410J23739J70172
$$ 667694390 667894483 668153167 668411374 668543398 668767333 669163883 669517338 669696748 669820487 669990659
3960.9F69990659K36451L02494K53737J81436J84477J83284J74940K40087K92242K42293
$$ 669990659 670227110 670529604 670783341 670964777 671149254 671332538 671507478 671747565 672039807 672282100
3981.3F72282100J93357K18988K49684K38835J75417J09613J57058K61247
$$ 672282100 672475457 672694445 672944129 673182964 673358381 673467994 673625052 673886299
3997.6F73886299
$$ 673886299
##END=$$ End of the data block
