##TITLE=$$ Begin of the data block
##JCAMP-DX=5.00 $$ ACD/SpecManager v 10.08
##SPECTROMETER/DATA SYSTEM=Alpha
##DATE=23 Dec 2014 10:50:12
##DATA TYPE=INFRARED SPECTRUM
##DATA CLASS=XYDATA
##ORIGIN=
##OWNER=
##NPOINTS=1765
##FIRSTX=399.76428223
##LASTX=3997.64306641
##MAXX=3997.64306641
##MINX=399.76428223
##MAXY=0.84368175
##MINY=0.42346406
##XFACTOR=1.0000000000
##YFACTOR=1.000000000000000e-9
##FIRSTY=0.65615159
##DELTAX=2.03961372
##XUNITS=1/CM
##YUNITS=ARBITRARY UNITS
##XYDATA=(X++(Y..Y))
399.8F56151593k086520p36654j551211j701772N6564K599121L241598J332939j338422
$$ 656151593 654065073 653328419 651777208 650075436 650132000 652731121 655972719 657305658 655967236
418.1F55967236k010286k68579m8637j924157l627658k955854q71897j48415j285911
$$ 655967236 653956950 653688371 653639734 651715577 648087919 645132065 644260168 644111753 642825842
436.5F42825842j741409M32133L763318N022884L123164P34985N53191K008616K341509
$$ 642825842 641084433 641516566 645279884 650302768 653425932 654160917 654714108 656722724 659064233
454.8F59064233K43843k680421k876341q95381O4611j584232l909051l975213j891911
$$ 659064233 659308076 656627655 653751314 652855933 652920544 651336312 647427261 643452048 641560137
473.2F41560137l16083j003862k400040k246380k74777J588225J139104r63151k067387
$$ 641560137 641244054 640240192 637840152 635593772 635318995 636907220 638046324 637083173 635015786
491.5F35015786q00669P20024j09554k359390l296435j850545k40803j083553l553271
$$ 635015786 634215117 634935141 634825587 632466197 629169762 627319217 627078414 625994861 622441590
509.9F22441590m674673l466010j706422j673162l397226m264474k577722L07024J425683
$$ 622441590 617766917 614300907 612594485 610921323 607524097 603259623 600681901 600988925 602414608
528.3F02414608K61128o26147Q54790L893197N528808M342377K229333J585602K199471
$$ 602414608 602675736 602049589 602904379 606797576 612326384 616668761 618898094 620483696 622683167
546.6F22683167J859367m77612k928197l148019j592219r90093k771258n256355n871415
$$ 622683167 624542534 624064922 621136725 617988706 616396487 615406394 612635136 607378781 601507366
565F01507366m577101l553092l717423l601431j839042J335263M341066N459666M801154
$$ 601507366 596930265 593377173 589659750 586058319 584219277 585554540 589895606 595355272 600156426
583.3F00156426M269541M832327N205631L780008R05037r82762n00142J001477J243710
$$ 600156426 604425967 609258294 614463925 618243933 619148970 618166208 617666066 618667543 619911253
601.7F19911253k08318j351893n28931J420140K338469J476824M59254J256943L407359
$$ 619911253 619702935 618351042 617822111 619242251 621580720 623057544 623516798 624773741 628181100
620F28181100M534781L555477J792669J441955K716959L560781K410353L99887j44601
$$ 628181100 632715881 636271358 638064027 639505982 642222941 645783722 648194075 648593962 648449361
638.4F48449361J171589K463877J942575J11819o88613O63102K268195J956344J78277
$$ 648449361 649620950 652084827 654027402 654139221 653450608 654113710 656381905 658338249 658516526
656.8F58516526q38339J37627J822293K223372J199484m40478Q6427J891851K575934
$$ 658516526 657678187 657815814 659638107 661861479 663060963 662620485 662706912 664598763 667174697
675.1F67174697J290262k26379J53303J811386K380847R14693r85562j236916k4796
$$ 667174697 668464959 668238580 668391883 670203269 672584116 673498809 672513247 671276331 671251535
693.5F71251535M96567j008570l166914l615022k028585k79188L4154n83828k92361
$$ 671251535 671748102 670739532 667572618 663957596 661929011 661649823 661683977 661100149 660807788
711.8F60807788J768411M101872M616380L463566K735198L751337N364895N405545
$$ 660807788 662576199 666678071 671294451 674758017 677493215 681244552 686609447 692014992
728.1F92014992L475189J587868J631081K938271L099978J195669j069129j675665
$$ 692014992 695490181 697078049 698709130 701647401 704747379 705943048 704873919 703198254
744.5G03198254q30054o07968k259969m408419m842878l397524j940012j936734k630114
$$ 703198254 702368200 701760232 699500263 695091844 690248966 686851442 684911430 682974696 680344582
762.8F80344582k010107O74486L736675M972338M514158M409075N761683P243871O800592
$$ 680344582 678334475 679008961 682745636 687717974 692232132 696641207 702402890 709646761 716447353
781.2G16447353M501880K543926K571106L830492M123986K643585J141489J658499
$$ 716447353 720949233 723493159 726064265 729894757 734018743 736662328 737803817 739462316
797.5G39462316L641009M509628L018260Q32498L57747J708329K604127J397192p03692
$$ 739462316 743103325 747612953 750631213 751463711 751821458 753529787 756133914 757531106 756827414
815.8G56827414j436710l46423P15256k02656k599835m090607l512263k378524k743363
$$ 756827414 755390704 755044281 755759537 755556881 752957046 748866439 745354176 742975652 740232289
834.2G40232289m455447n338073m161060k229333j602411k653122l723562l257692
$$ 740232289 735776842 730438769 726277709 724048376 722445965 719792843 716069281 712811589
850.5G12811589j871168j484752k743900l856063k291083J954317N935132P298649
$$ 712811589 710940421 709455669 706711769 702855706 700564623 702518940 708454072 715752721
866.8G15752721O829321O692231P291794O997227M542113Q43465j852333k532244k469778
$$ 715752721 722582042 729274273 736566067 743563294 748105407 748948872 747096539 744564295 742094517
885.2G42094517l421426n257011o155967n164445l491282l001571m048467n182206
$$ 742094517 738673091 733416080 727260113 722095668 718604386 715602815 711554348 706372142
901.5G06372142n103886m353166m515171o101370p849514q274615p286310o054163
$$ 706372142 701268256 696915090 692399919 686298549 678449035 670174420 662888110 656833947
917.8F56833947n474627m989088l568351j293421O03080J078784O37353P61032K082288
$$ 656833947 651359320 646370232 642801881 641508460 642111540 643190324 643827677 644588709 646670997
936.2F46670997L650189M031300K883136J020551q30650k828241n532920q749425j1327207
$$ 646670997 650321186 654352486 657235622 658256173 657425523 654597282 649064362 640314937 628987730
954.5F28987730j2360514j2339234j2648344j3897419j5335023j5928865j5657484
$$ 628987730 616627216 604287982 591639638 577742219 562407196 546478331 530820847
968.8E30820847j5408397j5705854j6001016j5293300j3299644j0665983q211970o202370
$$ 530820847 515412450 499706596 483705580 468412280 455112636 444446653 436234683 430032313
985.1D30032313m268706k139717j59830J080721J421929J357376J539052J972169K039700
$$ 430032313 425763607 423623890 423464060 424544781 425966710 427324086 428863138 430835307 432875007
1003.5D32875007J314909K42889l17127j15454L88056O41853P19547J090437J925707
$$ 432875007 434189916 434432805 434115678 434000224 434388280 435030133 435749680 436840117 438765824
1021.8D38765824K871156L304600L070206K724081K762616K902329K485037J423925
$$ 438765824 441636980 444941580 448011786 450735867 453498483 456400812 458885849 460309774
1038.2D60309774M17620J67161O67304J245886J455337J712858K641469M175663N603016
$$ 460309774 460727394 460894555 461561859 462807745 464263082 465975940 468617409 472793072 478396088
1056.5D78396088O422847O876946P494151Q069933P163644L231942k911627p800221
$$ 478396088 484818935 491695881 499190032 507259965 514423609 517655551 514743924 506943703
1072.8E06943703q662224o153345k947808o94394P26909K054870L488541M556030M856169
$$ 506943703 498281479 492128134 489180326 488485932 489212841 491267711 494756252 499312282 504168451
1091.2E04168451M569232M162729L776729L089845J853943N64575J86444J095652K533913
$$ 504168451 508737683 512900412 516677141 519766986 521620929 522185504 522371948 523467600 526001513
1109.6E26001513L366053L232062K739191K526879K482474K171874J551569J240849
$$ 526001513 529367566 532599628 535338819 537865698 540348172 542520046 544071615 545312464
1125.9E45312464J909256L237665L933370L044128R35138j373828l208637m538655
$$ 545312464 547221720 550459385 554392755 557436883 558372021 556998193 553789556 549250901
1142.2E49250901n651057o421268o305695n197107l701806k535344j825213j053095
$$ 549250901 543599844 537178576 530872881 525675774 521973968 519438624 517613411 516560316
1158.5E16560316K39432J940012L528654M686833N738497P200062Q933187J0168313
$$ 516560316 516799748 518739760 522268414 526955247 532693744 539893806 548826993 558995306
1174.8E58995306J0428787J0104358R901702J0022760R935736Q987606P270396N587697
$$ 558995306 569424093 579528451 589430153 599452913 609388649 618376255 625646651 631234348
1191.1F31234348M522323L810823K875388J676619R03845J148403K023279K648473
$$ 631234348 635756671 639567494 642442882 644119501 645023346 646171749 648195028 650843501
1207.5F50843501K701640K682150L171444L945648M131258L218651J727700O72757
$$ 650843501 653545141 656227291 659398735 663344383 667475641 670694292 672421992 673094749
1223.8F73094749L66509K01583m32312j322925j674533j181841m71652l02076o14881
$$ 673094749 673461258 673662841 673230529 671907604 670233071 669051230 668579578 668277502 667662621
1242.1F67662621o12796K28584J355886J802445J394987Q36253Q25942J233339J366735
$$ 667662621 667049825 667278409 668634295 670436740 671831727 672667980 673493922 674727261 676093996
1260.5F76093996Q97109L77536O15299J501143K041101J540601M34220k43485j06334
$$ 676093996 676991105 677368641 677983940 679485083 681526184 683066785 683501005 683257520 683151186
1278.8F83151186K47359P8141n84542j043618q18014l14355l72171j122952j787126
$$ 683151186 683398545 683476686 682892144 681848526 681030512 680716157 680343986 679221034 677433908
1297.2F77433908j657724j013995p26878j122594j642287j558363q85129l87311o16074
$$ 677433908 675776184 674762189 674035311 672912717 671270430 669712067 668826938 668439627 667823553
1315.6F67823553j263916j593948j399100j409530k249360l515900m212737l844738
$$ 667823553 666559637 664965689 663566589 662157059 659907699 656391799 652179062 648334324
1331.9F48334324k885222k142847j907408j654386p67172K75135O79910K62320m63545
$$ 648334324 645449102 643306255 641398847 639744461 638977289 639252424 639932334 640194654 639731109
1350.2F39731109p14660m07040k13742n65112j204371j536131j003444k70665j96397
$$ 639731109 639016449 638609409 638395667 637830555 636626184 635090053 634086609 633815944 633619547
1368.6F33619547m66287m64499M6909O94334P40826J98484Q0168J216292K951205L436387
$$ 633619547 633153260 632688761 632735670 633430004 634170830 634369314 634449482 635665774 638616979 642053366
1389F42053366K324462J052141K27630M8935j26540p07448j369655j717627j310050
$$ 642053366 644377828 645429969 645657599 645706534 645579994 644872546 643502891 641785264 640475214
1407.3F40475214q40545j025200j423597j345218q52704k27213J35184l577l6597N25892
$$ 640475214 639634669 638609469 637185872 635840654 634987950 634760737 634895921 634892344 634855747 635381639
1427.7F35381639J267254J568795J315415R51588J010835J505077J738667J285792
$$ 635381639 636648893 638217688 639533103 640484691 641495526 643000603 644739270 646025062
1444.1F46025062M39167j81258j88887k6822k73943j448751k290010o17504Q95261
$$ 646025062 646464229 646282971 646094084 646067262 645793319 644344568 642054558 641437054 642332315
1462.4F42332315J764536K271116K779424M155517O638110P332086N918265M962980
$$ 642332315 644096851 646367967 649147391 653302908 659941018 667273104 673191369 678154349
1478.7F78154349M884959N246520N124628M638255M071295L620029L333926L490746
$$ 678154349 683039308 688285828 693410456 698048711 702120006 705740035 709073961 712564707
1495G12564707L538012K574146J895785K059401K718508L029585J635611R55522J324236
$$ 712564707 716102719 718676865 720572650 722632051 725350559 728380144 730015755 730971277 732295513
1513.4G32295513J943231K213835J586974P91967P30991J209975J412034R84311M26173
$$ 732295513 734238744 736452579 738039553 738831520 739562511 740772486 742184520 743168831 743595004
1531.8G43595004J94013O69658J152277P57218o15955q25047j83702K95699J06871
$$ 743595004 743789017 744458675 745610952 746368170 745752215 744927168 744743466 745039165 745146036
1550.1G45146036n04494p86721m91739n06401j259505j160443j232028j132250p30157
$$ 745146036 744641542 743854821 743363082 742856681 741597176 740436733 739204705 738072455 737342298
1568.5G37342298o98090p41183j064778j606941j008689l42906o34312j252950j439511
$$ 737342298 736644208 735903025 734838247 733231306 732222617 731879711 731245399 729992449 728552938
1586.8G28552938j066626p45952r49204j575648j987935j808047j520395j661658k200783
$$ 728552938 727486312 726740360 725791156 724215508 722227573 720419526 718899131 717237473 715036690
1605.2G15036690k726555k885818k476573k023816k561808l613710k738476j744151
$$ 715036690 712310135 709424317 706947744 704923928 702362120 698748410 696009934 694265783
1621.5F94265783j863837k065957k330840k314508j357615n22315o86288r37581m98891
$$ 694265783 692401946 690335989 688005149 685690641 684333026 683810711 683124423 682186842 681687951
1639.9F81687951J53482Q77082J393974J378775J118302J476348K469837K370000K094627
$$ 681687951 681841433 682718515 684112489 685491264 686609566 688085914 690555751 692925751 695020378
1658.2F95020378K190470K594233L122151L222346L362417L295720K775669L161728
$$ 695020378 697210848 699805081 702927232 706149578 709511995 712807715 715583384 718745112
1674.5G18745112L868998L608346L152072L178239L904760L726899L267825L072798
$$ 718745112 722614110 726222456 729374528 732552767 736457527 740184426 743452251 746525049
1690.9G46525049K517998K618313L099978K956271K632320J834274J502037J830876
$$ 746525049 749043047 751661360 754761338 757717609 760349929 762184203 763686240 765517116
1707.2G65517116K020657J861334J450061J056850R09090Q89242P39872N00322N76675
$$ 765517116 767537773 769399107 770849168 771906018 772815108 773704350 774444222 774944544 775521219
1725.5G75521219J079082J692236J817763J252412O46174P90060J313090J625061J469970
$$ 775521219 776600301 778292537 780110300 781362712 782008886 782798946 784112036 785737097 787207067
1743.9G87207067J210213J214564J676857K179205J965642J445234J180709J362264
$$ 787207067 788417280 789631844 791308701 793487906 795453548 796898782 798079491 799441755
1760.2G99441755J755237J643479J085222O88195P68006J149833J203120P76827L66688
$$ 799441755 801196992 802840471 803925693 804613888 805381894 806531727 807734847 808511674 808878362
1778.6H08878362L56436P62582J047969Q65817M83393L02017N91815R64403Q28028
$$ 808878362 809234798 809997380 811045349 811911166 812394559 812696576 813288391 814252794 815080822
1796.9H15080822L06725r119L77476R00805R06288M49598O3002K39671P20441Q47042
$$ 815080822 815387547 815378428 815755904 816656709 817562997 818012595 818075597 818315268 819035709 819882751
1817.3H19882751M67836O0320J10865N59330P83920M16041n9903r716L76761O67096
$$ 819882751 820350587 820410907 820521772 821081102 821865022 822281063 822221160 822211444 822588205 823255301
1837.7H23255301N42998J18613k39432k1159M68432M93765J08600k06590m7564L94642
$$ 823255301 823798299 823916912 823677480 823656321 824124753 824618518 824727118 824520528 824472964 824867606
1858.1H24867606N33998J72913j71005r0123K65599M83989K64347j28329j84059K54869
$$ 824867606 825401604 825574517 825403512 825313389 825578988 826062977 826327324 826198995 826014936 826269805
1878.5H26269805O15597M51029K7060j59144O1690M73798N42164R2923k83181r2209
$$ 826269805 826885402 827336431 827363491 827204347 827266037 827739835 828281999 828374922 828091741 827999532
1898.9H27999532L62396M95732J46509k67745k68280J38521M60625L04043j70827k97427
$$ 827999532 828361928 828857660 829004169 828736424 828468144 828606665 829067290 829371333 829200506 828903079
1919.3H28903079J11342M35769K74360j52886l07977J4901L94583L47853j3352k08676
$$ 828903079 829014421 829450190 829724550 829571664 829263687 829278588 829673171 830021024 830007672 829798996
1939.7H29798996k8669L06487L70323M6373k51472j35482K50459M57347K19762j67906
$$ 829798996 829770327 830076814 830447137 830493510 830242038 830106556 830357015 830814362 831034124 830866218
1960.1H30866218j59324K36929M67181K52545j40786k79188j3054L39270L38852k7597
$$ 830866218 830706894 830943823 831411004 831663549 831522763 831243575 831230521 831569791 831908643 831881046
1980.5H31881046k84970q8274K93076L72350L6717l30210k64883J23918L17693P8499
$$ 831881046 831596076 831507802 831800878 832173228 832209945 831879735 831614852 831738770 832056463 832134962
2000.9H32134962k79069l21805k3604K10583K5154l75688n42880l39150p0274j38283
$$ 832134962 831855893 831534088 831510484 831721067 831746221 831370533 830827653 830488503 830418229 830279946
2021.3H30279946n60820p64966k49862L38375K70665k00153n50925m49658m3928J35243
$$ 830279946 829719126 828954160 828704298 829042673 829313338 829113185 828562260 828112602 828068674 828203917
2041.7H28203917j16170m47631m31180n9426K35856J12951k34068l27229n1141K78235
$$ 828203917 828087747 827640116 827208936 827149510 827385366 827498317 827264249 826937020 826885879 827164114
2062.1H27164114L01182n4181l06845o9439L12150L28123k7895l07977j56879K01463
$$ 827164114 827465296 827411115 827104270 827034831 827346981 827675104 827647209 827339232 827182353 827383816
2082.5H27383816K95162O2347j86145j38939J93954M15742K17676j47342k04266J08242
$$ 827383816 827678978 827741325 827555180 827416241 827610195 828025937 828243613 828096271 827892005 828000247
2102.9H28000247L95298K82765q8513k43425O973L29078L00884n7936l11553j59681
$$ 828000247 828395545 828678310 828589797 828346372 828353345 828682423 828983307 828925371 828613818 828454137
2123.3H28454137J66058K48850J1384k68221k05278J93477L80635J02699k54989k52604
$$ 828454137 828620195 828869045 828880429 828612208 828406930 828600407 828981042 829083741 828828752 828576148
2143.7H28576148R0181L30568K08318q6665j87993N3406L57627L42369K1041j72138
$$ 828576148 828666329 828996897 829205215 829118550 828930557 828983963 829341590 829683959 829705000 829532862
2164.1H29532862M5061M01795M99785K64167K1279J40310M40478N03302K60770k265
$$ 829532862 829577923 829979718 830479503 830743670 830764949 830905259 831345737 831849039 832109809 832107544
2184.5H32107544M3452L57568N22614L19063L1233K3723L00169N23507L88682M2021
$$ 832107544 832150996 832508564 833031178 833350241 833381474 833405197 833705366 834228873 834617555 834659576
2204.8H34659576p3373J52350M10199M17053J82748n960J06811L93570M60267J89721
$$ 834659576 834586203 834738553 835148752 835565805 835748553 835742593 835849404 836242974 836703241 836892962
2225.2H36892962q6426m8042K04683L42488J96874p0572q0108K11954L95417K34604
$$ 836892962 836806536 836758494 836963177 837305665 837502539 837431967 837351859 837563813 837959230 838193834
2245.6H38193834o2227j37568Q2851L18765K79546K1219j08242N7221K92241L15905
$$ 838193834 838131607 837994039 838076890 838395655 838675201 838696420 838588178 838645399 838937640 839253545
2266H39253545J05500j09017o4731J94610L05235J12951j07408p6532J65939L47436
$$ 839253545 839359045 839250028 839185297 839379907 839685142 839798093 839690685 839614153 839780092 840127528
2286.4H40127528K64346J9431r0539Q7023L29673K66671l0100j22249J00016L44277
$$ 840127528 840391874 840411305 840320766 840407789 840737462 841004133 840974033 840851784 840951800 841296077
2306.8H41296077L56078J74940K1934M5002K50876M21762K87652J5974J7107K80261
$$ 841296077 841652155 841827095 841849029 841894031 842144907 842566669 842854321 842870295 842887402 843167663
2327.2H43167663L95596J18494k43724l31223j79171J3053j0311l72172p03573l87430
$$ 843167663 843563259 843681753 843438029 843106806 842927635 842940688 842930377 842558205 841854632 841467202
2347.6H41467202K47419O27219N91398L25560J52350N4955j19150m90725q26239p87914
$$ 841467202 841714621 842341840 842933238 843258798 843411148 843466103 843346953 842856228 842029989 841242075
2368H41242075n63800m90189o17027p61211p16925m95851k80380k17378k99156l44336
$$ 841242075 840678275 840188086 839571059 838809848 838092923 837597072 837316692 837099314 836800158 836455822
2388.4H36455822k03848J2875K6762j89721l46899l04878j46806n1558j64509l62277
$$ 836455822 836251974 836264849 836291611 836101890 835754991 835450113 835303307 835251749 835087240 834724963
2408.8H34724963l95418k37286j11699k01285m09245m77851l49760k34484k75433m04001
$$ 834724963 834329545 834092259 833980560 833779275 833370030 832892179 832542419 832307935 832032502 831628501
2429.2H31628501m74691l79264k06292k21431m43280n95808n19812l19004k34068l50594
$$ 831628501 831153810 830774546 830568254 830346823 829903543 829307735 828787923 828468919 828234851 827884257
2449.6H27884257m80235m32372k70247k20180l52681n16414n26786l70741k28405k49147
$$ 827884257 827404022 826971650 826701403 826481223 826128542 825612128 825085342 824714601 824486196 824237049
2470H24237049l81768m42386l40581k00867k00570l36409m48525m08470k66850j95623
$$ 824237049 823855281 823412895 823072314 822871447 822670877 822334468 821885943 821477473 821210623 821015000
2490.4H21015000k43842l14594k97904j84416j02997j64271l01599l47734k52127j41680
$$ 821015000 820771158 820456564 820158660 819974244 819871247 819706976 819405377 819057643 818805516 818663836
2510.8H18663836j33634k22087l13640k99036k20180k16543l15667m12583m18067l64959
$$ 818663836 818530202 818308115 817994475 817695439 817475259 817258716 816943049 816530466 816112399 815747440
2531.2H15747440l26216l57926m45426m64022l75152l12387l74675m96388n30958m28200
$$ 815747440 815421224 815063298 814617872 814153850 813778698 813466311 813091636 812595248 812064290 811636090
2551.6H11636090l07321l12746m09067m68850m50849l62754k82645l41058m90606n15103
$$ 811636090 811328769 811016023 810606956 810138106 809687257 809324503 809041858 808700800 808210194 807695091
2572H07695091l79205k74479l21687m32551m39286l36885k69413k90036l69132m27902
$$ 807695091 807315886 807041407 806719720 806287169 805847883 805510998 805241585 804951549 804582417 804154515
2592.4H04154515l55839k23756j87397k63393l61741l64601k81215k59757l92735n64933
$$ 804154515 803798676 803574920 803387523 803124130 802762389 802397788 802116573 801856816 801464081 800899148
2612.8H00899148n89311n05448m79400n45561o31332o68645o39797n89132o27756p80582
$$ 800899148 800309837 799804389 799324989 798779428 798148096 797479451 796839654 796250522 795622766 794842184
2633.2G94842184q78096q06749o83010o66856p46310q07822p82728o85334o38783p24495
$$ 794842184 793964088 793157339 792474329 791807473 791061163 790253341 789470613 788785279 788146496 787422001
2653.5G87422001q09133p73191o85573o21319o10828o65784o97613o21378n31018n68092
$$ 787422001 786612868 785839677 785154104 784532785 783921957 783256173 782558560 781937182 781406164 780838072
2673.9G80838072o97851p50005o47187n18382n06103n86987o40034n87762n18620n51402
$$ 780838072 780140221 779390216 778743029 778224647 777718544 777131557 776491523 775903761 775385141 774833739
2694.3G74833739o58751p47025p25507o25909n90622o61314p53224p47859o51717n82874
$$ 774833739 774174988 773427963 772702456 772076547 771485925 770824611 770071387 769323528 768671811 768088937
2714.7G68088937o32346p43985p33614o14762n33045n39243o11961o29902n41031m33505
$$ 768088937 767456591 766712606 765978992 765364230 764831185 764291942 763679981 763050079 762509048 762075543
2735.1G62075543l98695m82440n95868n84483m42803l46303m21524n48243n38707m22299
$$ 762075543 761676848 761194408 760598540 760014057 759571254 759224951 758803427 758255184 757716477 757294178
2755.5G57294178l51191l63767m22775m73977m45544l88503m08113m55380m59790m62830
$$ 757294178 756942987 756579220 756156445 755682468 755236924 754848421 754440308 753984928 753525138 753062308
2775.9G53062308m98235n67317o75440p44820o97076o15776o55174q26836r53793r38416
$$ 753062308 752564073 751996756 751321316 750576496 749879420 749263644 748608470 747781634 746827841 745889425
2796.3G45889425q93354r33647j058400j175225j182377j137853j167655j262963j326441
$$ 745889425 744996071 744062424 743004024 741828799 740646422 739508569 738340914 737077951 735751510
2814.7G35751510j334071j350165j391530j459122j570940j666724j689375j670718
$$ 735751510 734417439 733067274 731675744 730216622 728645682 726978958 725289583 723618865
2831G23618865j676798j763463j893997k012909k161443k329349k515555k696395k710104
$$ 723618865 721942067 720178604 718284607 716271698 714110255 711780906 709265351 706568956 703858852
2849.3G03858852k500593k164543j869500j736104j781106j984060k267718k599120
$$ 703858852 701358259 699193716 697324216 695588112 693807006 691822946 689555228 686956108
2865.7F86956108k998770l311216l380836l393948l496885l486276l198146k740264
$$ 686956108 683957338 680646122 677265286 673871338 670374453 666888177 663690031 660949767
2882F60949767k273143j878261j543284j175821p76946m82440m27008n46336o23524
$$ 660949767 658676624 656798363 655255079 654079258 653302312 652819872 652392864 651846528 651223004
2900.3F51223004o55174p61748r60946j252472j602233j958608k288044k524376k643227
$$ 651223004 650567830 649806082 648845136 647592664 645990431 644031823 641743779 639219403 636576176
2918.7F36576176k604842k304137j822591j283586o66261j8477O43015J383066K149820
$$ 636576176 633971334 631667197 629844606 628561020 627894759 627876282 628519297 629902363 632052183
2937F32052183K786875L243506L596127L792405L787458L786445L847539L769755L620685
$$ 632052183 634839058 638082564 641678691 645471096 649258554 653044999 656892538 660662293 664282978
2955.4F64282978L581643L553927L447234L255427L006876K839923K747118K620220
$$ 664282978 667864621 671418548 674865782 678121209 681128085 683968008 686715126 689335346
2971.7F89335346K512634K460241K443672K405345K194822J880288J671195J587749
$$ 689335346 691847980 694308221 696751893 699157238 701352060 703232348 704903543 706491292
2988G06491292J559555J411021J084089Q06689N73099L13938J62720L3677j35362k15233
$$ 706491292 708050847 709461868 710545957 711352646 711925745 712239683 712402403 712436080 712300718 712085485
3008.4G12085485k46107l82602o80566j008690j195550j255393j262009j307368j434863
$$ 712085485 711839378 711456776 710776210 709767520 708571970 707316577 706054568 704747200 703312337
3026.8G03312337j486778j415312j367331j497030j698196j724839j676500j695514
$$ 703312337 701825559 700410247 699042916 697545886 695847690 694122851 692446351 690750837
3043.1F90750837j764834j849889j863361j872062j912296j878560j885712j972497
$$ 690750837 688986003 687136114 685272753 683400691 681488395 679609835 677724123 675751626
3059.4F75751626j986145j899660j759052j784444k030492k135277j959026j678169
$$ 675751626 673765481 671865821 670106769 668322325 666291833 664156556 662197530 660519361
3075.7F60519361j580715j819372k066791k081394k015650j934290j925350k046942
$$ 660519361 658938646 657119274 655052483 652971089 650955439 649021149 647095799 645048857
3092.1F45048857k087176j940787j763165j794159k001524k037406j854897j764417
$$ 645048857 642961681 641020894 639257729 637463570 635462046 633424640 631569743 629805326
3108.4F29805326j866400j870990j694023j629770j744032j963675k167165k110362
$$ 629805326 627938926 626067936 624373913 622744143 621000111 619036436 616869271 614758909
3124.7F14758909j892090j775682j795709j854539j801431j633585j598120j782953
$$ 614758909 612866819 611091137 609295428 607440889 605639458 604005873 602407753 600624800
3141F00624800j894713j820028j712203j550376j424551j582742j841306j856924j727104
$$ 600624800 598730087 596910059 595197856 593647480 592222929 590640187 588798881 586941957 585214853
3159.4E85214853j631260j573860j549542j560688j574457j526415j449287j443446
$$ 585214853 583583593 582009733 580460191 578899503 577325046 575798631 574349344 572905898
3175.7E72905898j509786j525163j448870j371026j337349j367867j431227j425743
$$ 572905898 571396112 569870949 568422079 567051053 565713704 564345837 562914610 561488867
3192E61488867j365364j321673j286686j254141j213193j189470j214326j259088j262248
$$ 561488867 560123503 558801830 557515144 556261003 555047810 553858340 552644014 551384926 550122678
3210.3E50122678j209199j169682j112938j039326j088738j170337j074791r40085
$$ 550122678 548913479 547743797 546630859 545591533 544502795 543332458 542257667 541317582
3226.7E41317582r46641r40800r17553j051605j166105j101137r94742q94010p64846
$$ 541317582 540370941 539430141 538512588 537460983 536294878 535193741 534198999 533304989 532540143
3245E32540143p61867r24408r46761p90774p56920q71181q78394p64191p25329p11739
$$ 532540143 531778276 530853868 529907107 529116333 528359413 527488232 526609838 525845647 525120318 524408579
3265.4E24408579n47409l66211m82261p59781q87274q67069p69139p03275p04705o72043
$$ 524408579 523861170 523494959 523012698 522252917 521365643 520498574 519729435 519026160 518321455 517649412
3285.8E17649412n71072m29630l79563n34296p94291r42588q16584n08427l23951n13018
$$ 517649412 517078340 516648710 516269147 515734851 514940560 513997972 513181388 512672961 512349010 511835992
3306.2E11835992r35137j142621j018643q79288q93474r06229q26835p23243p26223
$$ 511835992 510900855 509758234 508739591 507860303 506966829 506060600 505233765 504510522 503784299
3324.6E03784299r50039j164078j071096q45223p27535p35223q98778j070679j086145
$$ 503784299 502834260 501670182 500599086 499753863 499026328 498291105 497392327 496321648 495235503
3342.9D95235503j063049r99063q97408j010030j229257j236260j096546j013309j062453
$$ 495235503 494172454 493173391 492275983 491265953 490036696 488800436 487703890 486690581 485628128
3361.3D85628128j067012q48949p20293r98884j405269j407296j036286q27163r02266
$$ 485628128 484561116 483712167 482991874 481992990 480587721 479180425 478144139 477316976 476414710
3379.6D76414710j029044r90123p28994m24743k43843m07487q01354p99567l34173
$$ 476414710 475385666 474395543 473666549 473241806 472997963 472590476 471789122 470989555 470655382
3398D70655382j27405n32449r45180p98404m24952k81632l52472n05924n52982l66449
$$ 470655382 470527977 469995528 469050348 468251944 467826992 467545360 467192888 466686964 466133982 465767533
3418.4D65767533k12282k50847k05934K8939K05397J70201J76072K68936J14829j57058
$$ 465767533 465555251 465304404 465098470 465127409 465332806 465503007 465679079 465948015 466062844 465905786
3438.8D65905786j43320J04517L01599L27349K84851L60548M82649N32776O12766P19845
$$ 465905786 465762466 465866983 466168582 466495931 466780782 467141330 467623979 468156755 468769521 469489366
3459.2D69489366O38246O15895R07779J015603O36757K58624L28184O26802Q95977
$$ 469489366 470127612 470743507 471651286 472666889 473303646 473562270 473890454 474517256 475413233
3477.5D75413233R04501O18755O04391Q47877P73280O20664P96228R89944J004219
$$ 475413233 476317734 476936489 477540880 478388757 479162037 479782701 480578929 481568873 482573092
3495.9D82573092R34303Q99642Q83073P41541O66887P73847R56625J180500J117557
$$ 482573092 483507395 484407037 485290110 486031651 486698538 487472385 488429010 489609510 490727067
3514.2D90727067Q32647Q29250J071810J242370J096219Q54104Q71867J015425J151770
$$ 490727067 491559714 492388964 493460774 494703144 495799363 496653467 497525334 498540759 499692529
3532.6D99692529J323611J299977J145542J318932J533448J349986J051009J134812
$$ 499692529 501016140 502316117 503461659 504780591 506314039 507664025 508715034 509849846
3548.9E09849846J287043J227379J283825J518845J754940J802504J590133J379609
$$ 509849846 511136889 512364268 513648093 515166938 516921878 518724382 520314515 521694124
3565.2E21694124J645684K147973K127111J886248J934052K168834K451539K711832
$$ 521694124 523339808 525487781 527614892 529501140 531435192 533604026 536055565 538767397
3581.5E38767397K710224K342045K086043K536118K761066K501726K567590K927601
$$ 538767397 541477621 543819666 545905709 548441827 551202893 553704619 556272209 559199810
3597.9E59199810K970219K908826K919316K698123K571881K821505L065944L163993
$$ 559199810 562170029 565078855 567998171 570696294 573268175 576089680 579155624 582319617
3614.2E82319617K963722K716124L037989L286123L066242K559126K238452K942324
$$ 582319617 585283339 587999463 591037452 594323575 597389817 599948943 602187395 605129719
3630.5F05129719L294170L013432K785384K667904K719403K886951K862989K488375
$$ 605129719 608423889 611437321 614222705 616890609 619610012 622496963 625359952 627848327
3646.8F27848327K290249K778232K897561K565622K707183K880753K475857K192259
$$ 627848327 630138576 632916808 635814369 638379991 641087174 643967927 646443784 648636043
3663.1F48636043K312005K168357J757681K047182K140343J638233J929343K214372
$$ 648636043 650948048 653116405 654874086 656921268 659061611 660699844 662629187 664843559
3679.4F64843559K058447K103626K215565J935720J278818J304745J784921J875818
$$ 664843559 666902006 669005632 671221197 673156917 674435735 675740480 677525401 679401219
3695.8F79401219J683533J342654J091898J317560J555861J335144P70747O03795J287937
$$ 679401219 681084752 682427406 683519304 684836864 686392725 687727869 688498616 689102411 690390348
3714.1F90390348J623631J383901J074016R00030P56085P96377J131475J197637Q73982
$$ 690390348 692013979 693397880 694471896 695371926 696128011 696924388 698055863 699253500 700127482
3732.5G00127482M91679O84261J295329J238465L33667n603J010179R24349K14339
$$ 700127482 700619161 701303422 702598751 703837216 704170883 704165280 705175459 706099808 706314147
3750.8G06314147O88135J185715Q88765O13570Q87573R74000O74247N32449M61638
$$ 706314147 707002282 708187997 709076762 709690332 710577905 711551905 712226152 712758601 713220239
3769.2G13220239N71549Q31723Q46565O90460N02527N11884N57483M93884M82142N39660
$$ 713220239 713791788 714623511 715470076 716160536 716663063 717174947 717732430 718226314 718708456 719248116
3789.6G19248116O62804O67631N36084N01514K09331J21415P06136N57065K94090O74128
$$ 719248116 719910920 720578551 721114635 721616149 721825480 721946895 722653031 723210096 723504186 724178314
3810G24178314P98762M11987J96874M70162J40369J18852P48693P06673M87387L76523
$$ 724178314 724977076 725389063 725585937 726056099 726196468 726315320 727064013 727770686 728258073 728634596
3830.4G28634596L78728N60105L31699j13666Q3149M63009O96242Q05020O77228O7174
$$ 728634596 729013324 729573429 729905128 729791462 729874611 730337620 731033862 731838882 732516110 732583284
3850.8G32583284r84966l00944J110911R79185M05908R596K09689N32687K26200R6798
$$ 732583284 731598318 731297374 732408285 733387470 733793378 733802974 734012663 734545350 734771550 734868348
3871.2G34868348K65419L57509M74870K59578K28763L69489J64866L21568M15444R6559
$$ 734868348 735133767 735491276 735966146 736225724 736454487 736823976 736988842 737310410 737725854 737822413
3891.6G37822413J64867L96550K58743K5571j16766j47164K21551N67973N23567M08828
$$ 737822413 737987280 738383830 738642573 738668144 738551378 738404214 738625765 739193738 739717305 740126133
3912G40126133K45929j8478m6432J64330J74284j0252K8253K50459K49862J55986J64866
$$ 740126133 740372062 740353584 740307152 740471482 740645766 740635514 740663767 740914226 741164088 741320074 741484940
3934.4G41484940J09673P2419Q9467R1910K06232K02239J4961O0617K63513K99036
$$ 741484940 741594613 741667032 741756499 741848409 742054641 742256880 742271841 742332458 742595971 742895007
3954.8G42895007J88232N4478J1504J17063J94371J03712K1458Q9526K17855K49088
$$ 742895007 743083239 743137717 743149221 743266284 743460655 743564367 743585825 743675351 743893206 744142294
3975.2G44142294J62125Q1002J08004J58548Q8990j7047k6703M4227J30653J88649
$$ 744142294 744304419 744385421 744493425 744651973 744740963 744723916 744697213 744741440 744872093 745060742
3995.6G45060742J93775
$$ 745060742 745254517
3997.6G45254517
$$ 745254517
##END=$$ End of the data block
