##TITLE=$$ Begin of the data block
##JCAMP-DX=5.00 $$ ACD/SpecManager v 10.08
##SPECTROMETER/DATA SYSTEM=Alpha
##DATE=23 Dec 2014 10:50:12
##DATA TYPE=INFRARED SPECTRUM
##DATA CLASS=XYDATA
##ORIGIN=
##OWNER=
##NPOINTS=1765
##FIRSTX=399.76428223
##LASTX=3997.64306641
##MAXX=3997.64306641
##MINX=399.76428223
##MAXY=0.84455925
##MINY=0.42360589
##XFACTOR=1.0000000000
##YFACTOR=1.000000000000000e-9
##FIRSTY=0.65908682
##DELTAX=2.03961372
##XUNITS=1/CM
##YUNITS=ARBITRARY UNITS
##XYDATA=(X++(Y..Y))
399.8 659086823 656330645 655389845 653917789 652118325 652024746 654474318 657473922 658707798 657816887
418.1 657816887 656399488 656113803 655788600 653552175 649757743 646929145 646045744 645554125 644256890
436.5 644256890 642923295 643471599 647057176 652005374 655143440 655897558 656340003 658073962 660176754
454.8 660176754 660206437 657413960 654565573 653703809 653915584 652555466 648842871 645142794 643473625
473.2 643473625 643099725 641944647 639376163 636898518 636401951 637793362 638860226 638098001 636331737
491.5 636331737 635570109 636173069 635947943 633399308 629941404 628009260 627750337 626847029 623573005
509.9 623573005 618901789 615287244 613586962 611833036 608164191 603779316 601189137 601487041 603167176
528.3 603167176 603700399 602981687 603644669 607544661 613072693 617213905 619268775 620814204 622906685
546.6 622906685 624604523 624276757 621834219 618955433 617159724 615830004 612981677 607998073 602462828
565 602462828 598016918 594428658 590659261 587060511 585232615 586501360 590679109 596013725 600823522
583.3 600823522 605137408 609983087 615124702 618778408 619649768 618811905 618521571 619594216 620710850
601.7 620710850 620291770 618824482 618294239 619771779 622274935 623949587 624519169 625741839 629034221
620 629034221 633547306 637158096 638930142 640294313 642976522 646508992 648923337 649387777 649271846
638.4 649271846 650409281 652782261 654612482 654738784 654255152 655041397 657205105 659089386 659271538
656.8 659271538 658430338 658663332 660622537 662878335 663902998 663135231 663161039 665183723 667875588
675.1 667875588 669174254 668874800 668941855 670730352 673180521 674149573 673166931 671944916 671948552 672475278
695.5 672475278 671492875 668352246 664759099 662708104 662409902 662455559 661841810 661512017 663282514
713.9 663282514 667377830 671987474 675463617 678163290 681829870 687214434 692770183 696318030
730.2 696318030 697842181 699410975 702385008 705554366 706689894 705488384 703780770 702989995 702398598
748.5 702398598 700128376 695698857 690826178 687410533 685470641 683508635 680835545 678878963
764.9 678878963 679670632 683445930 688406706 692923605 697324395 703041494 710289538 717201471 721770585
783.2 721770585 724266529 726791143 730618060 734733939 737360656 738479972 740091562 743707895
799.5 743707895 748239219 751248717 751995683 752236128 753890574 756560922 758112669 757517576 756062031
817.9 756062031 755671203 756365895 756151080 753576756 749499202 745931447 743489563 740755022 736328006
836.2 736328006 730932117 726685941 724438310 722812772 720105410 716377556 713145137 711285949
852.6 711285949 709811032 707058668 703181863 700883389 702838004 708795428 716165066 723058820
868.9 723058820 729750574 737022400 744014025 748505712 749234200 747279465 744690537 742194712 738807321
887.2 738807321 733617604 727483630 722303152 718790174 715771616 711724937 706525922 701364934
903.5 701364934 696964145 692434311 686328411 678488553 670264304 663030565 656974494 651452541
919.9 651452541 646411479 642846584 641611159 642239749 643291831 643908322 644683838 646781266 650428653
938.2 650428653 654487431 657415688 658423603 657507360 654590249 649035394 640295923 628983498
954.5 628983498 616662681 604348958 591690600 577770114 562414467 546469808 530793011
968.8 530793011 515365958 499651313 483654469 468376249 455103874 444458604 436245739 430053711
985.1 430053711 425814927 423723429 423605889 424669176 426054537 427393705 428919494 430881768 432872802
1003.5 432872802 434148103 434453458 434212536 434106410 434522361 435235888 435964376 436993927 438873976
1021.8 438873976 441712976 444990218 448059320 450797856 453563958 456458628 458962977 460410833
1038.2 460410833 460824490 460989922 461652249 462884873 464365482 466141194 468800157 472926229 478498876
1056.5 478498876 484932423 491804332 499264836 507298589 514451504 517694116 514805794 507051945
1072.8 507051945 498446435 492331743 489374965 488635629 489331514 491361827 494807363 499347836 504222631
1091.2 504222631 508781254 512926877 516734779 519869566 521729231 522273362 522445381 523531854 526059210
1109.6 526059210 529426754 532677114 535417855 537908673 540386617 542579770 544120133 545360088
1125.9 545360088 547313511 550585806 554512739 557528436 558417737 557022095 553835213 549315929
1142.2 549315929 543661952 537218392 530902684 525732636 522078931 519592822 517797530 516742051
1158.5 516742051 516960323 518864453 522345603 527006507 532756686 539987624 548937321 559113443
1174.8 559113443 569555283 579643905 589512169 599532485 609503388 618532896 625795424 631319463
1191.1 631319463 635812521 639660418 642556787 644228160 645134926 646252334 648227811 650876343
1207.5 650876343 653612912 656341016 659563541 663549960 667664945 670794308 672450304 673131645
1223.8 673131645 673546314 673781276 673360825 672035754 670343995 669141054 668646634 668330073 667744637
1242.1 667744637 667179644 667395353 668714345 670544028 671993554 672851384 673666000 674882054 676216304
1260.5 676216304 677069485 677460670 678125978 679630578 681645155 683195233 683669925 683450401 683342218
1278.8 683342218 683582604 683656454 683053315 681990683 681183875 680901527 680544198 679394066 677566528
1297.2 677566528 675893366 674898267 674204528 673092902 671445608 669904709 669032395 668606460 667955518
1315.6 667955518 666707933 665138364 663742661 662312627 660030067 656497240 652289748 648481607
1331.9 648481607 645658791 643558979 641661644 639983416 639177322 639460444 640184045 640447497 639950752
1350.2 639950752 639237046 638855696 638657868 638090253 636866987 635314286 634291887 634002566 633793414
1368.6 633793414 633320868 632891834 633004665 633724272 634430051 634567440 634608328 635816872 638775468
1386.9 638775468 642212451 644515574 645556092 645805478 645873368 645727038 644985974 643612087 641891241
1405.3 641891241 640567958 639746070 638750374 637364030 636097491 635322571 635088325 635180712 635168910
1423.7 635168910 635115385 635608971 636853337 638407707 639730930 640708208 641732812 643218815 644928336
1442 644928336 646221876 646713078 646564782 646368086 646372736 646190166 644812047 642473221 641791999 642679691
1462.4 642679691 644421041 646624207 649374723 653572142 660269022 667582870 673429370 678357840
1478.7 678357840 683244228 688483238 693622768 698325336 702443480 706037223 709343433 712845445
1495 712845445 716376841 718890548 720748067 722854555 725728095 728880882 730429471 731294453 732622683
1513.4 732622683 734631360 736888468 738490999 739304900 740033567 741229057 742617369 743586779 744035721
1531.8 744035721 744260073 744946480 746131957 746924400 746281981 745403826 745182872 745465219 745571375
1550.1 745571375 745071650 744307697 743900359 743526697 742187619 740882456 739618480 738524914 737855852
1568.5 737855852 737147987 736342609 735269487 733678162 732632160 732235372 731574297 730338454 728918016
1586.8 728918016 727842689 727093041 726145744 724558353 722560883 720767736 719294250 717676818 715488613
1605.2 715488613 712763965 709878325 707399011 705388308 702857614 699266374 696545839 694822371
1621.5 694822371 692950785 690858841 688513100 686203361 684889197 684434235 683793008 682841241 682304561
1639.9 682304561 682466686 683435023 684951007 686364710 687464952 688945174 691345751 693606913 695678473
1658.2 695678473 697936177 700600863 703701973 706898272 710300505 713618517 716384053 719579101
1674.5 719579101 723445892 726993740 730139315 733400226 737357855 741011143 744186878 747191846
1690.9 747191846 749689937 752338946 755494893 758524954 761167169 762933969 764377713 766178727
1707.2 766178727 768210888 770098805 771572292 772690237 773647070 774448693 775087118 775554836 776120961
1725.5 776120961 777191162 778893471 780755639 782043993 782631516 783356369 784648836 786267400 787723482
1743.9 787723482 788926959 790182412 791916966 794073522 795979142 797411263 798605382 799971700
1760.2 799971700 801714122 803342104 804445982 805197358 806048751 807209253 808324635 809036672 809395969
1778.6 809395969 809760571 810524642 811582923 812457323 812956393 813325167 813970864 814897597 815670609
1796.9 815670609 815965056 815962315 816316128 817196906 818119824 818578660 818625689 818858027 819585919 820436060
1817.3 820436060 820898473 820957363 821078062 821677804 822531521 822972476 822847486 822769642 823123574 823789537
1837.7 823789537 824372530 824574172 824384987 824337482 824748337 825197816 825295568 825078666 824991465 825362980
1858.1 825362980 825925171 826140642 826000988 825948656 826235652 826680720 826895058 826751113 826569319 826812983
1878.5 826812983 827400565 827829957 827851653 827712595 827816188 828303516 828817606 828901768 828635454 828564942
1898.9 828564942 828954756 829445899 829567432 829303443 829054177 829199314 829649210 829941630 829780817 829511166
1919.3 829511166 829637051 830060661 830318809 830159426 829841435 829853058 830267549 830639124 830615819 830380142
1939.7 830380142 830360949 830683231 831046700 831117213 830896914 830762684 831013381 831461430 831670582 831521749
1960.1 831521749 831368446 831565857 832003057 832257688 832111239 831824005 831807792 832140207 832490444 832491994
1980.5 832491994 832225800 832146168 832451642 832845569 832894862 832557023 832299173 832433879 832744658 832817316
2000.9 832817316 832517982 832182586 832172573 832388878 832407236 832023561 831499338 831199229 831131458 830945969
2021.3 830945969 830325007 829540193 829307854 829672694 829987168 829819024 829255462 828782380 828730106 828875840
2041.7 828875840 828773081 828308284 827854037 827803731 828041792 828122973 827856898 827523172 827530324 827897966
2062.1 827897966 828201950 828096569 827776492 827702463 827995360 828310549 828283787 827987015 827826798 828035295
2082.5 828035295 828387380 828494370 828296721 828138769 828324318 828721523 828919947 828778625 828595042 828698516
2102.9 828698516 829083979 829384744 829307020 829056025 829061687 829406977 829734147 829684138 829361081 829190910
2123.3 829190910 829382420 829709530 829767227 829475522 829235435 829405367 829796731 829926372 829664230 829393268
2143.7 829393268 829464138 829764068 829941809 829827011 829632759 829705298 830087006 830441713 830474377 830321252
2164.1 830321252 830354810 830740750 831266105 831577957 831625402 831749856 832181394 832698286 832964957 832973361
2184.5 832973361 833041072 833413482 833935618 834242940 834238350 834213138 834491193 835018933 835408092 835453510
2204.8 835453510 835408688 835612297 836064219 836485565 836645961 836627960 836748898 837133169 837542355 837702334
2225.2 837702334 837613523 837561548 837791383 838175118 838382423 838317215 838251472 838459730 838837743 839056134
2245.6 839056134 838998556 838875294 838951766 839259982 839546680 839586616 839478195 839499116 839768410 840098977
2266 840098977 840204298 840090394 840065718 840295136 840594351 840711772 840627909 840554714 840700865 841046631
2286.4 841046631 841319859 841289341 841124535 841172874 841482520 841794610 841866016 841795325 841884017 842199922
2306.8 842199922 842527568 842662096 842643321 842714906 843082309 843575239 843798459 843754947 843789935 844082296
2327.2 844082296 844466090 844559252 844292521 844004154 843886614 843895316 843853772 843442261 842699587 842317343
2347.6 842317343 842600107 843235135 843777776 844018221 844139755 844295144 844227731 843705416 842931926 842225373
2368 842225373 841660917 841108918 840454996 839717567 839036524 838546932 838260055 838027120 837693393 837329924
2388.4 837329924 837138653 837155402 837173522 836993098 836671472 836410403 836305559 836237609 836007178 835601926
2408.8 835601926 835217834 835016668 834921300 834713519 834315240 833863258 833517432 833246529 832914889 832486033
2429.2 832486033 832023859 831669748 831484973 831271529 830825508 830232263 829732835 829427242 829171896 828787446
2449.6 828787446 828303635 827908695 827660918 827412128 827032864 826522291 825994849 825602055 825355649 825114548
2470 825114548 824772596 824373960 824036360 823813200 823603928 823256254 822789073 822389603 822153211 821982980
2490.4 821982980 821749866 821421742 821118057 820951700 820847809 820678055 820415318 820108891 819837391 819647551
2510.8 819647551 819463313 819185138 818857551 818593085 818412066 818219543 817914605 817518592 817113817 816748023
2531.2 816748023 816436172 816088080 815615058 815129042 814772546 814476192 814090669 813584268 813039243 812588930
2551.6 812588930 812278926 811987460 811576605 811079085 810659289 810380638 810107827 809706807 809205413 808712184
2572 808712184 808309197 807995677 807659805 807220042 806776762 806462884 806234598 805947065 805538237 805103779
2592.4 805103779 804791868 804615438 804445624 804171741 803783655 803382874 803083599 802842319 802478135 801914513
2612.8 801914513 801306069 800792217 800312936 799753904 799113810 798477471 797881126 797305346 796680212 795904160
2633.2 795904160 795018494 794200361 793502092 792824507 792099535 791328490 790572584 789878249 789199948 788458407
2653.5 788458407 787637711 786853611 786212206 785637498 785009205 784296632 783560336 782933414 782413065 781826735
2673.9 781826735 781110168 780361354 779701769 779167116 778670788 778119147 777518690 776945353 776423693 775887072
2694.3 775887072 775256157 774522543 773772538 773112535 772529006 771887600 771132529 770378768 769730091 769139528
2714.7 769139528 768509507 767802715 767071009 766409576 765857756 765351951 764780521 764154553 763597548 763162732
2735.1 763162732 762770414 762270391 761646450 761063337 760637999 760294497 759851873 759268045 758706510 758285403
2755.5 758285403 757954538 757621348 757211685 756732941 756303608 755962431 755581558 755084455 754550040 754064143
2775.9 754064143 753603220 753073990 752418876 751677513 750956953 750301600 749615610 748802066 747905850 747018635
2796.3 747018635 746147871 745221078 744150221 742938578 741724253 740592718 739453435 738210678 736887395
2814.7 736887395 735530317 734163642 732790828 731349468 729772329 728101790 726447761 724805951
2831 724805951 723086238 721282959 719411075 717387080 715160131 712804854 710331321 707681358 704966903
2849.3 704966903 702442348 700269520 698408604 696672380 694852531 692837179 690582216 687984228
2865.7 687984228 684946656 681609392 678214669 674776673 671233058 667720497 664485514 661708653
2882 661708653 659433603 657584906 656080723 654921591 654145658 653680682 653282404 652741790 652087688
2900.3 652087688 651378334 650549710 649548292 648313403 646756470 644841254 642590642 640065491 637388229
2918.7 637388229 634763539 632439613 630589783 629333735 628722727 628678381 629239917 630584657 632743418
2937 632743418 635557652 638847470 642462432 646217406 649977207 653765976 657624781 661418796 665056467
2955.4 665056467 668640256 672236621 675765514 679066718 682071686 684894979 687630773 690269291
2971.7 690269291 692825139 695316613 697777569 700197697 702405453 704321802 706052125 707689345
2988 707689345 709268689 710660398 711716413 712546170 713164151 713489771 713681996 713794172 713701725 713452458
3008.4 713452458 713160753 712768793 712100446 711084604 709858894 708589733 707342684 706059098 704640031
3026.8 704640031 703179121 701801360 700446784 698931277 697191417 695459366 693844855 692186832
3043.1 692186832 690397680 688511729 686608374 684717655 682849228 681031764 679143667 677117825
3059.4 677117825 675106227 673229754 671462834 669606864 667545378 665434599 663487673 661808014
3075.7 661808014 660220742 658424914 656399488 654319644 652306914 650385320 648429871 646329641
3092.1 646329641 644227326 642314255 640564620 638754070 636712074 634616196 632749915 631020188
3108.4 631020188 629168630 627317488 625655711 624006629 622214317 620226562 618040800 615891755
3124.7 615891755 613986492 612265229 610517919 608659565 606842518 605188251 603565454 601775587
3141 601775587 599873900 598012090 596250474 594672441 593234897 591668129 589857459 588005006 586268246
3159.4 586268246 584641278 583070397 581495285 579889238 578292668 576769710 575292051 573805511
3175.7 573805511 572297156 570793867 569357276 567994952 566648602 565270960 563873589 562463939
3192 562463939 561053813 559709251 558424115 557142675 555897951 554716289 553531647 552266479 550951540
3210.3 550951540 549706936 548567116 547495306 546441913 545303643 544092357 542958856 541944027
3226.7 541944027 540995061 540123761 539259970 538181305 536928475 535783648 534826875 533967435 533188820
3245 533188820 532426655 531532347 530598700 529773593 528980076 528123736 527254105 526437640 525651515 524916112
3265.4 524916112 524347186 523963153 523484528 522718191 521829247 520983875 520224929 519534945 518879414 518250465
3285.8 518250465 517701805 517309129 516931236 516335368 515497446 514544129 513694465 513128698 512777090 512309849
3306.2 512309849 511458993 510352314 509295523 508370042 507470310 506586969 505774140 505043745 504329324
3324.6 504329324 503426671 502297521 501203120 500306308 499568045 498877913 498018801 496910691 495732337
3342.9 495732337 494608492 493618965 492794752 491864979 490629852 489340663 488249213 487272739 486233681
3361.3 486233681 485194743 484372348 483630031 482567251 481131226 479732752 478693634 477839947 476918966
3379.6 476918966 475916803 474953055 474196136 473773599 473606229 473244190 472421139 471595347 471256793
3398 471256793 471140862 470565498 469532371 468750089 468403846 468124628 467742622 467233121 466675669 466308773
3418.4 466308773 466141224 465960622 465779632 465775371 465929836 466057509 466210335 466465682 466562271 466406107
3438.8 466406107 466309994 466487855 466826648 467113256 467337191 467659861 468098670 468605906 469248742 470033020
3459.2 470033020 470731765 471388280 472308010 473285377 473863721 474094778 474430829 475073278 475946158 476808131
3479.6 476808131 477461338 478152335 479009539 479710609 480268210 481050283 482063353 483070552 483954221
3497.9 483954221 484832495 485762835 486558110 487253904 488044947 488997847 490144283 491249561 492090285
3516.3 492090285 492887437 493932873 495230466 496402889 497268885 498125374 499176890 500394285 501721978
3534.6 501721978 502992928 504146755 505460799 506971240 508336961 509395421 510488808 511758447
3551 511758447 513008714 514322817 515894830 517684758 519450843 521010637 522417426 524089813 526261747
3569.3 526261747 528448820 530388832 532330871 534502625 536961019 539684355 542435229 544800043
3585.6 544800043 546849012 549334526 552155733 554805875 557409763 560261309 563203096 566128433
3601.9 566128433 569053471 571758986 574346840 577171206 580220222 583397925 586446166 589201987
3618.3 589201987 592176497 595449686 598533809 601059556 603280842 606225967 609548509 612636864
3634.6 612636864 615435123 618059099 620791972 623744488 626668036 629204452 631478608 634169281
3650.9 634169281 637041271 639626861 642320633 645134866 647506952 649641812 652005792 654297709
3667.2 654297709 656206429 658350408 660521746 662105501 663851976 665914476 667929113 670071244
3683.5 670071244 672391713 674499869 675887346 677093089 678724527 680546105 682286024 683720052
3699.8 683720052 684833467 686081886 687585592 688939333 689752817 690382957 691673934 693266988 694618583
3718.2 694618583 695661724 696508944 697251916 698091149 699255884 700475276 701394081 701973081 702722371
3736.5 702722371 704017043 705278099 705687523 705694377 706626296 707505286 707706571 708344162 709478736
3754.9 709478736 710391045 711061120 711924613 712832689 713501751 714075029 714546800 715079665 715886235 716761231
3775.3 716761231 717455566 717902124 718421459 719045043 719561696 720030427 720537543 721150815 721798599 722353101
3795.7 722353101 722881496 723149419 723319530 724006474 724554718 724823177 725410640 726180494 726695597 727036417
3816.1 727036417 727548122 727620423 727651477 728415310 729209661 729733169 730070353 730401516 730955899 731342554
3836.5 731342554 731262147 731293380 731723487 732406735 733205736 733936667 734070599 733100235 732707858 733737588
3856.9 733737588 734768391 735296249 735381365 735546947 735992134 736190319 736257911 736476839 736812353 737280071
3877.3 737280071 737581313 737876177 738272071 738476753 738836884 739201188 739181340 739280879 739722133 740064323
3897.7 740064323 740107298 740011811 739903629 740019977 740470052 740990043 741376221 741539717 741481543 741458058
3918.1 741458058 741662383 741867304 741916358 742029250 742310286 742550075 742686570 742856145 743042827 743179679
3938.5 743179679 743250966 743322134 743523359 743690133 743697762 743795335 744075119 744350076 744437277 744362712 744341314
3960.9 744341314 744483411 744700074 744856477 744936526 745057762 745281279 745509207 745650828 745686650 745716512
3981.3 745716512 745855808 745968044 745956182 745956421 746031106 746151567 746329486 746527195
3997.6 746527195
##END=$$ End of the data block
