##TITLE=$$ Begin of the data block
##JCAMP-DX=5.00 $$ ACD/SpecManager v 10.08
##SPECTROMETER/DATA SYSTEM=Alpha
##DATE=23 Dec 2014 10:50:12
##DATA TYPE=INFRARED SPECTRUM
##DATA CLASS=XYDATA
##ORIGIN=
##OWNER=
##NPOINTS=1765
##FIRSTX=399.76428223
##LASTX=3997.64306641
##MAXX=3997.64306641
##MINX=399.76428223
##MAXY=0.84591120
##MINY=0.42377988
##XFACTOR=1.0000000000
##YFACTOR=1.000000000000000e-9
##FIRSTY=0.65681982
##DELTAX=2.03961372
##XUNITS=1/CM
##YUNITS=ARBITRARY UNITS
##XYDATA=(X++(Y..Y))
399.8F56819820j805424p60913j495600j703858k5094K186716K828300J608610n49913
$$ 656819820 655014396 654253483 652757883 651054025 651028931 653215647 656043947 657652557 657102644
418.1F57102644j866519p93874m57287k218187l734708k905547q54791o0200r44674
$$ 657102644 655236125 654442251 653984964 651766777 648032069 645126522 644271731 644211531 643266857
436.5F43266857j268864O42896L537297M764914L191770R85026O72877J784980K071977
$$ 643266857 641997993 642640889 646178186 650943100 654134870 655119896 655792773 657577753 659649730
454.8F59649730K28345k581656k794444r46522j13726j595318l661454l680289j696884
$$ 659649730 659878075 657296419 654501975 653555453 653441727 651846409 648184955 644504666 642807782
473.2F42807782k26915j021981k662480k537489k90215J593292J035690r90093j964569
$$ 642807782 642580867 641558886 638896406 636358917 636068702 637661994 638697684 637707591 635743022
491.5F35743022o76751P57575K0861k123594l416002k337157n23210r34720l259122
$$ 635743022 635066271 635823846 635844707 633721113 630305111 627967954 627444744 626510024 623250902
509.9F23250902m558623l418982j617909j765251l611564m230440k406597K99394J358390
$$ 623250902 618692279 615273297 613655388 611890137 608278573 604048133 601641536 601940930 603299320
528.3F03299320K33888o50882Q94665L962517N526662M313767K206624J532554K181053
$$ 603299320 603533208 602882326 603776991 607739508 613266170 617579937 619786561 621319115 623500168
546.6F23500168J865089l74555k737046l153503j692414r88900k832771n367756n875885
$$ 623500168 625365257 624990702 622253656 619100153 617407739 616418839 613586068 608218312 602342427
565F02342427m492104l480375l696144l546595j790285J305759M322350N422651M694999
$$ 602342427 597850323 594369948 590673804 587127209 585336924 586642683 590965033 596387684 601082683
583.3F01082683M152774M779876N256593L817201R06229q40664k84195J057446J153946
$$ 601082683 605235457 610015333 615271926 619089127 619995356 619154692 618870497 619927943 621081889
601.7F21081889l31164j469433n60820J549184K539814J556873L86238J142800L334403
$$ 621081889 620750725 619281292 618720472 620269656 622809470 624366343 624752581 625895381 629229784
620F29229784M494250L519535J835227J576900K837181L595829K400160L84093j83940
$$ 629229784 633724034 637243569 639078796 640655696 643492877 647088706 649488866 649872959 649689019
638.4F49689019J179993K510905J912356N9604o81937O78003K310396K020597J53303
$$ 649689019 650869012 653379917 655292273 655351877 654669940 655347943 657658339 659678936 659832239
656.8F59832239q49664K50935J927853K231777J102149n98728J9788J880944K590120
$$ 659832239 658982575 659233510 661161363 663393140 664495289 663896561 663916349 665797293 668387413
675.1F68387413J381874j26898J06156J715839K394139R52244r91404j200080k861
$$ 668387413 669769287 669642389 669748545 671464384 673858523 674810767 673819363 672619283 672616422
693.5F72616422M32790j008034l069580l549397k003372k53975k9087p38740l56495
$$ 672616422 673049212 672041178 668971598 665422201 663418829 663164854 663135767 662397027 662040532
711.8F62040532J827001M147411M599273L445506K772808L828943N453169N452395
$$ 662040532 663867533 668014944 672614217 676059723 678832531 682661474 688114643 693567038
728.1F93567038L421485J519084J654983L014683L106416J068770j192629j652598
$$ 693567038 696988523 698507607 700162590 703177273 706283689 707352459 706159830 704507232
744.5G04507232p43151o26206k421141m570127m875063l345311j884937j919866k697051
$$ 704507232 703764081 703137875 700716734 696146607 691271544 687926233 686041296 684121430 681424379
762.8F81424379k036333Q24213L922224N021990M477262M408360N728364P162034O837368
$$ 681424379 679388046 680212259 684134483 689156473 693633735 698042095 703770459 710932493 717769861
781.2G17769861M579663K507508K511919L820419M113794K630651J177668J742959
$$ 717769861 722349524 724857032 727368951 731189370 735303164 737933815 739111483 740854442
797.5G40854442L715515M508376K899647O60598K72930J724959K663850J470864o82294
$$ 740854442 744569957 749078333 751977980 752638578 752911508 754636467 757300317 758771181 758088887
815.8G58088887j409889k78234O90877l09526k712787m188955l577053k439857k774536
$$ 758088887 756678998 756400764 757091641 756782115 754069328 749880373 746303320 743863463 741088927
834.2G41088927m449487n392671m241764k217114j550496k654373l763199l294885
$$ 741088927 736639440 731246769 727005005 724787891 723237395 720583022 716819823 713524938
850.5G13524938j862467j449167k742708l860772k293467J946926N950868P303059
$$ 713524938 711662471 710213304 707470596 703609824 701316357 703263283 709214151 716517210
866.8G16517210O823659O709397P317364O999016M458904O75023j994133k586127k512097
$$ 716517210 723340869 730050266 737367630 744366646 748825550 749500573 747506440 744920313 742408216
885.2G42408216l488958n290329o131232n115152l449797k986849m085242n255580
$$ 742408216 738919258 733628929 727497697 722382545 718932748 715945899 711860657 706605077
901.5G06605077n156279m377365m546344o127596p831514q205652p237733o068647
$$ 706605077 701448798 697071433 692525089 686397493 678565979 670360327 663122594 657053947
917.8F57053947n488276m983366l559529j300991N85020J091778O61433P85291K092957
$$ 657053947 651565671 646582305 643022776 641721785 642306805 643398583 644060016 644845307 646938264
936.2F46938264L619850M015744K893865R88305q86620k861082n561352q783281j1335373
$$ 646938264 650558114 654573858 657467723 658456028 657569408 654708326 649146974 640363693 629028320
954.5F29028320j2327194j2306154j2647569j3949573j5427709j5974402j5639484
$$ 629028320 616701126 604394972 591747403 577797830 562370121 546395719 530756235
968.8E30756235j5392125j5707254j6010314j5298069j3267576j0578663q089393o113946
$$ 530756235 515364110 499656856 483646542 468348473 455080897 444502234 436412841 430298895
985.1D30298895m260838k144367j13815J127303J411169J298607J507580J988977K007723
$$ 430298895 426038057 423893690 423779875 424907178 426318347 427616954 429124534 431113511 433121234
1003.5D33121234J264125K81602k37464o7533M03077O38783O81817J024634J903832
$$ 433121234 434385359 434666961 434429497 434361964 434765041 435403824 436085641 437110275 439014107
1021.8D39014107K879530L295094L070623K724498K730459K857685K447337J419157
$$ 439014107 441893637 445188731 448259354 450983852 453714311 456571996 459019333 460438490
1038.2D60438490M82649K26616O58393J252681J500219J732260K610416M128962N614937
$$ 460438490 460921139 461147755 461806148 463058829 464559048 466291308 468901724 473030686 478645623
1056.5D78645623O462872O845504P431537Q042872P120907L158569k912521p684946
$$ 478645623 485108495 491953999 499385536 507428408 514549315 517707884 514795363 507110417
1072.8E07110417q526415o086766k957196p25299P31796K081991L491759M536003M818588
$$ 507110417 498584002 492497236 489540040 488814741 489546537 491628528 495120287 499656290 504474878
1091.2E04474878M511953M142523L803849L099918J822591N21421J91272J145243K560079
$$ 504474878 508986831 513129354 516933203 520033121 521855712 522377133 522568405 523713648 526273727
1109.6E26273727L356874L221631K713740K488077K490103K201021J556337J256347
$$ 526273727 529630601 532852232 535565972 538054049 540544152 542745173 544301510 545557857
1125.9E45557857J963913L296494L935040K987742Q51154j440406l219723m513681
$$ 545557857 547521770 550818264 554753304 557741046 558592200 557151794 553932071 549418390
1142.2E49418390n607069o365239o269992n197108l675699k468169j785278j047909
$$ 549418390 543811321 537446082 531176090 525978982 522303283 519835114 518049836 517001927
1158.5E17001927K39253J915812L468991M650950N755246P218659Q929372J0165989
$$ 517001927 517241180 519156992 522625983 527276933 533032179 540250838 549180210 559346199
1174.8E59346199J0410011J0053873R885311J0064244R982825Q993864P211923N511701
$$ 559346199 569756210 579810083 589695394 599759638 609742463 618736327 625948250 631459951
1191.1F31459951M512787L858805K904355J686633R34780J173019K030730K659917
$$ 631459951 635972738 639831543 642735898 644422531 645357311 646530330 648561060 651220977
1207.5F51220977K698779K664447L163994L938853M098416L160655J684606O91533
$$ 651220977 653919756 656584203 659748197 663687050 667785466 670946121 672630727 673322260
1223.8F73322260M25637K16544m65214j333714j645029j134395m37677l06606o29008
$$ 673322260 673747897 673964441 673499227 672165513 670520484 669386089 668948412 668641806 668012798
1242.1F68012798n94556K46047J338840J783192J392365Q40783Q32021J255274J378536
$$ 668012798 667418242 667664289 669003129 670786321 672178686 673019469 673851490 675106764 676485300
1260.5F76485300Q82208L91961O36756J472890J997292J540482M79043j96636o9678
$$ 676485300 677367508 677759469 678396225 679869115 681866407 683406889 683885932 683689296 683619618
1278.8F83619618K85626R8705o09577j070559p95424k72393l65078j160205j814842
$$ 683619618 683905244 684003949 683394372 682323813 681528389 681255996 680890918 679730713 677915871
1297.2F77915871j634300r66012p00593j128316j652896j559735q82208l87609o30200
$$ 677915871 676281571 675315559 674614966 673486650 671833754 670274019 669391811 669004202 668374002
1315.6F68374002j277149j603365j418769j415312k239585l509760m189134l782987
$$ 668374002 667096853 665493488 664074719 662659407 660419822 656910062 652720928 648937941
1331.9F48937941k823592k112627j887679j654446p81774K79486O76751K14755n04672
$$ 648937941 646114349 644001722 642114043 640459597 639677823 639957309 640634060 640848815 640344143
1350.2F40344143o84202l41773j75416n76675j241446j566946j032472k99334k41042
$$ 640344143 639659941 639318168 639142752 638566077 637324631 635757685 634725213 634425879 634184837
1368.6F34184837n07056m36962J17719P18057O95587J24812N7757J260757K985597
$$ 634184837 633677781 633240819 633358538 634076595 634772182 634896994 634954751 636215508 639201105
1386.9F39201105L413319K271772J033604K48313L8862j70171p32065j354455j705766
$$ 639201105 642614424 644886196 645919800 646168113 646206975 646036804 645304739 643950284 642244518
1405.3F42244518j300752q03233j010716j410484j237392o95825k18987J1623q0765
$$ 642244518 640943766 640140533 639129817 637719333 636481941 635786116 635567129 635578752 635497987
1423.7F35497987n6386N56708J316964J584351J362205J006246R31262J389802J706243
$$ 635497987 635441601 635998309 637315273 638899624 640261829 641268075 642199337 643589139 645295382
1442F45295382J320064N08010j18852j55866K9326j49906j297355k335667p98226Q16703
$$ 645295382 646615446 647123456 647004604 646848738 646878064 646728158 645430803 643095136 642296910 643113613
1462.4F43113613J755536K215624K734899M242599O794870P314742N766987M870534
$$ 643113613 644869149 647084773 649819672 654062271 660857141 668171883 673938870 678809404
1478.7F78809404M883469N266726N167067M753649M195034L605187L272295L526092
$$ 678809404 683692873 688959599 694126666 698880315 703075349 706680536 709952831 713478923
1495G13478923L568768K483487J825512K135158L002762L282130J501679P91967J291395
$$ 713478923 717047691 719531178 721356690 723491848 726494610 729776740 731278419 732070386 733361781
1513.4G33361781K003967K264679J615524Q30293O99937J147211J334131R13202M48823
$$ 733361781 735365748 737630427 739245951 740076244 740776181 741923392 743257523 744170725 744619548
1531.8G44619548K75731P25568J296818J024961n98073j016080l41594K17378Q0943
$$ 744619548 744895279 745620847 746917665 747942626 747344553 746328473 745986879 746204257 746285200
1550.1G46285200n18679p41423l04043k49028j409829j441181j314580j091182o49333
$$ 746285200 745766521 745025098 744721055 744472027 743062198 741621017 740306437 739215255 738565922
1568.5G38565922o91653p93874j040935j584471j095652m37677o87182j244664j388133
$$ 738565922 737874269 737080395 736039460 734454989 733359337 732921660 732234478 730989814 729601681
1586.8G29601681j033604p46787r69946j592278j970292j760482j463056j616478k175271
$$ 729601681 728568077 727821290 726851344 725259066 723288774 721528292 720065236 718448758 716273487
1605.2G16273487k701402k852202k432286j955331k484321l617883k778530j694918
$$ 716273487 713572085 710719883 708287597 706332266 703847945 700230062 697451532 695756614
1621.5F95756614j791298k085805k390087k317309j269758l56376n79834j042783o09279
$$ 695756614 693965316 691879511 689489424 687172115 685902357 685545981 684966147 683923364 683314085
1639.9F83314085J70350J018405J586735J409650J064479J565576K447605K098024
$$ 683314085 683484435 684502840 686089575 687499225 688563704 690129280 692576885 694674909
1656.2F94674909J931608K216935K706408L166140L259718L485382L382623K755761
$$ 694674909 696606517 698823452 701529860 704696000 707955718 711441100 714823723 717579484
1672.5G17579484L142834L827214L544867L166795L307402L968477L586471L116608
$$ 717579484 720722318 724549532 728094399 731261194 734568596 738537073 742123544 745240152
1688.8G45240152K967238K514243K737999L203214K991259K589941J730621J441598
$$ 745240152 748207390 750721633 753459632 756662846 759654105 762244046 763974667 765416265
1705.1G65416265J773178J939893J829326J518905J227737J049101P76410N38290M07219
$$ 765416265 767189443 769129336 770958662 772477567 773705304 774754405 775530815 776069105 776476324
1723.5G76476324N73694J095891J712859J858354J268625N58376P21216J312614J627028
$$ 776476324 777050018 778145909 779858768 781717122 782985747 783544123 784265339 785577953 787204981
1741.9G87204981J442015J207113J299203J751482K095163J842916J418531J216710
$$ 787204981 788646996 789854109 791153312 792904794 794999957 796842873 798261404 799478114
1758.2G99478114J396119J729846J580835J102268P98881R17733J227379J104295O42121
$$ 799478114 800874233 802604079 804184914 805287182 806086063 807003796 808231175 809335470 809977591
1776.5H09977591L25739L81351P92265J067698Q61823N13435M15563O40452Q63493
$$ 809977591 810303330 810684681 811476946 812544644 813406467 813919902 814335465 814975917 815839410
1794.9H15839410P41482L23593M4525L43382Q28445R13620M95315N4180J97411P02322
$$ 815839410 816580892 816904485 816949010 817292392 818120837 819034457 819529772 819583952 819781363 820483685
1815.3H20483685Q37206M44889N9307J65284O55889Q79228M50194j40786r4592L80337
$$ 820483685 821320891 821765780 821825087 821990371 822646260 823525488 823975682 823834896 823740304 824120641
1835.7H24120641O85990N44250J63257j73152k2828M17769M46856Q0108k18451n2333
$$ 824120641 824806631 825350881 825514138 825340986 825318158 825735927 826182783 826262891 826044440 825992107
1856.1H25992107L95954N33581J63197j52826m649L43621M50968J85192j64866j94014
$$ 825992107 826388061 826921642 827084839 826932013 826927364 827270985 827721953 827907145 827742279 827548265
1876.5H27548265K33889O11603M61221O735j48415J50680N33283N24223P0274k93434
$$ 827548265 827782154 828393757 828854978 828861713 828713298 828863978 829397261 829921484 829991758 829698324
1896.9H29698324j01208L56018M70877J20103k49922k27511J54614M55380L11196j37270
$$ 829698324 829597116 829953134 830424011 830544114 830294192 830066681 830221295 830676675 830987871 830850601
1917.3H30850601k65062J27554M28498K42353j81556l18885L1412M34339L85105k1398
$$ 830850601 830585539 830713093 831141591 831383944 831202388 830883503 830914915 831349254 831734359 831712961
1937.7H31712961k37644j192L39866L48985J4246k76208j36256K84969M73321J93417
$$ 831712961 831475317 831474125 831813991 832162976 832177222 831901014 831764758 832049727 832523048 832716465
1958.1H32716465j86920j61767K27153M76718K72930j55390l00884o020L47614L29495
$$ 832716465 832529545 832367778 832594931 833071649 833344579 833189189 832888305 832882285 833229899 833559394
1978.5H33559394k2650k50280n4002L13998L96967L9041l65198k74122J33038L14235
$$ 833559394 833536744 833286464 833232462 833546460 833943427 833982468 833617270 833343148 833476186 833790421
1998.8H33790421R3341k74181l39687k2113K17914K5511l59475n03242l02017p4566
$$ 833790421 833883762 833609581 833269894 833247781 833465695 833491206 833131731 832628489 832326472 832251906
2019.2H32251906j91390o23226p78497k06112L81171K68460k23458n57900m39346k5987
$$ 832251906 832060516 831437290 830658793 830452681 830833852 831102312 830878854 830320954 829881608 829855621
2039.6H29855621J51098j22667m58717m17888m2498K22802Q2373k40683l07679m18
$$ 829855621 830006719 829884052 829425335 829007447 828964949 829187751 829270124 829029441 828721762 828721344
2060H28721344L35634K80619j22905l25322m1127L47376L46839l5405l30389j78516
$$ 828721344 829056978 829337597 829214692 828889370 828848243 829195619 829542458 829507053 829176664 828998148
2080.4H28998148K21730L54767Q4579k12312j55747K06292M31478K21610j55211k30610
$$ 828998148 829219878 829574645 829659224 829446912 829291165 829497457 829928935 830150545 829995334 829764724
2100.8H29764724Q2552M00126L01898r2328k52306K4318L45767K97069n0365k80560
$$ 829764724 829847276 830247402 830549300 830456972 830204666 830228984 830574751 830871820 830821455 830540895
2121.2H30540895j26123K14219K97368n842l14414k16961K05755M19021J33216k79426
$$ 830540895 830414772 830628991 830926359 830920517 830606103 830389142 830594897 831013918 831147134 830867708
2141.6H30867708l11315P2777L80218K17617j51337k28226N0306L49582L38196M6731
$$ 830867708 830556393 830629170 831009388 831227005 831075668 830847442 830897748 831247330 831585526 831632257
2162H31632257j19627R1195M35114N08845K46942l636J05321M34101N26726K67148
$$ 831632257 831512630 831603825 832038939 832547784 832794726 832791090 832896411 833330512 833857238 834124386
2182.4H34124386J9253J01566L85284M91798K98679L5346J311K67208N14269L98755
$$ 834124386 834143639 834245205 834630489 835122287 835420966 835456312 835457623 835724831 836239100 836637855
2202.8H36637855N6326n9128J84655M50969M22061J46627k0087J53482M26173M25339
$$ 836637855 836694181 836635053 836819708 837270677 837692738 837839365 837819278 837972760 838398933 838824272
2223.2H38824272J40011j22308o3062K43068M13716K58267k3604q7559J34766L38674
$$ 838824272 838964283 838841975 838778913 839021981 839435697 839693964 839670360 839582801 839717567 840056241
2243.6H40056241K46942k8730j19150R9898L23057K64943L2246j03116J6212K68877
$$ 840056241 840303183 840274453 840155303 840255201 840578258 840843201 840875447 840772331 840788543 841057420
2264H41057420L11792O9618j29283m8339J92881K98202J33991n8591l219K15054L20851
$$ 841057420 841369212 841438830 841309547 841261208 841454089 841752291 841886282 841827691 841824472 842039526 842360377
2286.4H42360377J87993l2365p0989J15573K82049K19346K1100n1380J23024L75450
$$ 842360377 842548370 842516005 842445016 842560589 842842638 843061984 843083084 843031704 843154728 843530178
2306.8H43530178M01378J84297k1696J3232L08097M70519K38478l8147J6391L02911
$$ 843530178 843931556 844115853 844094157 844107389 844415486 844886005 845124483 845086336 845102727 845405638
2327.2H45405638L97325J08242k40565l41117j80185O1631K7359m03702p63774m20213
$$ 845405638 845802963 845911205 845670640 845329523 845149338 845210969 845238328 844834626 844070852 843650639
2347.6H43650639K66433O71923O09696K96354J64569J36733j52409o00279q57711p34985
$$ 843650639 843917072 844588995 845198691 845495045 845659614 845796347 845643938 845043659 844185948 843450963
2368H43450963m81247m57526o17265p59602p31528n05447k65539k26557l53515l76284
$$ 843450963 842969716 842512190 841894925 841135323 840403795 839898348 839632809 839406252 839052737 838676453
2388.4H38676453j78695M6372M4167k01046l93748l20316j11282m2855j97113l63231
$$ 838676453 838497758 838544130 838588297 838387251 837993503 837673187 837561905 837519050 837321937 836958706
2408.8H36958706l52800k03371j06155k12431m26650m92275l46363k27451k90036m23491
$$ 836958706 836605906 836402535 836296380 836083949 835657299 835165024 834818661 834591210 834301174 833877683
2429.2H33877683m50671l26932k08616k54690m48049n92947n14268l19720k52604l54946
$$ 833877683 833427012 833100080 832891464 832636774 832188725 831595778 831081510 830761790 830509186 830154240
2449.6H30154240m77791m53293k86520k13742l38077m74453m78089l66867k50220k61962
$$ 830154240 829676449 829223156 828936636 828722894 828384817 827910364 827432275 827065408 826815188 826553226
2470H26553226l77536m22895l48568k43008k14517l31581m50254l97384k34842j47700
$$ 826553226 826175690 825752795 825404227 825161219 824946702 824615121 824164867 823767483 823532641 823384941
2490.4H23384941k29538l45468l15130j63734p8261j67310l16203l50535k51412j57476
$$ 823384941 823155403 822809935 822494805 822331071 822252810 822085500 821769297 821418762 821167350 821009874
2510.8H21009874j62899k41339l04342k64883j78158j94788l34859m44651m24683l32653
$$ 821009874 820846975 820605636 820301294 820036411 819858253 819663465 819328606 818883955 818459272 818126619
2531.2H18126619k93255l76701m84705m61042l41833l01123l71336m74215n41925m92216
$$ 818126619 817833364 817456663 816971958 816510916 816169083 815867960 815496624 815022409 814480484 813988268
2551.6H13988268l52561k98381l71277m43876m21524l21388k82705l81589m98295m83334
$$ 813988268 813635707 813337326 812966049 812522173 812100649 811779261 811496556 811114967 810616672 810133338
2572H10133338l68416l03746l56435m32432m14491l41475k77281k56717l57687m72844
$$ 810133338 809764922 809461176 809104741 808672309 808257818 807916343 807639062 807382345 807024658 806551814
2592.4H06551814l82364j96695j61529k53021l52443l77357l02076k56360l63767n43475
$$ 806551814 806169450 805972755 805811226 805558205 805205762 804828405 804526329 804269969 803906202 803362727
2612.8H03362727o16729n51164m91083n37515o23822o58989o31094n82278o07550p54594
$$ 803362727 802745998 802194834 801703751 801166236 800542414 799883425 799252331 798670053 798062503 797307909
2633.2G97307909q78454q18133o75976o62029p53701q04067p73251o80089o17623p01189
$$ 797307909 796429455 795611322 794935346 794273317 793519616 792715549 791942298 791262209 790644586 789943397
2653.5G89943397q37505q30710o84619n66482n74887o66857p08401o22392n43534o00696
$$ 789943397 789105892 788275182 787590563 787024081 786449194 785782337 785073936 784451544 783908010 783307314
2673.9G83307314p13527p54059o53505n01156m76539n67615o33240n92410n21481n30959
$$ 783307314 782593787 781839728 781186223 780685067 780208528 779640913 779007673 778415263 777893782 777362823
2694.3G77362823o01410o91653p36832o78957o18040o69301p59065p37012o32762n75245
$$ 777362823 776761413 776069760 775332928 774653971 774035931 773366630 772607565 771870553 771237791 770662546
2714.7G70662546o25074p35998p48455o34313n16415m90844n84423o63817n96941m54783
$$ 770662546 770037472 769301474 768553019 767918706 767402291 766911447 766327024 765663207 765066266 764611483
2735.1G64611483l95656m72009n70834n58078m36902l69072m64618n75126n42759m17889
$$ 764611483 764215827 763743818 763172984 762614906 762178004 761808932 761344314 760769188 760226429 759808540
2755.5G59808540l36647l75151m51386m51446l77834l26156l84868m78506n00738m87387
$$ 759808540 759471893 759096742 758645356 758193910 757816076 757489920 757105052 756626546 756125808 755638421
2775.9G55638421m81129n40316o71268p32779o87957o36876o85453q51870r61899r03845
$$ 755638421 755157292 754616976 753945708 753212929 752524972 751888096 751202643 750350773 749388874 748485029
2796.3G48485029q38399r06289j055717j181782j205146j156986j169443j277804j362682
$$ 748485029 747646630 746740341 745684624 744502842 743297696 742140710 740971267 739693463 738330781
2814.7G38330781j374959j358271j334310j388848j562178j701295j686454j642465
$$ 738330781 736955822 735597551 734263241 732874393 731312215 729610920 727924466 726282001
2831G26282001j702011j828849j933396k022386k157092k313673k498925k703965k744853
$$ 726282001 724579990 722751141 720817745 718795359 716638267 714324594 711825669 709121704 706376851
2849.3G06376851k501727k136528j897395j808643j823723j998246k278566k616048
$$ 706376851 703875124 701738596 699841201 698032558 696208835 694210589 691932023 689315975
2865.7F89315975l035307l328562l392041l472686l605365l547669l226936k753794
$$ 689315975 686280668 682952106 679560065 676087379 672482014 668934345 665707409 662953615
2882F62953615k264321j861572j525760j178622q10504n07235m20153n37277o55055
$$ 662953615 660689294 658827722 657301962 656123340 655312836 654805601 654385448 653848171 653193116
2900.3F53193116p07328p87139r65238j248121j564980j915395k333939k630353k674758
$$ 653193116 652485788 651698649 650733411 649485290 647920310 646004915 643670976 641040623 638365865
2918.7F38365865k574682k318204j876056j269877n85198j1206N69463J350045K165317
$$ 638365865 635791183 633472979 631596923 630327046 629741848 629730642 630300105 631650150 633815467
2937F33815467K807200L270865L588378L754556L788650L799558L851891L804743L660977
$$ 633815467 636622667 639893532 643481910 647236466 651025116 654824674 658676565 662481308 666142285
2955.4F66142285L617108L668964L597736L288865K963126K834558K772212K682805
$$ 666142285 669759393 673428357 677026093 680314958 683278084 686112642 688884854 691567659
2971.7F91567659K622128K535581K480448K462625K234936J888096J725495J694143
$$ 691567659 694189787 696725368 699205816 701668441 703903377 705791473 707516968 709211111
2988G09211111J645088J453340J103163Q26061O02543L38078J86980P5876r5010j83999
$$ 709211111 710856199 712309539 713412702 714238763 714841306 715179384 715366364 715442240 715347230 715163231
3008.4G15163231k26200m03166o99639r65655j147032j259922j289607j321077j421094
$$ 715163231 714937031 714533865 713834226 712868571 711721539 710461617 709172010 707850933 706429839
3026.8G06429839j444876j380622j366616j489341j682699j723528j654684j675785
$$ 706429839 704984963 703604341 702237725 700748384 699065685 697342157 695687473 694011688
3043.1F94011688j788318j901925j895427j839578j856149j871168j943767k047599
$$ 694011688 692223370 690321445 688426018 686586440 684730291 682859123 680915356 678867757
3059.4F78867757j996994j840055j727879j833319k078653k129912j945138j696706
$$ 678867757 676870763 675030708 673302829 671469510 669390857 667260945 665315807 663619101
3075.7F63619101j598358j777649k029598k131521k092720j971721j927316k045393
$$ 663619101 662020743 660243094 658213496 656081975 653989255 652017534 650090218 648044825
3092.1F48044825k095819j949191j777232j818955k028167k049744j847386j757622
$$ 648044825 645949006 643999815 642222583 640403628 638375461 636325717 634478331 632720709
3108.4F32720709j864791j844585j663089j669466j814485j973629k170622k177716
$$ 632720709 630855918 629011333 627348244 625678778 623864293 621890664 619720042 617542326
3124.7F17542326j960694j786232j786590j858592j820862j682878j650214j771331
$$ 617542326 615581632 613795400 612008810 610150218 608329356 606646478 604996264 603224933
3141F03224933j865327j868189j787245j571536j400292j575351j886427j892805j704991
$$ 603224933 601359606 599491417 597704172 596132636 594732344 593156993 591270566 589377761 587672770
3159.4E87672770j614630j640320j666784j644612j592397j503826j454353j476765
$$ 587672770 586058140 584417820 582751036 581106424 579514027 578010201 576555848 575079083
3175.7E75079083j516759j517832j429677j340568j347542j398862j428365j421333
$$ 575079083 573562324 572044492 570614815 569274247 567926705 566527843 565099478 563678145
3192E63678145j392006j376391j368761j332521j273334j208961j167059j199127j259207
$$ 563678145 562286139 560909748 559540987 558208466 556935132 555726171 554559112 553359985 552100778
3210.3E52100778j266480j219749j112581j049101j153350j220882j103580r85801
$$ 552100778 550834298 549614549 548501968 547452867 546299517 545078635 543975055 542989254
3226.7E42989254r50098q99673q98361j084268j228034j142085r88185q64566p68304
$$ 542989254 542039156 541139483 540241122 539156854 537928820 536786735 535798550 534933984 534165680
3245E34165680q02934r69112r98318q50499p70032q38935q69871p85172p54475p39932
$$ 534165680 533362746 532393634 531395316 530544817 529774785 528935850 528065979 527280807 526526332 525786400
3265.4E25786400n69642l91125n00322p50184q74817q74937p49290o57439p02977p12157
$$ 525786400 525216758 524825633 524325311 523575127 522700310 521825373 521076083 520418644 519715667 519003510
3285.8E19003510n94079m04775l66390n67138p97808r22561q37266n54979l54052n01811
$$ 519003510 518409431 518004656 517638266 517071128 516273320 515350759 514513493 513958514 513604462 513102651
3306.2E13102651q75414j094043j058459r44972q98779q95619q48353p43449p15494
$$ 513102651 512227237 511133194 510074735 509129763 508230984 507335365 506487012 505743563 505028069
3324.6E05028069r20176j117528j042902q81970p70927p15732q63940j082569j130998
$$ 505028069 504107893 502990365 501947463 501065493 500294566 499578834 498714894 497632325 496501327
3342.9D96501327j110465j000970q32975r51708j223474j239688j088798j018226j078754
$$ 496501327 495390862 494389892 493556917 492605209 491381735 490142047 489053249 488035023 486956269
3361.3D86956269j090259q55982p21276j032382j406074j375288j040369q28951q85517
$$ 486956269 485866010 485010028 484288752 483256370 481850296 480475008 479434639 478605688 477720171
3379.6D77720171j001984r48280p23511m52727k45869l76075p75189q06868l51727
$$ 477720171 476718187 475769907 475046396 474593669 474347800 473971725 473196536 472389668 472037941
3398D72037941j35898n91010j042724p96825l52829k68430l69310m86434m78357k80142
$$ 472037941 471902043 471311033 470268309 469471484 469118655 468850225 468480915 467994481 467516124 467235982
3418.4D67235982j72138k28673k14487l6925J76280J87546J48714K30998J15156j62572
$$ 467235982 467063844 466835171 466620684 466583759 466760039 466947585 467096299 467327297 467442453 467279881
3438.8D67279881j45942J49608L37750K79307K01643L12209M70578N43386O22809P31528
$$ 467279881 467133939 467283547 467621297 467900604 468102247 468414456 468885034 469428420 470051229 470782757
3459.2D70782757O65724O09428Q56399J005352O94990L03745L11971N90950Q68529
$$ 470782757 471448481 472057909 472914308 473919660 474614650 474918395 475230366 475821316 476689845
3477.5D76689845Q93742O41436O18666Q31395P84904O56068P89553R64344R74238Q84980
$$ 476689845 477583587 478225023 478843689 479675084 480459988 481116056 481905609 482869953 483844191 484729171
3497.9D84729171Q92818R23693P67946O49810P17491Q83430J132429J141876Q98659
$$ 484729171 485621989 486545682 487313628 487963438 488680929 489564359 490696788 491838664 492737323
3516.3D92737323Q71390J093358J301736J190513R04262Q76844J021355J164675J340330
$$ 492737323 493608713 494702071 496003807 497194320 498098582 498975426 499996781 501161456 502501786
3534.6E02501786J324773J170396J332522J568019J418352J099706J140058J272082
$$ 502501786 503826559 504996955 506329477 507897496 509315848 510415554 511555612 512827694
3551E12827694J200378J275778J546502J761139J794576J640857J470863J704336K148270
$$ 512827694 514028072 515303850 516850352 518611491 520406067 522046924 523517787 525222123 527370393
3569.3E27370393K132833J937032J994491K210259K469182K707005K696573K357722
$$ 527370393 529503226 531440258 533434749 535645008 538114190 540821195 543517768 545875490
3585.6E45875490K139032K568721K842725K644598K584934K812326K918363K961934
$$ 545875490 548014522 550583243 553425968 556070566 558655500 561467826 564386189 567348123
3601.9E67348123K998173K779841K662421K908825L140867L227532L025889K742053
$$ 567348123 570346296 573126137 575788558 578697383 581838250 585065782 588091671 590833724
3618.3E90833724K992808L222287L040373K599478K267540K828061L200948L055037
$$ 590833724 593826532 597048819 600089192 602688670 604956210 607784271 610985219 614040256
3634.6F14040256K844929K667845K734243K957523K978921K673447K406896K616405
$$ 614040256 616885185 619553030 622287273 625244796 628223717 630897164 633304060 635920465
3650.9F35920465K704442K511382K670705K777994K392113K218962K426326K269566
$$ 635920465 638624907 641136289 643806994 646584988 648977101 651196063 653622389 655891955
3667.2F55891955J815855K105833K257585J698673J739979J981377J982629K175749
$$ 655891955 657707810 659813643 662071228 663769901 665509880 667491257 669473886 671649635
3683.5F71649635K351105K098620J380801J217783J617849J748442J644671J401544
$$ 671649635 674000740 676099360 677480161 678697944 680315793 682064235 683708906 685110450
3699.8F85110450J146555J272499J543105J469076R10639N77033J163661J515329J351059
$$ 685110450 686257005 687529504 689072609 690541685 691452324 692029357 693193018 694708347 696059406
3718.2F96059406J139998J007378Q25107Q02994J117468J234293R91404O06895O75737
$$ 696059406 697199404 698206782 699031889 699834883 700952351 702186644 703178048 703784943 704460680
3736.5G04460680J213670J208067M28438J00375R29355Q38340K41100O79076J122058
$$ 704460680 705674350 706882417 707310855 707411230 708340585 709178925 709420025 710099101 711221159
3754.9G11221159Q37564N55098Q00967R15051P03633O31570N06461M68433P01249Q36491
$$ 711221159 712058723 712613821 713414788 714329839 715033472 715665042 716171503 716639936 717341185 718177676
3775.3G18177676P51913N53846N65469N60940M13000M32790N57541O45936O45101O11365
$$ 718177676 718929589 719483435 720048904 720609844 721022844 721455634 722013175 722659111 723304212 723915577
3795.7G23915577O27696L24607J62065O48380N10812K34365O00278Q02279M93348K73466
$$ 723915577 724543273 724867880 725029945 725678325 726189137 726423502 727023780 727826059 728319407 728592873
3816.1G28592873M72366J08004R2506P46429P21932M86493L61681M08113O71089M76658
$$ 728592873 729065239 729173243 729265749 730012178 730734110 731220603 731582284 731990397 732661486 733138144
3836.5G33138144p0691n1618K77162N98013Q55506Q30292K49625q28564l94345Q75175
$$ 733138144 733067453 733015835 733292997 733891010 734746516 735576808 735826433 734997869 734603524 735478699
3856.9G35478699Q67069M52280J59323L22581N51700K30313N1975J63495L15547N08011
$$ 735478699 736345768 736798048 736957371 737279952 737831652 738061965 738113940 738277435 738592982 739100993
3877.3G39100993L12507K48492L42965J56462K92182L13163L6478K21014M78267K80202
$$ 739100993 739413500 739661992 740004957 740161419 740453601 740766764 740803242 741024256 741502523 741782725
3897.7G41782725j7047j06871n4658J86503L80338M02152M25696L23892L9518p0989
$$ 741782725 741765678 741658807 741604149 741790652 742170990 742573142 742998838 743322730 743362248 743291259
3918.1G43291259J02162J64628O7532J30296K97666K59280J53661J74105J36673Q6367
$$ 743291259 743393421 743558049 743625581 743755877 744053543 744312823 744466484 744640589 744777262 744863629
3938.5G44863629J08362J14023J52827J45495P0571J05977K28942K82884J57117k3007
$$ 744863629 744971991 745086014 745238841 745384336 745454907 745560884 745789826 746072710 746229827 746206820
3958.9G46206820n4896O0439J76668J50264O9201J17600K41279K66850J75059M3988
$$ 746206820 746151924 746212363 746389031 746539295 746608496 746726096 746967375 747234225 747409284 747453272
3979.3G47453272J3709Q7798R1970M4823J4305L1292J38819K24889K14577
$$ 747453272 747466981 747554779 747646749 747691572 747705877 747737169 747875988 748100877 748315454
3997.6G48315454
$$ 748315454
##END=$$ End of the data block
