##TITLE=$$ Begin of the data block
##JCAMP-DX=5.00 $$ ACD/SpecManager v 10.08
##SPECTROMETER/DATA SYSTEM=Alpha
##DATE=23 Dec 2014 10:50:12
##DATA TYPE=INFRARED SPECTRUM
##DATA CLASS=XYDATA
##ORIGIN=
##OWNER=
##NPOINTS=1765
##FIRSTX=399.76428223
##LASTX=3997.64306641
##MAXX=3997.64306641
##MINX=399.76428223
##MAXY=0.83617830
##MINY=0.25168812
##XFACTOR=1.0000000000
##YFACTOR=1.000000000000000e-9
##FIRSTY=0.58883780
##DELTAX=2.03961372
##XUNITS=1/CM
##YUNITS=ARBITRARY UNITS
##XYDATA=(X++(Y..Y))
399.8E88837802m733085k707303j910090j612067j85252J812101K767265J740336o00398
418.1E83409309j708865q85427j349330l243148m357874l492952j881003j716376k668798
436.5E62105536j668691J800597M569649M409194L063321K797187L238380K711594
452.8E83026767O03974j185418j037001k36809j014531k959490l912926k996444k259195
471.2E68028927l300905m130781l057659j130759j88530q30352j430333l70264J018107
489.5E54607451M87089j471043k436041j661003q61287j733005l216446l410875k710879
507.9E37593961k484441l505230m840791n055607m264831l750563l913879l676057
524.2E06102562k068043P2181R09567P52211J298070L364861N698681O239235M701853
$$ y = [588837802, 584104717, 581397414, 579487324, 577875257, 577690005, 579502106, 582269371, 584009707, 583409309, 581700444, 580815017, 579465687, 576222539, 571864665, 568371713, 566490710, 564774334, 562105536, 560436845, 562237442, 566807091, 571216285, 574279606, 577076793, 580315173, 583026767, 583630741, 582445323, 581408322, 581171513, 580156982, 577197492, 573284566, 570288122, 568028927, 564728022, 560597241, 557539582, 556408823, 556220293, 555389941, 553959608, 553589344, 554607451, 555094540, 553623497, 551187456, 549526453, 548665166, 546932161, 543715715, 540304840, 537593961, 535109520, 531604290, 526763499, 521707892, 517443061, 513692498, 509778619, 506102562, 504034519, 504106700, 505016267, 505768478, 507066548, 510431409, 516130090, 522369325, 527071178]
542.5E27071178K761185J916349J423955k15590k250493k996861k685190l022730m592657
560.9E17409146o248772o974340p021278p014096o740421n142540j892954J671672
577.2D78046417M027844N286246O348253P434159P622182N903840L243804J476765
593.5E19389510J102746R83178M6254j016558q92102K97427J143455Q29637M35114
611.9E22318661J315415K925694L760576L465534L259241L989756M782796M319370
628.2E50137043K822280J862347K162457K652466K045035Q14319L87609J154184J949728
646.6E65987468J488983L92020L36647J358748J947224J291215L11256M27484J313985
664.9E74855030J966655J511037M60863J000583K256692K422273J272202N99563J334309
$$ y = [527071178, 529832363, 531748712, 533172667, 532957077, 530706584, 527709723, 525024533, 522001803, 517409146, 511160374, 504186034, 497164756, 490150660, 483410239, 478267699, 476374745, 478046417, 482074261, 487360507, 493708760, 501142919, 508765101, 514668941, 517912745, 519389510, 520492256, 521475434, 521521688, 520505130, 519613028, 519910455, 521053910, 521883547, 522318661, 523634076, 526559770, 530320346, 533785880, 537045121, 541034877, 545817673, 550137043, 552959323, 554821670, 556984127, 559636593, 561681628, 562495947, 562883556, 564037740, 565987468, 567476451, 567868471, 568205118, 569563866, 571511090, 572802305, 573113561, 573541045, 574855030, 576821685, 578332722, 578793585, 579794168, 582050860, 584473133, 585745335, 586344898, 587679207]
683.3E87679207K165675J586199o199r46283o77586n45680j811087l609181m082739
701.6E79752326k970159j694381j185954p73907P09474L086448M737318M813432M564226
720E91038823N383611O709576O917834N535960M107296M081309M584253L835380J831949
738.3F34025991L15011K00331J81853j423418l901660n139411m717946m206061m787326
756.7F10547364n624533m953921k631724k91705J133323K518296M944205P776142R283959
775.1F22701406Q843482P712185P323504P421613O649732M674614L161013L458500
791.4F71946049M563689M677653L735006L310561M157901M926562L988326K003789
807.7G03309536J164794J960516K517939J528263j04607o30974L7074k6703j848102
$$ y = [587679207, 589844882, 591431081, 591424882, 590478599, 589801013, 589255333, 587444246, 583835065, 579752326, 576782167, 575087786, 573901832, 573127925, 573837399, 576923847, 581661165, 586474597, 591038823, 596422434, 603132010, 610049844, 615585804, 619693100, 623774409, 628358662, 632194042, 634025991, 634341002, 634541333, 634723186, 633299768, 629398108, 624258697, 619540751, 615334690, 610547364, 604922831, 599968910, 597337186, 597045481, 598178804, 600697100, 605641305, 613417447, 622701406, 631544888, 639257073, 646580577, 654002190, 660651922, 665326536, 668487549, 671946049, 676509738, 681187391, 684922397, 688232958, 692390859, 697317421, 701305747, 703309536, 704474330, 706434846, 708952785, 710481048, 710376441, 709745467, 709782541, 709755838, 707907736]
826G07907736l948807m570783m128158m326880n573630o336987n427718l794849l223896
844.4F66576028l944516m415334l648877k732515l222108m659235m723251j876593
860.7F37353599K763987O568372Q537471J0059893J1719644J1770308R047330N119324
877G02939928K188086M63009j429796m184962o489574o776631n639017m958093n338431
895.4F70774519n606293m823923l873170m245221n932629p452906p916510q183300
911.7F22740567r277284j0590256j0587155q749605o099879m018248k816200j592219
928E69009721K23935J943827K794444L168822M086017N591214O214440M500389Q87394
946.4E98420203k905309o138683r284019j2416184j4719844j5727818j6209781j7238081
$$ y = [707907736, 703958929, 699388146, 695259988, 690933108, 685359478, 679022491, 673594773, 669799924, 666576028, 662631512, 658216178, 654567301, 651834786, 648612678, 643953443, 639230192, 637353599, 640117586, 646685958, 655223429, 665283322, 677002966, 688773274, 697820604, 702939928, 705128014, 705591023, 704161227, 699976265, 693486691, 686710060, 681071043, 676112950, 670774519, 665168226, 660344303, 656471133, 652225912, 646293283, 638840377, 630923867, 622740567, 613463283, 602873027, 592285872, 583536267, 577436388, 573418140, 570601940, 569009721, 569233656, 571177483, 573971927, 577140749, 581226766, 586817980, 593032420, 597532809, 598420203, 595514894, 589376211, 580092192, 567676008, 552956164, 537228346, 521018565, 503780484]
962.7E03780484j8852293k0170182k0764858k1194011k1942466k2647023k2499085
977C55710566k1135449j8940628j6452402j3804972j0912001p932544n292386l318190
993.3B57921994j935929q39085J05232O41734N48720l3259p20799j137734j212984
1011.6B53337890j038104o11663J88291J294195K382309L161818L657579M092634M475444
1030B70940393M534453L983528K972692K025396J502901J295745J211107J367092K072007
1048.4B91905314L424674N074739O571413P855445R254276J0892660J2264430J2215466
1064.7C59458417R397417L166735n027532j1516363j3151765j0186195n466700j320123
1081C25353891J580119L494382M923701O254852P380605P729381P013112N598217M037619
$$ y = [503780484, 484928191, 464758009, 443993151, 422799140, 400856674, 378209651, 355710566, 334575117, 315634489, 299182087, 285377115, 274465114, 266532570, 261240184, 257921994, 255986065, 255146980, 255252212, 255893946, 256442666, 256409407, 255688608, 254550874, 253337890, 252299786, 251688123, 251876414, 253170609, 255552918, 258714736, 262372315, 266464949, 270940393, 275474846, 279458374, 282431066, 284456462, 285959363, 287255108, 288466215, 289833307, 291905314, 295329988, 300404727, 306976140, 314831585, 324085861, 334978521, 347242951, 359458417, 368855834, 372022569, 366995037, 355478674, 342326909, 332140714, 326674014, 325353891, 326934010, 330428392, 335352093, 341606945, 348987550, 356716931, 363730043, 369328260, 373365879]
1099.4C73365879K576143J433014J147360K089739L747255N047678N283118M639298
1115.7C99329484L819316L188580K650470K213687K338797L389388M802018N169302
1132D26901042L625572O55681k696842n725115q148581r685546r979397q974344p181615
1150.3C78790855n279213l509551j668096M34816K671600M807263O880224R179950
1166.7C92307848J1703968J3936847J5271098J5680194J5721798J5838056J5730143
1180.9D96189952J4771044J3063014J1352896R922624Q159339N706728L336310K059281
1197.3E64561188J886845J939237J691341J652718K480924L879964M859865M895926
1213.6E87848008M498601M257500L847599K631962P68364p40648j229584j237333j579225
$$ y = [373365879, 375942022, 377375036, 378522396, 380612135, 384359390, 389407068, 394690186, 399329484, 403148800, 406337380, 408987850, 411201537, 413540334, 416929722, 421731740, 426901042, 430526614, 431182295, 428485453, 422760338, 414611757, 404926211, 394946814, 385972470, 378790855, 373511642, 370002091, 368333995, 368768811, 371440411, 376247674, 383127898, 392307848, 404011816, 417948663, 433219761, 448899955, 464621753, 480459809, 496189952, 510960996, 524024010, 535376906, 545299530, 553458869, 559165597, 562501907, 564561188, 566448033, 568387270, 570078611, 571731329, 574212253, 578092217, 582952082, 587848008, 592346609, 596604109, 600451708, 603083670, 603852034, 603111386, 601881802, 600644469, 599065244]
1231.9E99065244k156675k229869j541495p34866l96907k21491M46975J567066K365827
1250.3E96163809K310574J748741J443327J564621J552344J121461Q58069J321137
1266.6F08084083K118110K335370J609504N45144m9531j63913m08769r86695j450419
1285F11632884j416207j118719j191736j777112k259195k174675j836539j818120k137542
1303.3E95903039k257347j886785j401723j330792j621843j734853j493156j381039
1319.6E82795501j986444l218770m370690m971861n192996n277276m971861l974975
1336E48830628k467453r88066j42515R3639K94208N47648M06861k18928q44955j027882
1356.4E44483185r21488j007795j367212j344263q24273k49803J90556L40641N59926
$$ y = [599065244, 596908569, 594678700, 593137205, 592402339, 592005432, 591783941, 592230916, 593797982, 596163809, 598474383, 600223124, 601666451, 603231072, 604783416, 605904877, 606762946, 608084083, 610202193, 612537563, 614147067, 614692211, 614642680, 614478767, 614069998, 613083303, 611632884, 610216677, 609097958, 607906222, 606129110, 603869915, 601695240, 599858701, 598040581, 595903039, 593645692, 591758907, 590357184, 589026392, 587404549, 585669696, 584176540, 582795501, 580809057, 577590287, 573219597, 568247736, 563054740, 557777464, 552805603, 548830628, 546363175, 545375109, 545232594, 545326233, 545620441, 546168089, 546574950, 546356022, 545511067, 544483185, 543561697, 542553902, 541186690, 539842427, 539018154, 538768351, 538958907, 539299548, 539859474]
1374.7E39859474R81927J267910J281678J367927K229929L939450M745483L545463
1391E59219241J844466N27918j39117m86612r18806j569152k041459j775682j489401
1409.4E53171396j671970j794159j519442j036167l19719K04146L51250P16090J298726
1427.7E49400151J723647J705170J407444J685739K508342K445042J872897J258195
1444.1E64006627Q34703N59926n960q72910j609743k171040j300871N51522J280725
1462.4E61272979K409696M294277N451321O683111R293139J0302484R308875Q525670
1478.7F17541552P800042O981373N977929N672157O119549N929827M334271L469825
1495F63826525M015029M236817L304184K162456J716375K771855L263414K252340J437545
$$ y = [539859474, 540841401, 542109311, 543390989, 544758916, 546988845, 550928295, 555673778, 559219241, 561063707, 561591625, 561452508, 560965896, 560047090, 558477938, 556436479, 554660797, 553171396, 551499426, 549705267, 548185825, 547149658, 546829939, 547034085, 547385335, 548101425, 549400151, 551123798, 552828968, 554236412, 555922151, 558430493, 560875535, 562748432, 564006627, 564841330, 565401256, 565395296, 564522386, 562912643, 560741603, 559440732, 559992254, 561272979, 563682675, 567976952, 573428273, 580111384, 589404523, 599707007, 609015882, 617541552, 625341594, 632322967, 638300896, 643973053, 650092602, 656022429, 660356700, 663826525, 667841554, 672078371, 675382555, 677545011, 679261386, 682033241, 685296655, 687548995, 688986540]
1513.4F88986540J254737J788855J886785J411259J131117J227737J575410J385927
1529.7G00648367N76556J907K69950L03149k40922m32670K205L79146L38196j33514
1550.1G01712370o37710q67844q65459j076937p10189n6684k52784k62618k29716m41492
1570.5F96310937m81367n85377m42386L5465k10345p93755q88288p04169q36432j352489
1590.9F90051794j770198j766444j530706j680971k346217k819181k751291k668261
1607.2F72718525l077269l531992l646672m106521m512191l447235l326774m132151
1623.5F42937720l693998l192842l175616k741635k557278k634704j431823n18143
1639.9F22991681m40121l09705J90556J203298J421571J410604K848327L433108L134072
$$ y = [688986540, 690241277, 692030132, 693916917, 695328176, 696459293, 697687030, 699262440, 700648367, 701224923, 701226830, 701496780, 701799929, 701559007, 701126337, 701128542, 701507688, 701845884, 701712370, 701074660, 700206816, 699341357, 698264420, 697554231, 697497547, 697244763, 696982145, 696752429, 696310937, 695829570, 695244193, 694801807, 694837272, 694626927, 693833172, 692944884, 692240715, 691404283, 690051794, 688281596, 686515152, 684984446, 683303475, 680957258, 678138077, 675386786, 672718525, 669641256, 666109264, 662462592, 658356071, 653843880, 650396645, 647069871, 642937720, 639243722, 636050880, 632875264, 630133629, 627576351, 624941647, 623509824, 622991681, 622551560, 622241855, 622432411, 623635709, 625057280, 626467884, 629316211, 632749319, 635883391]
1658.2F35883391L177762L646254M184902L973663M218996M910946M488468M705608
1674.5F69189990N427122M800260L954053M040301N742788N714714M582465M275501
1690.9G07727194L603518L561020L976106L855467M103184L472388L132581L468097
1707.2G36899555K994299K240479J777649J634657J771808J478791Q01444P16329J334846
1725.5G51649857J662910J423835J007378J149834J841068J693606J323819J274169
1741.9G63026476J476884J756668J941979K180636K547562K530217K462149K340436
1758.2G80263007J817763J598894J714528J590371J249432Q27730P67052J298547J502454
1776.5G92629778J166821P47442O42955Q87812J100897Q08597K85089M15504J003206
$$ y = [635883391, 639061153, 642707407, 646892309, 650865972, 655084968, 659995914, 664484382, 669189990, 674617112, 679417372, 683371425, 687411726, 693154514, 698869228, 703451693, 707727194, 711330712, 714891732, 718867838, 722723305, 726826489, 730298877, 733431458, 736899555, 739893854, 742134333, 743911982, 745546639, 747318447, 748797238, 749598682, 750315011, 751649857, 753312767, 754736602, 755743980, 756893814, 758734882, 760428488, 761752307, 763026476, 764503360, 766260028, 768202007, 770382643, 772930205, 775460422, 777922571, 780263007, 782080770, 783679664, 785394192, 786984563, 788233995, 789061725, 789828777, 791127324, 792629778, 793796599, 794544041, 795186996, 796074808, 797175705, 797984302, 798269391, 798684895, 799688101]
1794.9G99688101J089692P24852M56035O44028R18031Q96573N50807L01420N00262
1813.2H05769801Q01146Q10623N58615K74956K30849M99904N78642K90215K96950N56887
1833.6H10668588O08682N02944K35319o8962j4246M67480N34892J72019K4318K14756
1854H13345790L96728K54572r656j0669J94430J76370l5763M9532L42071M98414M69446
1876.5H15671265K57254N9604J56284M27842M09245O1393l4332K03311L66688L64125
1896.9H17942679J89662M1723J10448K34484J29879r3282q2254J23620J99854P6056
1917.3H18872869l1173N36J99199L77953K14458p6950p5936J69277K68578J01626j04248
1939.7H19916189j01924J70290L61026J99019j490O9917K52843K60353J17778M2439
$$ y = [799688101, 800777793, 801502645, 801958680, 802602708, 803520739, 804417312, 804968119, 805269539, 805769801, 806570947, 807381570, 807940185, 808215141, 808445990, 808945894, 809524536, 809814751, 810111701, 810668588, 811277270, 811780214, 812015533, 811946571, 811932325, 812399805, 812934697, 813106716, 813131034, 813345790, 813742518, 813997090, 813987434, 813976765, 814171195, 814347565, 814311802, 814361334, 814703405, 815201819, 815671265, 815928519, 815988123, 816144407, 816572249, 816981494, 817042887, 817008555, 817211866, 817578554, 817942679, 818132341, 818174064, 818284512, 818518996, 818648875, 818555593, 818473339, 818596959, 818796813, 818872869, 818841696, 818842232, 819041431, 819419384, 819633842, 819556892, 819480956, 819650233, 819918811, 820020437, 819916189, 819814265, 819984555, 820345581, 820544600, 820543110, 820613027, 820865870, 821126223, 821244001, 821286440]
1960.1H21286440J15991K08079J66595P3254N1916J33753K30908J72317J7882p570
1980.5H22449565J21772J70887L0875j42813j50740L3856J69217P2658r0003j05142
2000.9H22560132j2875M232j45555l01957k85029j83404k09570l51786m51923m93943
2021.3H20128322n49317n22434k75255q8274j50204k24113k56122l48031m21703l45051
2041.7H16947818k10107j85728k28762k09570j14918j7881r835o2823n9247J1742P7247
2064.1H15937936O1632K0921M5478Q4043Q9824O3598M530j0371L9339O9916O2525M8042
2088.6H16517413Q1420J39832J53840J29819R0479J10448J88827J80066Q6010L0696
2109H17708850N1856J10865J23441O4134K027j2994O318L0995L3736p987m2975Q464
$$ y = [821286440, 821402431, 821610510, 821777105, 821850359, 821902275, 822036028, 822266936, 822439253, 822457135, 822449565, 822571337, 822742224, 822773099, 822630286, 822479546, 822513402, 822682619, 822755277, 822665274, 822560132, 822547257, 822551489, 822405934, 822103977, 821818948, 821635544, 821425974, 821074188, 820622265, 820128322, 819579005, 819056571, 818781316, 818693042, 818542838, 818318725, 818062603, 817714572, 817292869, 816947818, 816737711, 816551983, 816323221, 816113651, 815998733, 815980852, 815971017, 815908194, 815848947, 815860689, 815937936, 815999568, 816020489, 816065967, 816150010, 816239834, 816303432, 816307962, 816297591, 816336930, 816406846, 816469371, 816517413, 816598833, 816738665, 816892505, 817022324, 817112803, 817223251, 817412078, 817592144, 817678154, 817708850, 817760706, 817871571, 817995012, 818059146, 818061173, 818048179, 818054497, 818085492, 818119228, 818111241, 818068266, 818076730]
2133.5H18076730P2062K7299n1439m2677K3365O1154O5327O3300Q3029J31309J43111
2155.9H18652570J20402J41024J97828K62082K84433K31743K81572M40121M62174L94285
2176.3H21468234L74258L85284M22418M38869L88622L25144L09288L47972L68536L23772
2196.7H25152397K75254K80202L54230M06444L50058K47419K38836L53038M11153L44992
2217.1H28414023K72155K64227L04580L19660K65896J95920J69099J77443K11298K29061
2237.5H30823362J84715J55329J90914K18570J77801Q3864Q2373K04444K28763J30594
2257.9H32480729R5009J64867K45690K26736J34290J12712J54495J63555J59264J53184
2278.3H34090531J42097J68741J96636J46746P1645Q9288J64509J70827Q7976L696
$$ y = [818076730, 818148792, 818176091, 818124652, 818081975, 818105340, 818166494, 818231821, 818295121, 818378150, 818509459, 818652570, 818772972, 818913996, 819111824, 819373906, 819658339, 819890082, 820171654, 820611775, 821073949, 821468234, 821842492, 822227776, 822650194, 823089063, 823477685, 823802829, 824112117, 824460089, 824828625, 825152397, 825427651, 825707853, 826062083, 826468527, 826818585, 827066004, 827304840, 827657878, 828069031, 828414023, 828686178, 828950405, 829254985, 829574645, 829840541, 830036461, 830205560, 830383003, 830594301, 830823362, 831008077, 831163406, 831354320, 831572890, 831750691, 831834555, 831916928, 832121372, 832350135, 832480729, 832575738, 832740605, 832986295, 833213031, 833347321, 833460033, 833614528, 833778083, 833937347, 834090531, 834232628, 834401369, 834598005, 834744751, 834816396, 834905684, 835070193, 835241020, 835328996, 835332692]
2298.7H35332692K0086J35363J94609J19686L815k9386M7505J02520O2704K2769K3783
2321.1H36036146L6120N9068M6969m9711j38700j17003j15276j87576k24352j92821
2341.5H35152864j60515k32994k21789o3122P1407J36792J06395p1645k20597j54257
2361.9H34342539j47700l40760m25458l25024k27153j80900j79827k14279j81914q3982
2382.3H32035542p3433j65642k21669j78993j14799j30593k13445k62975k23160j38641
2402.7H30312192j51455k95579l84987l34441k80500l16441m02153m38332l93272l32474
2423.1H26982558l65913m83394n27203m74393m13299m41313n41448n43475m48347m17649
2443.5H22326124m81427n44488n29945m52876m21346m76062n37276n13494m09425l56376
$$ y = [835332692, 835352778, 835488141, 835682750, 835802436, 835806251, 835776865, 835824370, 835926890, 835989594, 836012363, 836036146, 836072266, 836131334, 836178303, 836128592, 835989892, 835872889, 835757613, 835570037, 835345685, 835152864, 834992349, 834759355, 834537566, 834474444, 834545851, 834682643, 834789038, 834717393, 834496796, 834342539, 834194839, 833854079, 833428621, 833103597, 832876444, 832695544, 832515717, 832301438, 832119524, 832035542, 831962109, 831796467, 831574798, 831395805, 831281006, 831150413, 830936968, 830673993, 830450833, 830312192, 830160737, 829865158, 829480171, 829145730, 828865230, 828548789, 828146636, 827708304, 827315032, 826982558, 826616645, 826133251, 825606048, 825131655, 824718356, 824277043, 823735595, 823192120, 822743773, 822326124, 821844697, 821300209, 820770264, 820317388, 819896042, 819419980, 818882704, 818369210, 817959785, 817603409]
2463.9H17603409m25458n11884m81904l71694l44635m45544n03719m01914k92957l29256
2484.3H13494444m32134m30643l12806k41935k92480l52919l14414j85013j12891k17319
2504.7H10601890l70562l57389k17677j83463k86221l68655l41296k78533l22044m26292
2525.1H07449758m66824m23967l72768m22656n19693n40555n00321m96209n54144o00338
2545.5H02552283n87762n31911m66407m66049n68568o23286n20468m35412n11050o01709
2565.8G97239661n32925m16756m49478n60880n59866m47870l84867m21643n03898n39601
2586.2G92421877m28736k94745l21746m13477l94404l04580k88307l75450m72367m91142
2606.6G88636923m54486m73976n84483o77764o76632o49035o94335q13961r19461r46879
$$ y = [817603409, 817177951, 816666067, 816184163, 815812469, 815467834, 815022290, 814518571, 814116657, 813823700, 813494444, 813062310, 812631667, 812318861, 812076926, 811784446, 811431527, 811117113, 810932100, 810819209, 810601890, 810231328, 809873939, 809656262, 809472799, 809186578, 808817923, 808476627, 808198094, 807876050, 807449758, 806982934, 806558967, 806186199, 805763543, 805243850, 804703295, 804202974, 803706765, 803152621, 802552283, 801964521, 801432610, 800966203, 800500154, 799931586, 799308300, 798787832, 798352420, 797841370, 797239661, 796706736, 796289980, 795840502, 795279622, 794719756, 794271886, 793887019, 793465376, 792961478, 792421877, 791993141, 791698396, 791376650, 790963173, 790568769, 790264189, 789975882, 789600432, 789128065, 788636923, 788182437, 787708461, 787123978, 786446214, 785769582, 785120547, 784426212, 783612251, 782692790, 781745911]
2627G81745911r27389r02891r14157r88483j020849r59396r44019j027941j098156
2645.4G72962630j078725j017749j005173j030147j018822r60112r08375r11772r34243
2663.7G64097512r36985r47297r15944q28147q19087q45433p76171p12932p48574q19087
2684.1G55747855q39711p98106p47144p56800q37565q86082q64804q68559r41217j017988
2704.5G47189879j038551r92238r34184r22442r52482r73165r45627q93116q50142
2722.9G38687932q41021q37386p96258p55668p49767p55965p22707o30974n70477o27160
2743.3G31400549p24673p26521o43313n95867o12498o09100n64575n24223m85897m72843
2763.7G25441039n28515n78761n64277n62131o27578p14957p53046p43806p94947r33886
$$ y = [781745911, 780818522, 779915631, 779001474, 778012991, 776992142, 776032746, 775088727, 774060786, 772962630, 771883905, 770866156, 769860983, 768830836, 767812014, 766851902, 765943527, 765031755, 764097512, 763160527, 762213230, 761297286, 760469139, 759650052, 758804619, 758028448, 757315516, 756566942, 755747855, 754908144, 754110038, 753362894, 752606094, 751768529, 750882447, 750017643, 749149084, 748207867, 747189879, 746151328, 745159090, 744224906, 743302464, 742349982, 741376817, 740431190, 739538074, 738687932, 737846911, 737009525, 736213267, 735457599, 734707832, 733951867, 733229160, 732598186, 732027709, 731400549, 730675876, 729949355, 729306042, 728710175, 728097677, 727488577, 726924002, 726399779, 725913882, 725441039, 724912524, 724333763, 723769486, 723207355, 722579777, 721864820, 721111774, 720367968, 719573021, 718639135]
2784.1G18639135j013934r75073r73284j093209j224160j268744j253367j300871j441240
2802.4G08095253j576543j637638j631558j673996j808405j904488j893282j869738
2818.8F94099605j950383k108216k234757k297700k324581k410948k576053k672792
2835.1F75524175k713382k859354l144205l470421l705620l798127l762723l584742
2851.4F48485601l290772k942920k651632k634883k983034l532529m093825m583121
2867.7F21772885m978001n307913n565047n631864n431831n026460m495978l846347
2884E81489444l131688k449155j823842j313806r76324p99000p61986q19445j010298
2902.4E68403900j355529j682341j943171k341569k948999l573060l971636m071594
$$ y = [718639135, 717625201, 716650128, 715676844, 714583635, 713359475, 712090731, 710837364, 709536493, 708095253, 706518710, 704881072, 703249514, 701575518, 699767113, 697862625, 695969343, 694099605, 692149222, 690041006, 687806249, 685508549, 683183968, 680773020, 678196967, 675524175, 672810793, 669951439, 666807234, 663336813, 659631193, 655833066, 652070343, 648485601, 645194829, 642251909, 639600277, 636965394, 633982360, 630449831, 626356006, 621772885, 616794884, 611486971, 605921924, 600290060, 594858229, 589831769, 585335791, 581489444, 578357756, 575908601, 574084759, 572770953, 571794629, 570995629, 570233643, 569414198, 568403900, 567048371, 565366030, 563422859, 561081290, 558132291, 554559231, 550587595, 546516001]
2918.7E46516001l970146l712833l224254k406716j377702l81708O44446J850783L085554
2937E37023425M126251M893422N385220N687654N876482N990147O020248N917072N840958
2955.4E86760879N881071N823254N509317N046904M700959M520833M314423M049838
2971.7F26607478L853142L780961L794670L712654L377676K994001K798200K660274
2988F53579056K455950K147079J759588J515031J311958Q89063M50373J99616L5703
3006.4F64343417j31131l56555o88672j024246j233578j393854j620472j804292j878857
3024.7F54211760j940191k007604k101183k190292k248764k321541k356648k414942
3041.1F36630595k560497k675533k698541k671957k709508k792656k793729k813459
$$ y = [546516001, 542545855, 538833022, 535608768, 533202052, 531824350, 531442642, 532087088, 533937871, 537023425, 541149676, 546043098, 551428318, 557115972, 562992454, 568982601, 575002849, 580919921, 586760879, 592641950, 598465204, 603974521, 609021425, 613722384, 618243217, 622557640, 626607478, 630460620, 634241581, 638036251, 641748905, 645126581, 648120582, 650918782, 653579056, 656035006, 658182085, 659941673, 661456704, 662768662, 663657725, 664108098, 664307714, 664343417, 664212286, 663855731, 663167059, 662142813, 660909235, 659515381, 657894909, 656090617, 654211760, 652271569, 650263965, 648162782, 645972490, 643723726, 641402185, 639045537, 636630595, 634070098, 631394565, 628696024, 626024067, 623314559, 620521903, 617728174, 614914715]
3057.4F14914715k902567k923370k823948k680838k707899k951026l096402k937495
3073.7E91891170k666891k613306k838671l054321l062010k989411k940595k970577
3090E68755388l107428l128708k926171k754509k841651l045798l035605k827465k773643
3108.4E42314410k947807k941787k673567k574980k771497l065288l214299l081620
3124.7E19043565k859295k763569k812147k874017k758741k566457k606839k855211
3141D96947289k944500k806395k680182k544940k437562k569943k761901k745598k665848
3159.4D72790420k635956k558768k459794k457470k514570k456338k320558k272158
3175.7D53114808k325356k361685k307773k253831k221226k150476k104283k117723
$$ y = [614914715, 612012148, 609088778, 606264830, 603583992, 600876093, 597925067, 594828665, 591891170, 589224279, 586610973, 583772302, 580717981, 577655971, 574666560, 571725965, 568755388, 565647960, 562519252, 559593081, 556838572, 553996921, 550951123, 547915518, 545088053, 542314410, 539366603, 536424816, 533751249, 531176269, 528404772, 525339484, 522125185, 519043565, 516184270, 513420701, 510608554, 507734537, 504975796, 502409339, 499802500, 496947289, 494002789, 491196394, 488516212, 485971272, 483533710, 480963767, 478201866, 475456268, 472790420, 470154464, 467595696, 465135902, 462678432, 460163862, 457707524, 455386966, 453114808, 450789452, 448427767, 446119994, 443866163, 441644937, 439494461, 437390178, 435272455]
3192D35272455k123475k105147k070575k023161j976997j909375j854539j882583j898229
3210.3D17428374j809448j716762j684905j684784j725346j742483j665562j573056
3226.7D03826028j489699j353413j306653j510679j673669j589030j472503j345634
3243C92084748j172781j204968j429796j427680j153231j010925j160621j279742j189649
3261.3C81055355j082033j026094r19878q06898q99524j078635j092970j043648j018882
3279.7C72086793j001358r68695q68499p56889o90461o88195p83294r30935j049251
3298C64349216j003146p72268n85228o98358j027017j228869j180590j007735r26465
3316.4C55919540r61512r56029q62777q16048r81211j132459j029491q91656p94768
$$ y = [435272455, 433148980, 431043833, 428973258, 426950097, 424973100, 423063725, 421209186, 419326603, 417428374, 415618926, 413902164, 412217259, 410532475, 408807129, 407064646, 405399084, 403826028, 402336329, 400982916, 399676263, 398165584, 396491915, 394902885, 393430382, 392084748, 390911967, 389706999, 388277203, 386849523, 385696292, 384685367, 383524746, 382245004, 381055355, 379973322, 378947228, 378027350, 377220452, 376320928, 375242293, 374149323, 373105675, 372086793, 371085435, 370116740, 369248241, 368491352, 367800891, 367112696, 366329402, 365398467, 364349216, 363346070, 362573802, 361988574, 361290216, 360263199, 359034330, 357853740, 356846005, 355919540, 354958028, 354001999, 353139222, 352323174, 351341963, 350209504, 349180013, 348288357, 347493589]
3334.8C47493589p32273q81642j061469j068533j059264r73701p57903q09729j135677
3353.1C39013398j209230r83685q24570q69036r09865p32958n96077q21709j175195
3371.5C30891073j186222q85546o96719p49648q75830q18253n62399k95848j04278
3389.8C24716330k03640n54233o06299k17318j3203m04894p95096n80579k15769j33246
3410.2C20992053j76281l06577l97503k52754j07824j00136l517K31505L70562K60234
3430.6C20509762K65330M58389L01153r0033j17004J54197L57747M45903M71770N37634
3451C23294848O35743P01249Q06361Q49486O54429O35415J035422J239211Q49604L65556
3471.4C31067324M06831P64817J056344J069664P95514P45892R92507J011074Q92937
$$ y = [347493589, 346761316, 345879674, 344818205, 343749672, 342690408, 341716707, 340958804, 340149075, 339013398, 337804168, 336820483, 335995913, 335126877, 334217012, 333484054, 332887977, 332066268, 330891073, 329704851, 328819305, 328122586, 327372938, 326497108, 325678855, 325116456, 324820608, 324716330, 324512690, 323958457, 323352158, 323134840, 323121637, 322716743, 321921647, 321341068, 321125299, 320992053, 320815772, 320509195, 320111692, 319858938, 319751114, 319650978, 319647461, 319878966, 320249528, 320509762, 320775092, 321233481, 321534634, 321444601, 321327597, 321481794, 321839541, 322285444, 322757214, 323294848, 323930591, 324631840, 325438201, 326287687, 326942116, 327577531, 328612953, 329852164, 330701768, 331067324, 331474155, 332238972, 333295316, 334364980, 335160494, 335906386, 336898893, 337909967, 338802904]
3489.8C38802904R89824J145423J216709J151860J076848J074671R53973Q57710J019687
3508.1C48289609J287371J474976J412750J176357J127332J318783J512796J391470
3524.4C58991444J131147J182467J419812J573652J703561J674801J530707J662433
3540.8C70870024J849651J767874J538336J557231J795709J967162K029330K091586
3557.1C85466903K231122K274006K053410J947254K602309L260285L060311K783089
3573.4D05678689K891958L125012L328055L452868L353208L093213L165334L697545
3589.7D31785882L769844L602326L782660M038960M012912L945559L853739L629744
3606D62421626L765881M070580M073203M116773M043788M054636M535883M451007L840357
$$ y = [338802904, 339792728, 340938151, 342154860, 343306720, 344383568, 345458239, 346412212, 347269922, 348289609, 349576980, 351051956, 352464706, 353641063, 354768395, 356087178, 357599974, 358991444, 360122591, 361305058, 362724870, 364298522, 366002083, 367676884, 369207591, 370870024, 372719675, 374487549, 376025885, 377583116, 379378825, 381345987, 383375317, 385466903, 387698025, 389972031, 392025441, 393972695, 396575004, 399835289, 402895600, 405678689, 408570647, 411695659, 415023714, 418476582, 421829790, 424923003, 428088337, 431785882, 435555726, 439158052, 442940712, 446979672, 450992584, 454938143, 458791882, 462421626, 466187507, 470258087, 474331290, 478448063, 482491851, 486546487, 491082370, 495533377, 499373734]
3624.4D99373734L312826L561556M617572M570306M205525M106223L952563L848195
3640.7E31548500L792465L512382L129006L564477M597664M365086L752351L977179
3657E62239110M134357L612578L205598L108501K776385K521634L051817K961338K603590
3675.4E90214908L312290L494918L102720K872348K640188K317130K111495K390563
3691.7F12456560K682746K578675K183974J715660J607657J957416K046287J647592
3708F28876567J199543J384080K061724K079010J618684J260578J198233J257062J390516
3726.4F42325997J589179J366377Q40664P02679J402021J941621J475632M19200J45495
3744.7F52208865J180291J076579N79476J459599J970827J362682Q46267J079142J200258
$$ y = [499373734, 502686560, 506248116, 510865688, 515435994, 519641519, 523747742, 527700305, 531548500, 535340965, 538853347, 541982353, 545546830, 550144494, 554509580, 558261931, 562239110, 566373467, 569986045, 573191643, 576300144, 579076529, 581598163, 584649980, 587611318, 590214908, 593527198, 597022116, 600124836, 602997184, 605637372, 607954502, 610065997, 612456560, 615139306, 617717981, 619901955, 621617615, 623225272, 625182688, 627228975, 628876567, 630076110, 631460190, 633521914, 635600924, 637219608, 638480186, 639678419, 640935481, 642325997, 643915176, 645281553, 646122217, 646824896, 648226917, 650168538, 651644170, 652063370, 652208865, 653389156, 654465735, 655045211, 656504810, 658475637, 659838319, 660684586, 661763728, 662963986]
3763.1F62963986R81927R08614Q15868R54449J286030J181602P70569N56648P48396
3781.4F71168089Q13425P88807R19462R12010Q31783O88315M89831N14030K72572J83761
3801.8F77582085Q93891R16302Q55267J206517R97782L36826O9499M00066J98365M80354
3822.2F83936954J215398J026809O88553M90487M55141N99563K65360j07229M06980
3840.6F88978016R41694J081288R86159N85735k48909j124978J15335J626610J234055
3858.9F94175005M12226M947K96056N38528K13027L34084P44224Q38637O90639J64092
3879.3F98411465K12848O25729M58479M97520L97146R5904M60088O66440J43945l12686
3899.7G01656878k28345J61171P29262R22203O03557L31104K29061Q7738N3584K27094
$$ y = [662963986, 663945913, 664854527, 665670395, 666624844, 667910874, 669092476, 669863045, 670419693, 671168089, 671981514, 672770321, 673689783, 674601793, 675433576, 676121891, 676611722, 677125752, 677398324, 677582085, 678475976, 679392278, 680247545, 681454062, 682451844, 682788670, 682858169, 683258235, 683456600, 683936954, 685152352, 686179161, 686867714, 687358201, 687813342, 688412905, 688678265, 688571036, 688978016, 689919710, 691000998, 691987157, 692572892, 692323983, 691199005, 691314340, 692940950, 694175005, 694587231, 694592178, 694888234, 695426762, 695639789, 695973873, 696718097, 697556734, 698247373, 698411465, 698624313, 699250042, 699708521, 700206041, 700603187, 700699091, 701159179, 701825619, 701969564, 701656878, 701428533, 701589704, 702318966, 703241169, 703844726, 704175830, 704404891, 704492629, 704546213, 704773307]
3920.1G04773307K60591J77980K54750K37882O5446J94669M78089M00901J59382K7478
3940.5G07030475O5923K61247K38776R7573K41339M15027L57092J76191O7949J00852
3960.9G09052444K35080L05951J68264N5253J57535K75851K34842J10269O2882J90855
3981.3G10849226L09705K31982J05738M7624N8472J11342J51217J79887
3997.6G12045193
$$ y = [704773307, 705033898, 705211878, 705466628, 705704510, 705769956, 705964625, 706442714, 706843615, 707002997, 707030475, 707096398, 707357645, 707596421, 707693994, 707935333, 708350360, 708707452, 708883643, 708951592, 709052444, 709287524, 709593475, 709761739, 709816992, 709974527, 710250378, 710485220, 710595489, 710658371, 710849226, 711158931, 711390913, 711496651, 711544275, 711602747, 711714089, 711865306, 712045193]
##END=$$ End of the data block
