##TITLE=$$ Begin of the data block
##JCAMP-DX=5.00 $$ ACD/SpecManager v 10.08
##SPECTROMETER/DATA SYSTEM=Alpha
##DATE=23 Dec 2014 10:50:12
##DATA TYPE=INFRARED SPECTRUM
##DATA CLASS=XYDATA
##ORIGIN=
##OWNER=
##NPOINTS=1765
##FIRSTX=399.76428223
##LASTX=3997.64306641
##MAXX=3997.64306641
##MINX=399.76428223
##MAXY=0.83714116
##MINY=0.25159201
##XFACTOR=1.0000000000
##YFACTOR=1.000000000000000e-9
##FIRSTY=0.58824933
##DELTAX=2.03961372
##XUNITS=1/CM
##YUNITS=ARBITRARY UNITS
##XYDATA=(X++(Y..Y))
399.8E88249326m313648k008140k023816k302230p41720J665533K753734J574755o86765
418.1E82167029j352846m94004j434028l407955l924847k794802j736581k148628k959073
436.5E61914265j567840J914620M587471M461587L121376K844810L242553K529740
452.8E83048582M19557j141906q95440j89126j148402l064275l820062l018081k362430
471.2E67828417l127575l887951k998829j130641k08378j007974j534939j64628J086414
489.5E54853916K64406j581370k383769j653552r24766j708627l122210l382266k715588
507.9E37646174k589523l678084m901051m994214m133403l646195l879130l552914
524.2E06271660j940429m3988P27236O72102J265347L375948N768776O329953M701317
$$ y = [588249326, 583935678, 581927538, 579903722, 577601492, 576859772, 578525305, 581279039, 582853794, 582167029, 580814183, 580320179, 578886151, 575478196, 571553349, 568758547, 567021966, 564873338, 561914265, 560346425, 562261045, 566848516, 571310103, 574431479, 577276289, 580518842, 583048582, 583468139, 582326233, 581430793, 581241667, 580093265, 577028990, 573208928, 570190847, 567828417, 564700842, 560812891, 557814062, 556683421, 556475043, 555467069, 553932130, 553767502, 554853916, 555118322, 553536952, 551153183, 549499631, 548574865, 546866238, 543744028, 540361762, 537646174, 535056651, 531378567, 526477516, 521483302, 517349899, 513703704, 509824574, 506271660, 504331231, 504287243, 505014479, 505686581, 506951928, 510327876, 516096652, 522426605, 527127922]
542.5E27127922K764105K039135J480937l21984k412498l034890k563715k897441m553795
560.9E17627776o343425p077932o982535o920695o625504n024463j870691J607686
577.2D78390217L862053M989833O185025P535427P708431N937516L358543J547814
593.5E19514859J025557Q21531j4067q99970p80702K92480J053274Q47638O44266J406372
613.9E23911238K794265L691972L547191L305555L959715M784465M410684K923906
630.2E53328991J888454K144694K565146J933276P99299M77016J286924J967549J376271
648.6E67767620L29495L67105J489996K095879J216054J27315M22239J432717K030790
667E77279210J454771M30584R99570K221405K391160J270711N97239J333773K197682
$$ y = [527127922, 529892027, 531931162, 533412099, 533090115, 530677617, 527642727, 525079012, 522181571, 517627776, 511284351, 504206419, 497223884, 490303189, 483677685, 478653222, 476782531, 478390217, 482252270, 487242103, 493427128, 500962555, 508670986, 514608502, 517967045, 519514859, 520540416, 521361947, 521347880, 520447910, 519667208, 519959688, 521012962, 521860600, 522504866, 523911238, 526705503, 530397475, 533944666, 537250221, 541209936, 545994401, 550405085, 553328991, 555217445, 557362139, 559927285, 561860561, 562659860, 563136876, 564423800, 566391349, 567767620, 568097115, 568464220, 569954216, 572050095, 573266149, 573393464, 573815703, 575248420, 577279210, 578733981, 579164565, 580164135, 582385540, 584776700, 586047411, 586644650, 587978423, 590176105]
685.3E90176105J622558j0431r42588n88715m65333j858473l678441m058897k896369
703.7E77299416j656532j234412q75056O75320L113509M734337M854858M665077N431890
722E97008407O670475O813645N450011M134714M204035M724622L902316J783967K78473
740.4F34970665J84178Q2732j487494l849685n080223m724920m298508m931390n708278
758.7F05157077m945278k563238j96457J171470K474487M910230P839918R375096Q844137
777.1F32067442P649422P290423P430255O672800M717528L179253L431260M509091
793.4F76947474M579545L675818L359616M215658M898607L939092K040029J206040
809.7G04861879J918316K469599J508952j07169o26147J8120o0082j868844l974617
$$ y = [590176105, 591798663, 591788232, 590845644, 590256929, 589791596, 587933123, 584254682, 580195785, 577299416, 575642884, 574408472, 573533416, 574208736, 577322245, 582056582, 586911440, 591576517, 597008407, 603678882, 610492527, 615942538, 620077252, 624281287, 629005909, 632908225, 634692192, 634970665, 635154843, 635237575, 633750081, 629900396, 624820173, 620095253, 615796745, 610865355, 605157077, 600211799, 597648561, 597452104, 598623574, 601098061, 606008291, 613848209, 623223305, 632067442, 639716864, 647007287, 654437542, 661110342, 665827870, 669007123, 672438383, 676947474, 681527019, 685202837, 688562453, 692778111, 697676718, 701615810, 703655839, 704861879, 706780195, 709249794, 710758746, 710651577, 710025430, 710043550, 709983468, 708114624, 704140007]
828.1G04140007m588007m084945m280090n613268o392717n416692l785133l257871
844.4F66721284l946721m367113l634274k766252l229201m631221m691482j877963
860.7F37577057K709448O548345Q596838J0124147J1721968J1719764Q999705N066037
877G03063309K110720L89933j494765m217982o475747o763518n645215m954755n325079
895.4F70686901n594671m808128l882706m297853n977273p489979p970810q184671
911.7F22480810r220302j0555029j0570646q727669o117762m072129k815426j541257
928E68860590K56479J932323K738953L153682M155635N654932O212651M458428Q34763
946.4E98258436k945483o142139r283007j2457609j4777005j5735626j6163647j7206311
$$ y = [704140007, 699552000, 695467055, 691186965, 685573697, 679180980, 673764288, 669979155, 666721284, 662774563, 658407450, 654773176, 652006924, 648777723, 644146502, 639455020, 637577057, 640286505, 646834850, 655431688, 665555835, 677277803, 688997567, 697997272, 703063309, 705174029, 705563962, 704069197, 699851215, 693375468, 686611950, 680966735, 676011980, 670686901, 665092230, 660284102, 656401396, 652103543, 646126270, 638636291, 630665481, 622480810, 613260508, 602705479, 592134833, 583407164, 577289402, 573217273, 570401847, 568860590, 569117069, 571049392, 573788345, 576942027, 581097662, 586752594, 592965245, 597423673, 598258436, 595312953, 589170814, 579887807, 567430198, 552653193, 536917567, 520753920, 503547609]
962.7E03547609j8858194k0197839k0803899k1216750k1928787k2592664k2433311
977C55516165k1104305j8942267j6448945j3762593j0842294p900804n303174l320277
993.3B57891506j926273q38280J04070O62714N56171o7979p25925j093000j214236
1011.6B53348768j104236o52522K16186J353979K390325L104538L619880M092484M484326
1030B70853728M558772L995329K950281K011299J499474J276970J213223J431852K176136
1048.4B91967064L490389N039215O481796P813275R268433J0910988J2248575J2153387
1064.7C59373122R333432L136635n018413j1449754j3082862j0193587n508214j320898
1081C25269461J605332L472179M884869O290167P432878P733017P008821N595327M022181
$$ y = [503547609, 484689415, 464491576, 443687677, 422470927, 400542140, 377949476, 355516165, 334411860, 315469593, 299020648, 285258055, 274415761, 266514957, 261211783, 257891506, 255965233, 255126953, 255231023, 255893737, 256449908, 256381929, 255656004, 254563004, 253348768, 252244532, 251592010, 251808196, 253162175, 255552500, 258657038, 262276918, 266369402, 270853728, 275412500, 279407829, 282358110, 284369409, 285868883, 287145853, 288359076, 289790928, 291967064, 295457453, 300496668, 306978464, 314791739, 324060172, 334971160, 347219735, 359373122, 368706554, 371843189, 366824776, 355375022, 342292160, 332098573, 326590359, 325269461, 326874793, 330346972, 335231841, 341522008, 348954886, 356687903, 363696724, 369292051, 373314232]
1099.4C73314232K572298J456320J188725K132982L751993N009950N239039M597605
1115.7C99263144L810912L221631K667934K191245K315164L391713M811465N180985
1132D26854193L611118N89907k736956n680472q066117r635181r973585q969933p168084
1150.3C78824890n285591l529400j678347M62979K746194M873872O898850R151459
1166.7C92464906J1661261J3919503J5259266J5641749J5690505J5851468J5754372
1180.9D96243030J4757007J3027549J1337459R917021Q151054N706489L345907K072811
1197.3E64558327J903236J966119J709104J634716K462447L891170M851103M859269
1213.6E87835491M479766M265725L871918K640068P61867p41065j239359j254558j602173
$$ y = [373314232, 375886530, 377342850, 378531575, 380664557, 384416550, 389426500, 394665539, 399263144, 403074056, 406295687, 408963621, 411154866, 413470030, 416861743, 421673208, 426854193, 430465311, 431055218, 428318262, 422637790, 414571673, 404936492, 394962907, 385992974, 378824890, 373539299, 370009899, 368331552, 368794531, 371540725, 376414597, 383313447, 392464906, 404126167, 418045670, 433304936, 448946685, 464637190, 480488658, 496243030, 511000037, 524027586, 535365045, 545282066, 553433120, 559139609, 562485516, 564558327, 566461563, 568427682, 570136786, 571771502, 574233949, 578125119, 582976222, 587835491, 592315257, 596580982, 600452900, 603092968, 603854835, 603113770, 601874411, 600619853, 599017680]
1231.9E99017680k166689k199888j515210p35044l91841k18272M52459J590252K377033
1250.3E96210480K302348J753748J472235J584291J557827J150191Q82566J288354
1266.6F08202040K061784K303958J601756N48601l9398j51337m09245r96113j431882
1285F11690164j371026j085163j180410j777709k270996k200961j864910j825452k113521
1303.3E96000016k221704j873970j402616j321435j627386j762509j515746j387060
1319.6E82887590j982093l220618m366278m941583n161405n265116m981518l992558
1336E48976421k452314r46521j24395Q8513K79844N33699M13597k13385q61465j023770
1356.4E44670224q91685j002133j395166j371861q24093k43724J75774L27468N48840
$$ y = [599017680, 596850991, 594651103, 593135893, 592400849, 592009008, 591790736, 592243195, 593833447, 596210480, 598512828, 600266576, 601738811, 603323102, 604880929, 606031120, 606913686, 608202040, 610263824, 612567782, 614169538, 614718139, 614678741, 614527404, 614118159, 613122046, 611690164, 610319138, 609233975, 608053565, 606275856, 604004860, 601803899, 599938989, 598113537, 596000016, 593778312, 591904342, 590501726, 589180291, 587552905, 585790396, 584274650, 582887590, 580905497, 577684879, 573318601, 568377018, 563215613, 557950497, 552968979, 548976421, 546524107, 545577586, 545453191, 545541704, 545821548, 546355247, 546768844, 546555459, 545693994, 544670224, 543778539, 542776406, 541381240, 540009379, 539185286, 538941562, 539117336, 539444804, 539993644]
1374.7E39993644R71973J281798J310527J395523K230108L890693M690707L535092
1391E59300065J840591N03123j35481m66585r31263j590193k037763j759350j484633
1409.4E53238511j665592j773000j503050j002133k39611K51472L42906O83725J263797
1427.7E49597025J706421J697481J408875J705646K515972K432585J874149J283586
1444.1E64221740Q63671N69820j4424q70347j562953k090752j319766M43220J225948
1462.4E61466157K437890M355252N493104O711900R300352J0264039R269237Q534849
1478.7F17832780P834494O978452N953908N682767O150186N919397M293501L450751
1495F64096236M017413M233539L321409K230406J815856K798378L184915K199411J445532
$$ y = [539993644, 540965617, 542247415, 543557942, 544953465, 547183573, 551074266, 555764973, 559300065, 561140656, 561643779, 561508298, 561041713, 560110450, 558520257, 556482494, 554723144, 553238511, 551572919, 549799919, 548296869, 547294736, 547055125, 547306597, 547649503, 548333228, 549597025, 551303446, 553000927, 554409802, 556115448, 558631420, 561064005, 562938154, 564221740, 565085411, 565655231, 565640807, 564770460, 563207507, 561116755, 559796989, 560240209, 561466157, 563904047, 568259299, 573752403, 580464303, 589764655, 600028694, 609297931, 617832780, 625667274, 632645726, 638599634, 644282401, 650432587, 656351984, 660645485, 664096236, 668113649, 672347188, 675668597, 677899003, 679714859, 682513237, 685698152, 687897563, 689343095]
1513.4F89343095J279056J774311J852095J409054J180112J261950J548469J344859
1529.7G00993001N54324P391L31580M14193j50800m92096r2149L38555L37899j32561
1550.1G02109337o66320q82984q28087j020670p22051q9943k53022k44438k16067m46975
1570.5F96738780m93050n91815m50730K6047k19643q06093r03666p06911q12590j325846
1590.9F90454483j763105j763404j517117j677155k356232k798914k707720k663493
1607.2F73207343l102124l522813l612280m095018m507661l405213l272057m116118
1623.5F43574059l702939l201246l214240k782166k547979k576709j401126n12004
1639.9F23635650m25399k84314K39551J255453J441777J390636K792894L407777L128588
$$ y = [689343095, 690622151, 692396462, 694248557, 695657611, 696837723, 698099673, 699648142, 700993001, 701547325, 701554716, 701886296, 702300489, 702149689, 701657593, 701565444, 701903999, 702241898, 702109337, 701443017, 700560033, 699731946, 698711276, 697989225, 697899282, 697646260, 697401822, 697185755, 696738780, 696245730, 695653915, 695203185, 695229232, 695009589, 694203496, 693299830, 692592919, 691780329, 690454483, 688691378, 686927974, 685410857, 683733702, 681377470, 678578556, 675870836, 673207343, 670105219, 666582406, 662970126, 658875108, 654367447, 650962234, 647690177, 643574059, 639871120, 636669874, 633455634, 630673468, 628125489, 625548780, 624147654, 623635650, 623210251, 622925937, 623165488, 624420941, 625862718, 627253354, 630046248, 633454025, 636582613]
1658.2F36582613L197968L690541M195869L964185M231811M917562M479051M721760
1674.5F69981360N459667M810333L956199M079401N771876N646586M491448M212559
1690.9G08409429L593623L610075M044354L874123M073858L454208L109456L415465
1707.2G37584591K954364K235174J795232J679898J787662J410902P50124O92844J313150
1725.5G52203941J649022J417995J015127J160025J842737J706958J333714J266062
1741.9G63595581J478672J770675J944363K153218K509594K525628K480566K347350
1758.2G80805647J803518J566171J690627J622438J312137Q60452P75635J282454J461744
1776.5G93180823J131475P40826O64354R00924J095355Q31842L13699L76940R40382
$$ y = [636582613, 639780581, 643471122, 647666991, 651631176, 655862987, 660780549, 665259600, 669981360, 675441027, 680251360, 684207559, 688286960, 694058836, 699705422, 704196870, 708409429, 712003052, 715613127, 719657481, 723531604, 727605462, 731059670, 734169126, 737584591, 740538955, 742774129, 744569361, 746249259, 748036921, 749447823, 750197947, 750890791, 752203941, 753852963, 755270958, 756286085, 757446110, 759288847, 760995805, 762329519, 763595581, 765074253, 766844928, 768789291, 770942509, 773452103, 775977731, 778458297, 780805647, 782609165, 784175336, 785865963, 787488401, 788800538, 789660990, 790436625, 791719079, 793180823, 794312298, 795053124, 795717478, 796618402, 797713757, 798545599, 798859298, 799236238, 800176620]
1794.9H00176620J056493P33614N07533O88494R23156Q83520N44429K96652M98414
1813.2H06308925P92563P78020N29468K88128K82765N25594N71191L09765L05653N40137
1833.6H11232209O09517N03302K15352q0228j5021M52817N33283J92761M2975K24531
1854H13911498M02331K62380K384j2040J84059J82032k4140M7088L20077M68493M60445
1876.5H16204607K74361Q2552J64032M06981M01258R3997j8716J92106L74555L80159
1896.9H18555892J78396K0147J14262K56359J40906j09256j10864J08719J97708P2241
1917.3H19424510j8179K1934J88172L65138K35796m8101p5042J58727K72155R6202
1937.7H20621312j14262r6143J68264L44813K03013K6584Q5116K48670K46048Q1420
$$ y = [800176620, 801233113, 801966727, 802474260, 803162754, 804085910, 804969430, 805513859, 805810511, 806308925, 807101488, 807879508, 808408976, 808697104, 808979869, 809505463, 810076654, 810386419, 810692072, 811232209, 811841726, 812345028, 812560380, 812480152, 812465131, 812917948, 813451231, 813643992, 813686967, 813911498, 814313829, 814576209, 814578593, 814566553, 814750612, 814932644, 814908504, 814955592, 815275669, 815744162, 816204607, 816478968, 816561520, 816725552, 817132533, 817533791, 817627788, 817609072, 817801178, 818175733, 818555892, 818734288, 818754435, 818868697, 819125056, 819265962, 819156706, 819045842, 819154561, 819352269, 819424510, 819406331, 819428265, 819616437, 819981575, 820217371, 820169270, 820094228, 820252955, 820525110, 820621312, 820507050, 820410907, 820579171, 820923984, 821126997, 821153581, 821238697, 821487367, 821733415, 821814835]
1958.1H21814835L0577J63794K53022J55508L0160N0426J67965K42353J69516K2590
1978.5H23100746p451R6977J23978N543j14799j03712O3479J73986N5075j02759j03473
2000.9H23187590j7822p928j35064k57134k37942j69456k19464l68893m78268n09679
2021.3H20785940n36442n02348k65300o8963j24156k21610k75970l60310m17173l51429
2041.7H17662239k23458j79469k23101k30073j49489l2067J5080k0743k4020K8729
2062.1H16623628O6638O4910M7326K5510M3810R0003P0453q643j2219P5996R7632L2723
2086.6H17217767J1206R1433J74940J64449R9004N9902R8706J78456J79767R2566L3737
2109H18401933N6088J20282J39713P8976L636j2338K7835N0903J1384m4167k6345O1393
$$ y = [821814835, 821845412, 822009206, 822262228, 822417736, 822447896, 822498322, 822666287, 822908640, 823078156, 823100746, 823093295, 823190272, 823314250, 823319793, 823204994, 823101282, 823164761, 823338747, 823393822, 823291063, 823187590, 823169768, 823161840, 823026776, 822769642, 822531700, 822362244, 822142780, 821773887, 821295619, 820785940, 820249498, 819747150, 819481850, 819412887, 819288731, 819067121, 818791151, 818430841, 818013668, 817662239, 817438781, 817259312, 817036211, 816806138, 816656649, 816624582, 816639662, 816618919, 816594899, 816623628, 816690266, 816755176, 816802502, 816828012, 816871822, 816961825, 817032278, 817023635, 817011416, 817087412, 817185044, 817217767, 817228973, 817320406, 817495346, 817659795, 817758799, 817818701, 817917407, 818095863, 818275630, 818368196, 818401933, 818458021, 818578303, 818718016, 818796992, 818800628, 818788290, 818816125, 818867028, 818878412, 818834245, 818807900, 818869293]
2133.5H18869293J11401O2764k6286p2956k9326N2095O6221L9160O0022J26779J68621
2155.9H19427788J73271J88589K28763K60830K44617K02775K64645M15325M59254M05550
2176.3H22271407L59714L58998M14253M54724M19080L39567L02613L39210L87729L65614
2196.7H26012909K89441K71380L40282L84272L32176K66493K97367L90411M08709L15666
2217.1H29309106K29716K46406K92301K96593K55346J99318K04325K45273K37286J76966
2237.5H31692636J41025J81317K25544J89841J31607J29401J84417K16305J63019J01209
2257.9H33356321R8705J63675K41518K43425J75118J32740J37508J37150J58370J68264
2278.3H35012794J38461J70887K51889J98245M9770M7087J46926J75714J04905k3604
$$ y = [818869293, 818980694, 819043458, 819017172, 818944216, 818914890, 818966985, 819033206, 819072366, 819132388, 819259167, 819427788, 819601059, 819789648, 820018411, 820279241, 820523858, 820726633, 820991278, 821406603, 821865857, 822271407, 822631121, 822990119, 823404372, 823859096, 824278176, 824617743, 824920356, 825259566, 825647295, 826012909, 826302350, 826573730, 826914012, 827298284, 827630460, 827896953, 828194320, 828584731, 828993440, 829309106, 829538822, 829785228, 830077529, 830374122, 830629468, 830828786, 831033111, 831278384, 831515670, 831692636, 831833661, 832014978, 832240522, 832430363, 832561970, 832691371, 832875788, 833092093, 833255112, 833356321, 833455026, 833618701, 833860219, 834103644, 834278762, 834411502, 834549010, 834686160, 834844530, 835012794, 835151255, 835322142, 835574031, 835772276, 835822046, 835869133, 836016059, 836191773, 836296678, 836273074]
2298.7H36273074m1723J16765K04027J02937k6881j0014J34766J83761J07408J4782
2319.1H37058902o4969l7194J01567Q2850j17004j68740n8234m8638j43230k41577
2339.5H36363733k80321k31027k04921j38939l3259O7234K09510K03789j00911l31461
2359.9H35523427k07842j18196k75433m29571l70621k03729k00570k88724k99335j89543
2380.2H32939863l9041k2769j44303k43008k01702r5189j05381k08199k48074k10106
2400.6H31422091j67370k05219l12030l61026l15428k53617k68102l74019m55201m23789
2421H28286290l42786l54767m71890n18918m51744m00543m59671n72264n74529m62711
2441.4H23676467m08769m75287n40733n04315m14014m16279n19097n54144m63426l68178
$$ y = [836273074, 836231351, 836348116, 836552143, 836655080, 836628199, 836618185, 836752951, 836936712, 837044120, 837058902, 836993933, 836956739, 837058306, 837141156, 837024152, 836855412, 836797178, 836748540, 836605310, 836363733, 836083412, 835852385, 835647464, 835508525, 835475266, 835542500, 835752010, 835955799, 835854888, 835523427, 835315585, 835197389, 834921956, 834492385, 834121764, 833918035, 833717465, 833428741, 833129406, 832939863, 832900822, 832878053, 832733750, 832490742, 832289040, 832193851, 832088470, 831880271, 831632197, 831422091, 831254721, 831049502, 830737472, 830376446, 830061018, 829807401, 829539299, 829165280, 828710079, 828286290, 827943504, 827588737, 827116847, 826597929, 826146185, 825745642, 825285971, 824713707, 824139178, 823676467, 823267698, 822792411, 822251678, 821747363, 821333349, 820917070, 820397973, 819843829, 819380403, 819012225]
2461.8H19012225l83139m69327n16474m77433l82781l47376m16220m54068l94284l21448
2482.2H14849675l32177m17471m48346l71754k59578k18869k74121l03090k18690j55091
2502.6H11850488k52127l77000l31700k12073k17319k99632l51906l31998k74002l14355
2523H08888376m16517m53532m27664l88205m08649m92692n41389n16594m84704n34118
2543.4H04224312o16908o00457m99606m38213m94421o15418o30438m98653m26948n18560
2563.8G98884690n87940n10157m07636m29272n41985n66721m66824l96669m27365n16176
2584.2G94033945n52714m29392k82169l06904m05609m10796l24368k62380l38852m66287
2604.6G90254474m94302m69863n05447n89967o65724o89090o51836o58393p77960r11474
$$ y = [819012225, 818629086, 818159759, 817643285, 817165852, 816783071, 816435695, 816019475, 815565407, 815171123, 814849675, 814517498, 814100027, 813651681, 813279927, 813020349, 812801480, 812527359, 812224269, 812005579, 811850488, 811598361, 811221361, 810889661, 810677588, 810460269, 810160637, 809808731, 809476733, 809202731, 808888376, 808471859, 808018327, 807590663, 807202458, 806793809, 806301117, 805759728, 805243134, 804758430, 804224312, 803607404, 803006947, 802507341, 802069128, 801574707, 800959289, 800328851, 799830198, 799403250, 798884690, 798296750, 797786593, 797378957, 796949685, 796407700, 795840979, 795374155, 794977486, 794550121, 794033945, 793481231, 793051839, 792769670, 792462766, 792057157, 791646361, 791321993, 791059613, 790720761, 790254474, 789760172, 789290309, 788784862, 788194895, 787529171, 786840081, 786188245, 785529852, 784751892, 783840418]
2625G83840418r40919q96096q81195r47833j045525j039327r64939r81570j063287
2643.4G75079727j083910j033008r78530r69171j010836j028835r62973r09209r46045
2661.7G66157210r64224r20296r12965r14216q56876q20279q15332p64251p26521p63833
2682.1G57698417q19624q20935p79151p65682p87973q15809q40068q54313q78573r33706
2702.5G49402583r92716j032650j020909r64283r32932r36866r42230r21607q71301
2720.9G40787089q46863q53121q35180q01921p66158p43688p44164p00414o33538o28173
2741.2G33233869o77168p25568p16805o44982n78582n86093o13153n72323m96865m62234
2761.6G27160096n00917n79059n94080n46634n54860o28710p02679p33971p51078q22664
$$ y = [783840418, 782899499, 782003403, 781122208, 780174375, 779128850, 778089523, 777124584, 776143014, 775079727, 773995817, 772962809, 771984279, 771015108, 770004272, 768975437, 768012464, 767103255, 766157210, 765192986, 764272690, 763359725, 762445509, 761588633, 760768354, 759953022, 759188771, 758462250, 757698417, 756878793, 756057858, 755278707, 754513025, 753725052, 752909243, 752069175, 751214862, 750336289, 749402583, 748409867, 747377217, 746356308, 745392025, 744459093, 743522227, 742579997, 741658390, 740787089, 739940226, 739087105, 738251925, 737450004, 736683846, 735940158, 735195994, 734495580, 733862042, 733233869, 732556701, 731831133, 731114328, 730469346, 729890764, 729304671, 728691518, 728119195, 727622330, 727160096, 726659179, 726080120, 725486040, 724939406, 724384546, 723755836, 723053157, 722319186, 721568108, 720745444]
2782G20745444r06706r37163r43900j020669j163185j240194j219869j218676j311243
2800.4G10783839j445293j573324j652301j646340j660227j784385j896143j885593
2816.7F97240233j866817j960456k125621k260626k301752k293408k381563k559305
2833F79490685k690494k780199k898276l127932l478825l745198l805936l744781l582537
2851.4F49636507l300607k937257k644539k666951l045380l565788m072428m557490
2867.7F22846067m976213n314589n596399n690575n468428n027890m501521l881693
2884E82388759l163159k438307j817405j326621r79364p92563p34567q13246j040816
2902.4E69282711j349390j664281j976728k368391k927482l558695m006565m121363
$$ y = [720745444, 719838738, 718901575, 717957675, 716937006, 715773821, 714533627, 713313758, 712095082, 710783839, 709338546, 707765222, 706112921, 704466581, 702806354, 701021969, 699125826, 697240233, 695373416, 693412960, 691287339, 689026713, 686724961, 684431553, 682049990, 679490685, 676800191, 674019992, 671121716, 667993784, 664514959, 660769761, 656963825, 653219044, 649636507, 646335900, 643398643, 640754104, 638087153, 635041773, 631475985, 627403557, 622846067, 617869854, 612555265, 606958866, 601268291, 595799863, 590771973, 586270452, 582388759, 579225600, 576787293, 574969888, 573643267, 572663903, 571871340, 571136773, 570323527, 569282711, 567933321, 566269040, 564292312, 561923921, 558996439, 555437744, 551431179, 547309816]
2918.7E47309816m008949l751755l213882k335966j316845l69966O14762J829386L104389
2937E37860990M146814M872203N361140N710065N912960N983531N999684N945981N879938
2955.4E87673306N890608N816460N506873N083740M747629M531920M310846M047811
2971.7F27609193L869593L833712L838181L715396L357947K989113K846897K741635
2988F54801667K527117K199829J768530J481056J309216R57668N24401J93954j1981
3006.4F65751457j23977l05951o59466j020491j222432j369416j594365j786888j868903
3024.7F55799568j949609k059579k141475k162457k213597k338409k381146k406001
3041.1F38147295k533257k653599k708555k705872k702355k744913k782464k819896
$$ y = [547309816, 543300867, 539549112, 536335230, 533999264, 532682419, 532312453, 532927215, 534756601, 537860990, 542007804, 546880007, 552241147, 557951212, 563864172, 569847703, 575847387, 581793368, 587673306, 593563914, 599380374, 604887247, 609970987, 614718616, 619250536, 623561382, 627609193, 631478786, 635312498, 639150679, 642866075, 646224022, 649213135, 652060032, 654801667, 657328784, 659528613, 661297143, 662778199, 664087415, 665045083, 665569484, 665763438, 665751457, 665627480, 665321529, 664662063, 663641572, 662419140, 661049724, 659455359, 657668471, 655799568, 653849959, 651790380, 649648905, 647486448, 645272851, 642934442, 640553296, 638147295, 635614038, 632960439, 630251884, 627546012, 624843657, 622098744, 619316280, 616496384]
3057.4F16496384k879977k894640k814055k699375k740562k969026l079057k918065
3073.7E93501627k671778k611160k855837l102303l062129k945661k928198k978027
3090E70346534l124237l158450k919316k723694k846479l076554l041982k821029k791583
3108.4E43843210k968729k948403k683818k584398k767742l081620l279864l135384
3124.7E20393252k839923k731800k831578k916634k806008k614081k631485k886117
3141D98135626l007918k826274k608776k470434k428710k596170k800137k795726k686560
3159.4D73914921k590447k515883k490282k503693k514988k455324k349943k292871
3175.7D54201490k303571k335250k338618k285511k217233k172678k153308k158165
$$ y = [616496384, 613616407, 610721767, 607907712, 605208337, 602467775, 599498749, 596419692, 593501627, 590829849, 588218689, 585362852, 582260549, 579198420, 576252759, 573324561, 570346534, 567222297, 564063847, 561144531, 558420837, 555574358, 552497804, 549455822, 546634793, 543843210, 540874481, 537926078, 535242260, 532657862, 529890120, 526808500, 523528636, 520393252, 517553329, 514821529, 511989951, 509073317, 506267309, 503653228, 501021743, 498135626, 495127708, 492301434, 489692658, 487222224, 484793514, 482197344, 479397207, 476601481, 473914921, 471324474, 468808591, 466318309, 463814616, 461299628, 458844304, 456494361, 454201490, 451897919, 449562669, 447224051, 444938540, 442721307, 440548629, 438395321, 436237156]
3192D36237156k141654k087981k031177k006501j994550j964361j930058j917511j886278
3210.3D18277085j797348j709432j663774j692891j750767j731188j660198j604557
3226.7D04666930j519978j352578j271397j479208j701713j639664j489431j358956
3243C92854005j214057j239508j429230j430810j188099j046598j147539j253724j212001
3261.3C81692439j112938j010775q94755q07286q71241j048952j139283j105666j039327
3279.7C72662216r88036r27299q68142q34018p46906o66648p49409r28372j040012
3298C64913374r70125p36237n68032p17878j075149j277685j201034r92774q87096
3316.4C56487364r37075r62436q73864q32587r74030j104623j059919r63122q43108
$$ y = [436237156, 434095502, 432007521, 429976344, 427969843, 425975293, 424010932, 422080874, 420163363, 418277085, 416479737, 414770305, 413106531, 411413640, 409662873, 407931685, 406271487, 404666930, 403146952, 401794374, 400522977, 399043769, 397342056, 395702392, 394212961, 392854005, 391639948, 390400440, 388971210, 387540400, 386352301, 385305703, 384158164, 382904440, 381692439, 380579501, 379568726, 378673971, 377866685, 376995444, 375946492, 374807209, 373701543, 372662216, 371674180, 370746881, 369878739, 369044721, 368297815, 367631167, 366881758, 365953386, 364913374, 363943249, 363207012, 362638980, 361921102, 360845953, 359568268, 358367234, 357374460, 356487364, 355550289, 354587853, 353713989, 352881402, 351907372, 350802749, 349742830, 348779708, 347936600]
3334.8C47936600p21573q07017j008451j088977j123488j021236p64072q18432j119733
3353.1C39463621j132935r17733q33839r41932r55760o87689n67675q73983j198738
3371.5C31353337j156927q95142p69496p85500q16494p65622n98490l38316q5086j77800
3391.9C24964464n58824o43074k59489r984l87192q12321o17922k23696q0049j18434
3412.3C21253479l08156m26025k63303j12027r4801K5898K63959M12077L17573K75106
3432.7C21343780L81678K06292j47194j37419J78606M32908N35488N07087N13762N83530
3453.1C24398518O21974P16001Q40485P42972O79642J011878J204252Q28773M04209
3471.4C31448704M53830P57128J045614J056910P55906P35521R88722TR38415J110882
$$ y = [347936600, 347215027, 346408010, 345399559, 344310582, 343187094, 342165858, 341401786, 340583354, 339463621, 338330686, 337412953, 336579114, 335637182, 334681422, 333993733, 333426058, 332552075, 331353337, 330196410, 329301268, 328531772, 327746272, 326929778, 326164156, 325565666, 325227350, 325142264, 324964464, 324405640, 323762566, 323503077, 323493093, 323105901, 322293580, 321675658, 321451962, 321371913, 321253479, 320945323, 320519298, 320255995, 320143968, 320049167, 320075065, 320339024, 320751101, 321068674, 321343780, 321725458, 321931750, 321784556, 321647137, 321825743, 322258651, 322794139, 323301226, 323814988, 324398518, 325020492, 325736493, 326576978, 327319950, 327999592, 329011470, 330215722, 331044495, 331448704, 331902534, 332659662, 333705276, 334762186, 335518092, 336253613, 337242335, 338231057, 339169472, 340280354]
3491.8C40280354J208574J160174J082897J074344J111448R68337Q24571J003325J328677
3510.2C50042701J516580J399935J113206J059145J278102J492530J394302J173943
3526.5C60470444J236588J478076J640886J727819J670093J519143J648158J845628
3542.8C73236835J751244J559675J603156J778573J932502K046406K122611K242386
3559.1C88273388K319962K153128K029419K600253L183961L033429K875060K998054
3575.4D09466654L135920L277838L404945L344834L150850L231049L696978L753483
3591.7D36462551L613323L806383M066348M043430L949642L849268L663272L810048
3608.1D67264265M072338M044920M146636M174292M135013M460483M393876L856182
$$ y = [340280354, 341488928, 342649102, 343731999, 344806343, 345917791, 346886128, 347710699, 348714024, 350042701, 351559281, 352959216, 354072422, 355131567, 356409669, 357902199, 359296501, 360470444, 361707032, 363185108, 364825994, 366553813, 368223906, 369743049, 371391207, 373236835, 374988079, 376547754, 378150910, 379929483, 381861985, 383908391, 386031002, 388273388, 390593350, 392746478, 394775897, 397376150, 400560111, 403593540, 406468600, 409466654, 412602574, 415880412, 419285357, 422630191, 425781041, 429012090, 432709068, 436462551, 440075874, 443882257, 447948605, 451992035, 455941677, 459790945, 463454217, 467264265, 471336603, 475381523, 479528159, 483702451, 487837464, 492297947, 496691823, 500548005]
3624.4E00548005L331184L585697M677951M661262M233360M032016L903210L880263
3640.7E32852948L800630L479660L166497L656625M615784M363298L758431L945887
3657E63639760M083812L584206L199399L149688K893686K607227L022373K944350K573073
3675.4E91697574L193259L439069L158509K939642K666593K315998K079546K359390
3691.7F13849580K658129K540112K192974J796901J680732J985311K020300J565098
3708F30289137J097799J337528K106190K119958J633465J304508J260757J282036J363218
3726.4F43794596J542330J303911Q28326P92026J412154J879036J469851M23491J18613
3744.7F53564334J186371J144409O51002J410425J860201J353562R39071J148701J193821
$$ y = [500548005, 503879189, 507464886, 512142837, 516804099, 521037459, 525069475, 528972685, 532852948, 536653578, 540133238, 543299735, 546956360, 551572144, 555935442, 559693873, 563639760, 567723572, 571307778, 574507177, 577656865, 580550551, 583157778, 586180151, 589124501, 591697574, 594890833, 598329902, 601488411, 604428053, 607094646, 609410644, 611490190, 613849580, 616507709, 619047821, 621240795, 623037696, 624718428, 626703739, 628724039, 630289137, 631386936, 632724464, 634830654, 636950612, 638584077, 639888585, 641149342, 642431378, 643794596, 645336926, 646640837, 647469163, 648261189, 649673343, 651552379, 653022230, 653445721, 653564334, 654750705, 655895114, 656546116, 657956541, 659816742, 661170304, 662109375, 663258076, 664451897]
3763.1F64451897R19402Q58247Q29578R60826J241804J190483Q68321N94556O75082
3781.4F72590196P60734P97749R45270R25064Q24749O77705N03600N61893L13938J70946
3801.8F79071844Q60989Q67068P81954J202226J060366L64721N1379M66526L20792
3820.2F85047865M81844J128375R65119O79612N26905M93467O01828K37644j16408
3838.5F90046251M11451R04858J038432R88901O11782k05577j079261Q5711J593471
3856.9F94396019J244843M30107K6405L32713N66661K32637L60012P32840Q14914O99222
3877.3F99836373J13726P4804N50330M95314N52833M06265O6698M23253O61254J63793
3897.7G03344643l08752j82748K43426P35223R21786O30438L23117J72853j2696J073
$$ y = [664451897, 665371299, 666229546, 667059124, 668019950, 669261754, 670452237, 671320558, 671915114, 672590196, 673350930, 674148679, 675093949, 676019013, 676843762, 677521467, 678025067, 678586960, 678900898, 679071844, 679932833, 680799901, 681581855, 682784081, 683844447, 684209168, 684260547, 684727073, 685047865, 685529709, 686658084, 687623203, 688302815, 688829720, 689323187, 689925015, 690162659, 690046251, 690457702, 691362560, 692400992, 693389893, 694001675, 693796098, 692716837, 692802548, 694396019, 695640862, 696070969, 696097374, 696430087, 696996748, 697229385, 697589397, 698322237, 699137151, 699836373, 699950099, 700024903, 700575233, 701070547, 701623380, 702029645, 702096343, 702519596, 703180850, 703344643, 703035891, 702853143, 703096569, 703831792, 704753578, 705384016, 705707133, 705879986, 705867290, 705868363]
3918.1G05868363K93196L13460J37747K15351K49148Q9705K01523M63843M06564J72436
3938.5G08411336Q285M5538K54810J96457L0458K66015N07891L65079J67668J47879
3958.9G10401416J58310J93000K23398J47819J06573J54078J85073J89185J82748J39832
3979.3G12081432J73331K59995K02060P6175O3121J40071J76132J57535J21832
3997.6G13451684
$$ y = [705868363, 706161559, 706475019, 706612766, 706828117, 707077265, 707166970, 707368493, 707832336, 708238900, 708411336, 708419621, 708465159, 708719969, 708916426, 708946884, 709212899, 709720790, 710085869, 710253537, 710401416, 710559726, 710752726, 710976124, 711123943, 711230516, 711384594, 711569667, 711758852, 711941600, 712081432, 712254763, 712514758, 712716818, 712792993, 712856114, 712996185, 713172317, 713329852, 713451684]
##END=$$ End of the data block
