##TITLE=$$ Begin of the data block
##JCAMP-DX=5.00 $$ ACD/SpecManager v 10.08
##SPECTROMETER/DATA SYSTEM=Alpha
##DATE=23 Dec 2014 10:50:12
##DATA TYPE=INFRARED SPECTRUM
##DATA CLASS=XYDATA
##ORIGIN=
##OWNER=
##NPOINTS=1765
##FIRSTX=399.76428223
##LASTX=3997.64306641
##MAXX=3997.64306641
##MINX=399.76428223
##MAXY=0.83851451
##MINY=0.25200367
##XFACTOR=1.0000000000
##YFACTOR=1.000000000000000e-9
##FIRSTY=0.59099299
##DELTAX=2.03961372
##XUNITS=1/CM
##YUNITS=ARBITRARY UNITS
##XYDATA=(X++(Y..Y))
399.8 590992987 586066008 583028972 580742002 579030156 578846931 580668926 583306015 584858239 584389269
418.1 584389269 582646787 581521690 580141664 577023864 572990835 569915712 568135738 566225171
434.4 566225171 563749671 562553942 564335346 568456054 572586477 575624228 578544199 581884801
450.8 581884801 584356308 584758818 583859324 583040655 582510829 581131279 578072131 574257851 571332455
469.1 571332455 569134116 566008806 561938405 558783889 557625353 557441115 556699634 555549264 555128753
487.5 555128753 555558443 555625677 554333806 552229226 550632894 549803138 548311651 545215726 541627824
505.8 541627824 538764834 536208808 532584250 527716637 522691965 518389642 514678895 510880530
522.1 510880530 507319272 505305529 505389452 506391406 507099271 508210599 511563540 517358541 523625612
540.5 523625612 528302670 531111956 533138514 534498632 534086645 531733096 528729975 526063025 523037851
558.9 523037851 518449068 512228906 505356610 498474151 491442651 484715372 479727238 477763742
575.2 477763742 479188591 483120799 488351345 494672239 502241731 509957790 515794337 518953323
591.5 518953323 520450950 521673918 522755742 522811294 521705806 520667672 520891607 522050619 522927105
609.8 522927105 523441970 524831593 527782798 531562746 535083532 538344681 542260051 547039390 551430702
628.2 551430702 554289460 556213439 558508277 561197877 563152730 563938200 564369678 565479517 567321122
646.6 567321122 568813741 569308281 569706917 571106255 573072076 574260533 574479163 574976027 576440394
664.9 576440394 578573585 580130458 580509961 581458092 583682716 586127877 587430835 587962568 589231491
683.3 589231491 591415644 593031824 593051195 592135131 591453314 590890646 589081168 585477769 581432343
701.6 581432343 578532815 576890826 575689733 574823856 575458527 578554928 583317339 588108778 592645645
720 592645645 598052084 604814410 611761749 617314041 621515632 625759244 630436361 634259403 636033356
738.3 636033356 636289835 636438668 636544108 634995401 630945861 625747442 621089637 616908908 612024665
756.7 612024665 606270134 601253331 598635435 598372459 599532783 602108538 607118905 614957452 624292612
775.1 624292612 633148074 640819371 648089468 655504167 662161767 666847765 670030355 673492312
791.4 673492312 678060412 682748318 686504543 689861596 693984985 698743820 702626824 704707205
807.7 704707205 705971956 707967162 710513592 712007761 711779475 711046219 711036623 710998774 709166169
826 709166169 705197573 700552702 696367085 691996038 686323106 679884434 674446344 670656800 667351425
844.4 667351425 663315952 658890545 655277729 652591527 649427474 644811273 640127003 638318539
860.7 638318539 641125798 647700787 656291783 666406155 678058982 689702392 698655725 703667879
877 703667879 705741405 706117094 704577744 700261474 693677723 686881959 681273937 676324546 670945466
895.4 670945466 665287018 660460413 656578660 652238131 646213472 638723791 630805373 622679412
911.7 622679412 613474548 602908611 592353582 583708167 577680409 573630333 570773602 569170713
928 569170713 569387913 571323216 574090302 577245295 581387758 587042630 593221843 597614050 598403931
946.4 598403931 595448613 589314938 580021024 567532122 552745879 537001550 520798028 503540993
962.7 503540993 484633058 464401066 443594038 422387689 400472403 377903223 355500787
977 355500787 334435582 315550715 299182743 285485059 274668247 266801447 261537939 258203864
993.3 258203864 256234735 255394638 255538583 256228983 256764710 256657720 255913019 254836828 253685266
1011.6 253685266 252640814 252003670 252199143 253510147 255871624 258951753 262521207 266583562 271062493
1030 271062493 275578469 279539555 282532424 284603953 286143094 287453920 288667798 290068418 292227834
1048.4 292227834 295710683 300732613 307210565 315047294 324341118 335230052 347409636 359493315
1064.7 359493315 368772537 371902913 366939187 355543822 342523038 332434505 327005357 325673282
1081 325673282 327219486 330687493 335602403 341856509 349220991 356905073 363874018 369471729 373559773
1099.4 373559773 376204520 377692550 378876656 381001353 384759814 389731824 394866168 399396896
1115.7 399396896 403232187 406509489 409206212 411389172 413680345 417051524 421852559 427011579
1132 427011579 430590302 431180775 428470671 422799528 414723188 405109078 395198047 386272401 379124761
1150.3 379124761 373876780 370386839 368728995 369187027 371899933 376750380 383638680 392771065
1166.7 392771065 404415578 418332040 433590055 449217916 464902341 480760366 496512115
1180.9 496512115 511254907 524280250 535633445 545549929 553678870 559366465 562708080 564781785
1197.3 564781785 566669762 568606675 570312917 572015882 574572623 578491271 583324432 588169396
1213.6 588169396 592625380 596857011 600696564 603308856 604045212 603300691 602083087 600835621 599234581
1231.9 599234581 597086430 594898939 593389750 592676342 592312276 592107892 592553735 594146669 596554279
1250.3 596554279 598868430 600599766 602052152 603635192 605192006 606310010 607158184 608467579
1266.6 608467579 610587239 612933099 614532113 615069032 615050972 614910185 614494324 613504291 612064183
1285 612064183 610691965 609639585 608473837 606674075 604384840 602201283 600372314 598547518 596403301
1303.3 596403301 594167233 592298388 590908587 589598477 587970853 586218476 584730208 583357275
1319.6 583357275 581372201 578147471 573772848 568820894 563651681 558382928 553429544 549504220
1336 549504220 547112882 546176493 546010613 546049893 546307921 546819806 547195971 546969235 546127260 545130670
1356.4 545130670 544262767 543282211 541890621 540481687 539611518 539348423 539516509 539838970 540404141
1374.7 540404141 541394472 542671204 543957114 545319200 547543347 551456034 556128979 559616148
1391 559616148 561441958 561975718 561868906 561363041 560360789 558772743 556800723 555078804 553595185
1409.4 553595185 551923454 550156474 548704207 547759771 547485828 547682285 548035562 548737526 550003290
1427.7 550003290 551712036 553409874 554836869 556589723 559127808 561533928 563375056 564648032
1444.1 564648032 565519810 566091418 566077769 565217376 563684940 561663628 560377777 560775399 561954021
1462.4 561954021 564388692 568745077 574207902 580930114 590299070 600583375 609796584 618254900
1478.7 618254900 626039445 633024633 639029324 644765794 650942028 656860709 661166728 664664090
1495 664664090 668722332 672934115 676203847 678422213 680341125 683286786 686426818 688525677 689932585
1513.4 689932585 691237211 693044841 694886565 696254015 697415292 698703110 700271666 701605976
1529.7 701605976 702171266 702206552 702544451 702999890 702953219 702528775 702404678 702668369 702953756 702796161
1550.1 702796161 702144861 701331615 700623214 699731350 698917568 698670030 698371649 698133886 697896123 697406411
1570.5 697406411 696922898 696408629 695996821 695957541 695677757 694842994 693933249 693252385 692460895 691111743
1590.9 691111743 689325154 687571943 686057508 684366584 682033718 679285109 676598012 673962474
1607.2 673962474 670923471 667445242 663871646 659852803 655380070 651930213 648642540 644565761
1623.5 644565761 640891016 637694895 634500444 631767452 629302561 626792073 625364721 624795377
1639.9 624795377 624347627 624117076 624446988 625693142 627079308 628511131 631388307 634754479 637813926
1658.2 637813926 640978336 644673407 648900092 652917802 657218158 662152052 666581929 671247005
1674.5 671247005 676658332 681446970 685410261 689523160 695311010 700923979 705393851 709583223
1690.9 709583223 713158250 716785371 720827758 724655211 728682935 732100308 735180378 738565981
1707.2 738565981 741497099 743737996 745567441 747283578 749088585 750471950 751185477 751894295 753242314
1725.5 753242314 754897892 756306708 757314801 758448660 760207474 761867166 763219535 764496028
1741.9 764496028 765957415 767727077 769705117 771908820 774434447 776935756 779400945 781739831
1758.2 781739831 783522189 785066426 786749184 788382471 789713323 790582538 791319609 792542934 793992996
1776.5 793992996 795138419 795893013 796582162 797509551 798609734 799438119 799779415 800195575 801128447
1794.9 801128447 802173257 802912891 803388536 804008961 804895580 805776894 806334555 806664646 807184339
1813.2 807184339 807996809 808804214 809340358 809629917 809910178 810437620 811049104 811369598 811614811 812104881
1833.6 812104881 812691391 813172281 813380241 813340783 813418269 813931644 814436316 814561844 814569950 814799368
1854 814799368 815207601 815460980 815452516 815468192 815715611 815946996 815913796 815891385 816173017 816664934 817139804
1876.5 817139804 817386925 817437947 817606628 818063915 818509817 818603337 818564057 818736553 819099903 819474459
1896.9 819474459 819641292 819653988 819759965 819984853 820104063 820018172 819942057 820081413 820321321 820425570
1917.3 820425570 820407093 820429385 820630074 820983648 821185768 821112156 821032584 821183145 821436524 821552992
1937.7 821552992 821497679 821435988 821596563 821920693 822108090 822129846 822200477 822420955 822671533 822790861
1958.1 822790861 822837710 823002219 823278427 823461831 823494077 823520362 823657215 823885143 824066937 824108899
1978.5 824108899 824098468 824184000 824332952 824384868 824286222 824174047 824222147 824375451 824420989 824326992 824246287
2000.9 824246287 824255288 824259222 824110091 823814273 823534906 823351622 823147774 822801888 822320819 821797907
2021.3 821797907 821267128 820782304 820543826 820488632 820362210 820134223 819842875 819477379 819075942 818751991
2041.7 818751991 818540812 818352520 818123579 817897856 817758024 817722321 817713261 817669272 817636073 817687273 817802787
2064.1 817802787 817872882 817872703 817881405 817952812 818049908 818100750 818098903 818114758 818200350 818298817 818351388 818393052
2088.6 818393052 818495691 818663120 818817854 818908811 818967402 819074214 819255948 819443226 819575369 819657505
2109 819657505 819720566 819797039 819888949 819962859 819987774 819978297 819994211 820050776 820078552 820044339 820012212 820052266
2133.5 820052266 820152342 820223391 820221424 820189953 820179880 820210457 820260644 820295930 820344925 820466459 820636392
2155.9 820636392 820797265 820969164 821209729 821512878 821777463 821954906 822199702 822627783 823121607 823546231
2176.3 823546231 823897123 824247897 824656427 825111151 825526416 825848341 826147735 826500952 826873720 827203572
2196.7 827203572 827496529 827799678 828157187 828544021 828892708 829191446 829496264 829866469 830277085 830630839
2217.1 830630839 830891669 831131637 831402421 831692040 831945419 832134068 832316041 832538426 832780004 832990050
2237.5 832990050 833154857 833313763 833498955 833698273 833867908 833981991 834116399 834333479 834525526 834614456
2257.9 834614456 834702134 834894478 835155487 835381985 835532546 835663676 835810721 835939884 836084187 836275578
2278.3 836275578 836472154 836671591 836852908 836942732 836976767 837068141 837237000 837437749 837592304 837629259
2298.7 837629259 837640584 837775171 837985933 838084817 838015378 837968111 838087440 838263452 838354349 838356316 838360608
2321.1 838360608 838438749 838514507 838446796 838249683 838097811 838092208 838052273 837850451 837622702 837442279 837279797
2343.5 837279797 837083638 836901307 836829960 836893201 837102652 837345064 837385774 837184846 836941421 836728513
2363.9 836728513 836364329 835893273 835585415 835421026 835219979 834949791 834660828 834437549 834351182 834313333
2384.3 834313333 834176481 833953440 833787739 833713949 833587646 833329558 833029628 832816958 832702994 832542062
2404.7 832542062 832233131 831856012 831538081 831287801 831006289 830617368 830168724 829764605 829425812 829062879
2425.1 829062879 828602314 828109980 827659667 827228367 826750517 826185286 825628877 825178266 824758530 824279308
2445.5 824279308 823735535 823200881 822768748 822366834 821864545 821309328 820833206 820460320 820105314 819671690
2465.9 819671690 819151223 818663538 818302929 817978382 817549467 817066491 816681087 816389382 816058755 815634787
2486.3 815634787 815195799 814840972 814583719 814330518 813993216 813659966 813466728 813323915 813074172 812742352
2506.7 812742352 812461972 812277615 812079549 811762691 811369896 811026931 810746908 810408354 809981048 809555411
2527.1 809555411 809180319 808831692 808413506 807870269 807307959 806819618 806355238 805819392 805190086 804548085
2547.5 804548085 803998590 803552270 803095341 802538693 801964521 801491499 801051795 800508201 799898148 799373269
2567.9 799373269 798954010 798508048 797959864 797398031 796947777 796589673 796196640 795687437 795130432 794698775
2588.3 794698775 794414818 794111431 793700218 793255329 792897403 792631149 792321861 791892827 791401505 790930033
2608.7 790930033 790449500 789862752 789169669 788462341 787804306 787143171 786364973 785446227 784492493 783590853
2629.1 783590853 782710910 781776905 780766368 779744089 778780699 777836978 776807487 775701284 774624884
2647.4 774624884 773624241 772667110 771694839 770690084 769710720 768786967 767867267 766920209 765962362
2665.8 765962362 765016973 764137983 763334155 762507737 761651695 760894001 760219991 759491026 758656323 757766485
2686.2 757766485 756923616 756183326 755458891 754632473 753752172 752921879 752090633 751154363 750127137
2704.5 750127137 749095261 748116076 747180045 746245325 745295465 744337380 743393242 742497981 741648734
2722.9 741648734 740808666 739979565 739202261 738473773 737734139 736961663 736239135 735625744 735021770 734314322
2743.3 734314322 733549356 732866168 732303739 731758952 731155634 730517745 729926229 729438841 728997946 728487968
2763.7 728487968 727893472 727287769 726719201 726165950 725530922 724786162 724045455 723345220 722570717 721641243
2784.1 721641243 720638871 719675422 718698084 717603803 716395319 715148687 713911831 712624490 711205721
2802.4 711205721 709630549 707960844 706326306 704703033 702928901 701019049 699131191 697279453
2818.8 697279453 695329964 693199515 690919638 688589156 686288714 683932006 681384802 678674698
2835.1 678674698 675875962 672964096 669815898 666322649 662578583 658789456 655035675 651417971
2851.4 651417971 648111343 645175755 642493069 639757156 636661172 633069456 628964126 624381661
2867.7 624381661 619387627 614034891 608400047 602698028 597212791 592139781 587593615 583677590
2884 583677590 580496550 578068435 576270401 574945033 573938012 573103487 572346509 571544230 570519924
2902.4 570519924 569173813 567524493 565576792 563189030 560197473 556607604 552617311 548537433
2918.7 548537433 544572532 540830731 537576556 535194755 533857405 533477783 534114838 535979748 539061725
2937 539061725 543149829 548010051 553393483 559112728 565042853 571059465 577090085 583052158 588938773
2955.4 588938773 594853699 600711167 606269002 611419082 616226256 620796442 625142872 629235089
2971.7 629235089 633141935 637009561 640912294 644694448 648109317 651167095 654045224 656777620
2988 656777620 659300864 661520779 663369119 664956808 666304529 667242229 667764425 668007433 668065071
3006.4 668065071 667964041 667625725 666944146 665947199 664762735 663431942 661862195 660061479 658170223
3024.7 658170223 656241238 654265761 652217031 650073230 647822559 645469964 643075109 640627623
3041.1 640627623 638083816 635459840 632800341 630123317 627371073 624558330 621779323 618997216
3057.4 618997216 616136849 613222420 610347927 607604802 604855120 601880550 598780692 595836043
3073.7 595836043 593176007 590595186 587745905 584662974 581626058 578667283 575720429 572741032
3090 572741032 569615424 566442966 563480020 560684800 557777345 554658592 551584661 548785210 546049535
3108.4 546049535 543071926 540061116 537358642 534790814 532012105 528906107 525617003 522469878
3124.7 522469878 519594789 516824663 513973176 511032999 508207917 505621731 503033638 500161469
3141 500161469 497153968 494301349 491610616 489064604 486643255 484084457 481280476 478461415 475732893
3159.4 475732893 473078430 470520705 468025088 465542316 463045716 460573345 458174348 455830038
3175.7 455830038 453497112 451144308 448794663 446489543 444227397 442013234 439845204 437708050
3192 437708050 435597152 433480173 431374669 429324061 427331716 425396144 423498094 421597242 419692785
3210.3 419692785 417834014 416054845 414347857 412657559 410932302 409166813 407416046 405755699
3226.7 405755699 404211432 402826726 401512116 399989188 398286462 396679372 395214766 393866360
3243 393866360 392640859 391382098 389948279 388523012 387332946 386264950 385099024 383857548 382664740
3261.3 382664740 381537437 380476028 379549980 378782123 377938747 376852512 375696570 374587625 373519480
3279.7 373519480 372522473 371601075 370720804 369889438 369172364 368500948 367699623 366717726 365642667
3298 365642667 364648938 363881767 363280714 362569720 361560613 360338897 359125555 358086824 357155800
3316.4 357155800 356206238 355257988 354392081 353592098 352654517 351521641 350399822 349398017 348540217
3334.8 348540217 347795397 346952021 345943987 344913363 343850464 342832267 342026442 341188073 340071797
3353.1 340071797 338901669 337929726 337087035 336176187 335245937 334545612 333974898 333117455 331878394
3371.5 331878394 330676824 329831958 329125375 328316242 327445954 326663077 326079011 325756818 325679272 325514883
3391.9 325514883 324970543 324331492 324056149 324014902 323632658 322871596 322287112 322057068 321938157 321767271
3412.3 321767271 321461499 321088046 320850104 320708394 320567697 320583403 320843607 321201861 321470737 321773767
3432.7 321773767 322216719 322469473 322358340 322220653 322368741 322782397 323293805 323761582 324254930 324872077
3453.1 324872077 325552732 326276779 327069640 327782035 328493625 329533964 330739766 331593990 332003176
3471.4 332003176 332420915 333162606 334210396 335258156 335999757 336732566 337757796 338791519 339724302
3489.8 339724302 340784132 341946423 343109816 344208449 345272481 346382588 347378016 348250180 349282086
3508.1 349282086 350590795 352093965 353516728 354666680 355769008 357091188 358632833 360049993
3524.4 360049993 361215442 362469792 363960564 365580022 367298543 368962348 370451272 372069210
3540.8 372069210 373933971 375774890 377416670 379053354 380850971 382777095 384850651 387082100
3557.1 387082100 389398426 391679674 393767923 395783246 398430318 401697516 404735237 407512128
3573.4 407512128 410436839 413595438 416960686 420452625 423821032 426982671 430287540 434034556
3589.7 434034556 437818289 441528261 445435375 449508756 453490198 457403392 461252004 464902997
3606 464902997 468690604 472781032 476909101 481118679 485286504 489440411 493982822 498445958 502357960
3624.4 502357960 505753517 509374380 513968766 518464088 522615492 526708782 530688882 534595370
3640.7 534595370 538439691 541996539 545203447 548826694 553353190 557617247 561340332 565323353
3657 565323353 569451451 573044956 576251507 579420805 582314432 584959984 588070154 591038048 593583703
3675.4 593583703 596771359 600173831 603238404 606125951 608818769 611177206 613276064 615648746
3691.7 615648746 618320286 620864809 623038530 624795854 626456261 628453851 630540311 632209122
3708 632209122 633349359 634641886 636667430 638729155 640372455 641713142 642980099 644246519 645622492
3726.4 645622492 647216916 648568630 649413705 650208235 651608944 653405130 654807746 655296862 655553877
3744.7 655553877 656781137 657898009 658531964 659930944 661746800 663045228 663984478 665178359 666419625
3763.1 666419625 667362630 668177426 668938696 669880748 671123862 672304630 673189878 673806369 674447954
3781.4 674447954 675175309 675982177 676911414 677798867 678636372 679367244 679921865 680502474 680823743 681020677
3801.8 681020677 681894124 682743192 683468044 684603930 685663402 686127722 686284542 686698079 686882555
3820.2 686882555 687320530 688471615 689476430 690207124 690734982 691181242 691770256 692037582 691895008
3838.5 691895008 692269802 693237305 694338679 695297837 695892513 695781589 694810629 694886148 696443558
3856.9 696443558 697697759 698168218 698178411 698412001 698922932 699167490 699510992 700220644 701018512 701684177
3877.3 701684177 701837122 702001214 702565134 703015268 703510284 703894496 703999698 704470456 705142260 705310881
3897.7 705310881 705055535 704939246 705172539 705811858 706666052 707326293 707677543 707834780 707844377 707852960
3918.1 707852960 708094776 708412051 708599865 708824098 709086299 709231555 709445000 709835589 710171998 710349619
3938.5 710349619 710402131 710449576 710705459 710990489 711092472 711266458 711652040 712006748 712144911 712204874
3958.9 712204874 712351918 712612271 712915242 713129938 713269889 713420987 713617027 713815212 713934839 714047074
3979.3 714047074 714288235 714572668 714721143 714755118 714825630 714971781 715119362 715250194 715411127
3997.6 715411127
##END=$$ End of the data block
