##TITLE=$$ Begin of the data block
##JCAMP-DX=5.00 $$ ACD/SpecManager v 10.08
##SPECTROMETER/DATA SYSTEM=Alpha
##DATE=23 Dec 2014 10:50:12
##DATA TYPE=INFRARED SPECTRUM
##DATA CLASS=XYDATA
##ORIGIN=
##OWNER=
##NPOINTS=1765
##FIRSTX=399.76428223
##LASTX=3997.64306641
##MAXX=3997.64306641
##MINX=399.76428223
##MAXY=0.82747191
##MINY=0.22333260
##XFACTOR=1.0000000000
##YFACTOR=1.000000000000000e-9
##FIRSTY=0.52454180
##DELTAX=2.03961372
##XUNITS=1/CM
##YUNITS=ARBITRARY UNITS
##XYDATA=(X++(Y..Y))
399.8E24541795m701256l903151k181649K45928J231254J112282J542866J730859N34773
418.1E20153701j430869k205372k027571j574576j989901l283143l670394k735198
434.4E01236677j375466J37269J921564L911078N186499N028247L904879K428890J274407
452.8E23654044N74410q4699p74622j449108k236306k721489l005147l316998l641248
471.2E06998837l794849k946794j726061j121283j076370r54032k37316M21375J69754
489.5D95733261n77450j099258j407326j661926j901418k321869k667964k769917l026694
507.9D78299439l430963l812313m113286m456640m733324m497081l717392k541423
524.2D46997017j290113l55005L71039J244843K448290M050851N548120O048530N280554
$$ y = [524541795, 519840539, 515937388, 513755739, 514001667, 515232921, 516345203, 517888069, 519618928, 520153701, 518722832, 516517460, 514489889, 512915313, 510925412, 507642269, 503971875, 501236677, 499861211, 499998480, 501920044, 505831122, 511017621, 516045868, 519950747, 522379637, 523654044, 524228454, 524143755, 523369133, 521920025, 519683719, 516962230, 513957083, 510640085, 506998837, 503203988, 500257194, 498531133, 497409850, 496333480, 495379448, 495142132, 495563507, 495733261, 495155811, 494056553, 492649227, 490987301, 489085883, 486764014, 484096050, 481326133, 478299439, 474868476, 471056163, 466942877, 462486237, 457752913, 453255832, 449538440, 446997017, 445706904, 445351899, 445722938, 446967781, 449416071, 453466922, 459015042, 465063572, 470344126]
542.5D70344126L711760J962781L79741q74012j724214k412676l305316m311562n058110
560.9D58712518n719542o644368p461131p330716o005376l814370j089483J754403
577.2D22401935M251927O151676P347226P742465P284194N889952L881544K001941
593.5D66952860Q93057L96132m7385n36383o09129J0848Q11755J211375J283735J634539
613.9D72001404K507060L515095M080564M072487M027873M203946M238099L637760
630.2E02284288K571285J831889J834035K137840J990438J195371N24342P18891J389683
648.6E16478062J622736J170159P09295R01997J471877J597702J116992O07669P94828
667E26471317J945317K112865J479983J078785J262069K000272K323151J673698P31409
$$ y = [470344126, 474055886, 476018667, 476398408, 475524396, 473800182, 471387506, 468082190, 463770628, 458712518, 452992976, 446348608, 438887477, 431556761, 425551385, 421737015, 420647532, 422401935, 426653862, 432805538, 440152764, 447895229, 455179423, 461069375, 464950919, 466952860, 467845917, 468242049, 468194664, 467658281, 467049152, 467060000, 467871755, 469083130, 470366865, 472001404, 474508464, 478023559, 482104123, 486176610, 490204483, 494408429, 498646528, 502284288, 504855573, 506687462, 508521497, 510659337, 512649775, 513845146, 514369488, 515088379, 516478062, 518100798, 519270957, 519980252, 520882249, 522354126, 523951828, 525068820, 525676489, 526471317, 528416634, 530529499, 532009482, 533088267, 534350336, 536350608, 538673759, 540347457, 541078866]
685.3E41078866M74870P51376N29587o70731k145886k918899k902210k874375l150284
703.7E28172314l067434j971244q524J981795L266275L878474M496157N751848O975711
722E49475372P079720O334186N603433N425989N392730M557074L011167J770615J245737
740.4E89896023P67172m63248k478599m297257m986643m907549n133450n746901n788028
758.7E56861520m628897k631247o08742J163423L123760N594671Q101106R752214J0044336
777.1E86772144R309053Q356452P614136O817281N591393M299760L703713M076839
793.4F36540771M752039M918099M595756M223943M076004L966928L337383K165496
809.7F68576419J285315J196861J381397R08792k60293j291871j862526k406895l403068
$$ y = [541078866, 541553736, 542305112, 542834699, 542163968, 540018082, 537099183, 534196973, 531322598, 528172314, 525104880, 523133636, 523125112, 525106907, 528373182, 532251656, 536747813, 542499661, 549475372, 556555092, 562889278, 568492711, 573918700, 579311430, 583868504, 586879671, 588650286, 589896023, 590663195, 590199947, 587721348, 583424091, 578437448, 573529899, 568396449, 562649548, 556861520, 552232623, 549601376, 548992634, 550156057, 553279817, 558874488, 566975594, 576727808, 586772144, 596081197, 604437649, 612051785, 618869066, 624460459, 628760219, 632463932, 636540771, 641292810, 646210909, 650806665, 655030608, 659106612, 663073540, 666410923, 668576419, 669861734, 671058595, 672439992, 673348784, 673088491, 671796620, 669934094, 667527199, 664124131]
828.1F64124131m848957o127596o585896o299078n884111n761028n632221n030275
844.4F17954969m140675l569781l658355m261553m891336n036175m260004j911938
860.7E86225152K168119O812870J0561407J2814999J3369381J2075603R369731O132364
877F59529626K880037l79681l527582o000698p243395p392406p118165o851137o475091
895.4F17421508n858958n386472n481422o153166p180214q246720r165942j0004461
911.7E59944153j0794640j1210143j0689557r033322o639898m178345k220512q60214
928E04317522K65658J439631K591550L575743M392683M995763M969240L450512m2557
946.4E29955745m690230r052396j2350738j4648885j6237080j7319947j8065632j8593311
$$ y = [664124131, 659275174, 653147578, 646561682, 640262604, 634378493, 628617465, 622985244, 617954969, 613814294, 610244513, 606586158, 602324605, 597433269, 592397094, 588137090, 586225152, 588393271, 595206141, 605767548, 618582547, 631951928, 644027531, 653397262, 659529626, 662409663, 662029982, 658502400, 652501702, 645258307, 637865901, 630747736, 623896599, 617421508, 611562550, 606176078, 600694656, 594541490, 587361276, 579114556, 569948614, 559944153, 549149513, 537939370, 527249813, 518216491, 511576593, 507398248, 505177736, 504317522, 504583180, 506022811, 508614361, 512190104, 516582787, 521578550, 526547790, 529998302, 529955745, 525265515, 516213119, 503862381, 489213496, 472976416, 455656469, 437590837, 418997526]
962.7D18997526j9014716j9410104j9734740j9845843j9575596j8864065j7721683
977B84830779j6047597j3774008j1119574q397296n824119l644645j979306p11635
993.3B23332599K75090R60425J337379J413986J209974P96005K68221j99407m20481
1011.6B28973791l12686J16304Q10176J592129K298176K849415L269837L627300L854111
1030B47078553L775373L305912K564192J788020J245856R66311R06855J127660J675188
1048.4B64433920K619148L923565N304307O479472P609993Q949429J0292381J0734289
1064.7C20346504Q736998L255308m283339j0037541j1197567q528650m671484j305729
1081B92314500J197010K911419M047602M916906N696684O212920O059558N057454L522604
$$ y = [418997526, 399982810, 380572706, 360837966, 340992123, 321416527, 302552462, 284830779, 268783182, 255009174, 243889600, 235492304, 229668185, 226023540, 224044234, 223332599, 223607689, 224568114, 225905493, 227319479, 228529453, 229325458, 229593679, 229394272, 228973791, 228661105, 228777409, 229587585, 231179714, 233477890, 236327305, 239597142, 243224442, 247078553, 250853926, 254159838, 256724030, 258512050, 259757906, 260724217, 261631072, 262758732, 264433920, 267053068, 270976633, 276280940, 282760412, 290370405, 299319834, 309612215, 320346504, 329083502, 332338810, 328055471, 318017930, 306820363, 298291713, 293620229, 292314500, 293511510, 296422929, 300470531, 305387437, 311084121, 317297041, 323356599, 328414053, 331936657]
1099.4C31936657K001584J076162J074284J850307K936721L874868M396200M343748
1115.7C53490531L707886K759129J999468J830339K353221L339470M295736M629970
1132C78405750L816902J629651j572311m884809p358700q524627q566409p890761o763965
1150.3C38290721n322724l684968k020836m63516R94921K522648M324227O409675Q510113
1168.7C49560261J0338485J1795849J2929499J3757944J4276832J4419645J4075607
1183D41154122J3316691J2250930J0787994Q835703O637156M645676L238201K505302
1199.3E03371775K217114K159238K378464L018021M001439M971027N544961N617857
1215.6E33279896N289316M574358L440381K008676N59568n73337j225292j520574j666308
$$ y = [331936657, 333938241, 335014403, 336088687, 337938994, 340875715, 344750583, 349146783, 353490531, 357198417, 359957546, 361957014, 363787353, 366140574, 369480044, 373775780, 378405750, 382222652, 383852303, 382279992, 377395183, 370036483, 361511856, 352945447, 345054686, 338290721, 332967997, 329283029, 327262193, 326798677, 327793598, 330316246, 334640473, 341050148, 349560261, 359898746, 371694595, 384624094, 398382038, 412658870, 427078515, 441154122, 454470813, 466721743, 477509737, 486345440, 492982596, 497628272, 500866473, 503371775, 505588889, 507748127, 510126591, 513144612, 517146051, 522117078, 527662039, 533279896, 538569212, 543143570, 546583951, 548592627, 549152195, 548578858, 547353566, 545832992, 544166684]
1234E44166684j740575j660287j300931o53386J34528Q88228J537204K077996K438605
1252.3E45888066K478600K138913J617193J276195J233101J413405J775920K136707
1268.6E59958100K243638K004087J446009O56962j56104p09236r04798r33707j011908
1287E62593043j188338j436114j695633j887441k031684k156377k195656k088070j916289
1305.4E45997441j806855j697064j534641j386940j286447j309633j545191k090633
1321.7E33340037l030360m217565n278945n838036n757750n143821m165828k948165
1338D96959567j513272k39552L62725M76092L82870J57535j59174n58704r02057j126885
1358.4D93839145j351387j458674j110554p57694n98610k01344K75105P15405R83029
$$ y = [544166684, 542426109, 540765822, 539464891, 538811505, 538946033, 539834261, 541371465, 543449461, 545888066, 548366666, 550505579, 552122772, 553398967, 554632068, 556045473, 557821393, 559958100, 562201738, 564205825, 565651834, 566308796, 566152692, 565443456, 564538658, 563604951, 562593043, 561404705, 559968591, 558272958, 556385517, 554353833, 552197456, 550001800, 547913730, 545997441, 544190586, 542493522, 540958881, 539571941, 538285494, 536975861, 535430670, 533340037, 530309677, 526092112, 520813167, 514975131, 509217381, 504073560, 499907732, 496959567, 495446295, 495206743, 495569468, 496045560, 496428430, 496585965, 496426791, 495868087, 494966030, 493839145, 492487758, 491029084, 489918530, 489160836, 488562226, 488360882, 488635987, 489351392, 490334421]
1376.7D90334421R70662J009047J429945K332688L622174M249990L446639K173662
1393.1E09569228R67383l457o70493r49800j229703j642227j743198j810193j880824
1411.4E00606716j637817j355678j362860r93341l8117N31971Q80838J070082J160532
1429.8D98862326J437187J579702J765728K291560K264202J919329J544357J013517
1446.1E12677908L53754k88785r35614j622260k677381k314985M590J028061J990974
1464.5E08216262L652394M768371N998135Q889675J0502994R636819Q732379Q205652
1480.8E68602681P803798O833255O098986O328344O720126N564451M432082M504621
1497.1F16888344M699111M179895L142953K293348K970159L884316L348827K641619
$$ y = [490334421, 491305083, 492314130, 493744075, 496076763, 499698937, 503948927, 507395566, 509569228, 510536611, 510533154, 509862661, 508912861, 507683158, 506040931, 504297733, 502487540, 500606716, 498968899, 497613221, 496250361, 495257020, 495218903, 495750874, 496631712, 497701794, 498862326, 500299513, 501879215, 503644943, 505936503, 508200705, 510120034, 511664391, 512677908, 513031662, 512742877, 511807263, 510185003, 507507622, 505192637, 505197227, 506225288, 508216262, 511868656, 516637027, 522635162, 531524837, 542027831, 551664650, 560397029, 568602681, 576406479, 583239734, 589338720, 595667064, 602387190, 607951641, 612383723, 616888344, 621587455, 625767350, 628910303, 631203651, 634173810, 638058126, 641406953, 644048572]
1513.4F44048572K032935J943946J878202K013922K374232K098679J826286J537920
1529.7F59754694J083850R92298J040161K23220o78063Q4341R60588Q27432J77324
1548.1F64465845m11868n27978n56529r45151j961589j161277M61280J06097m00007
1566.4F59068823p93576p65682k11358l84330o01709o7890q3745m65571n33581n96106
1586.8F54565275q73268j233637j451135j519322j583577j847505k317608k646267
1603.2F41092956k746642k895355l231227l417015l525377m297733m734516l233075
1619.5F13012016k981484l923714l679693l235459l015399k506674k703070l233671
1635.8E87732852j636446k47836k33412n13196n57065O71208J510799J353562K640545
$$ y = [644048572, 646081507, 648025453, 649903655, 651917577, 654291809, 656390488, 658216774, 659754694, 660838544, 661830842, 662871003, 663094223, 662416160, 662500501, 663461089, 664288521, 664465845, 664053977, 663525999, 662969470, 662024319, 660062730, 658901453, 659362733, 659468830, 659068823, 658275247, 657509565, 657298207, 656913877, 656312168, 656244278, 656160533, 655694962, 655161381, 654565275, 653692007, 652458370, 651007235, 649487913, 647904336, 646056831, 643739223, 641092956, 638346314, 635450959, 632219732, 628802717, 625277340, 620979607, 616245091, 613012016, 610030532, 606106818, 602427125, 599191666, 596176267, 593669593, 590966523, 587732852, 586096406, 585848570, 585615158, 585101962, 584544897, 585216105, 586726904, 588080466, 590721011]
1654.1E90721011L531695L217220L295600L853679M273117L772676L877520N096674
1670.5F21639192N157948N041718N376339M881919M310607M477859O099462N967498
1686.8F62952542M861355M884660M309357L784716L701925L663063M523218M163623
1703.1F96844459L342807L269434K952337K577126K284110J938641K045095K492964
1719.4G17746973K366245K237737K310693J973570J510083J227260J670480K577364
1735.7G33620405K120555J562535J720071K031744K078295J891315J991093K550840
1752G49566853K571344K296865K094329J639724J566648J861751J698852J235842P33138
1770.4G65265346P73191J575410J850725J446187R49979P55489R25183J237154J069427
$$ y = [590721011, 594252706, 597469926, 600765526, 604619205, 608892322, 612664998, 616542518, 621639192, 626797140, 631838858, 637215197, 642097116, 646407723, 650885582, 656985044, 662952542, 667813897, 672698557, 677007914, 680792630, 684494555, 688157618, 692680836, 696844459, 700187266, 703456700, 706409037, 708986163, 711270273, 713208914, 715254009, 717746973, 720113218, 722350955, 724661648, 726635218, 728145301, 729372561, 731043041, 733620405, 735740960, 737303495, 739023566, 741055310, 743133605, 745024920, 747016013, 749566853, 752138197, 754435062, 756529391, 758169115, 759735763, 761597514, 763296366, 764532208, 765265346, 766038537, 767613947, 769464672, 770910859, 771860838, 772616327, 773541510, 774778664, 775848091]
1788.8G75848091M49717M26471J005292J215696J079858Q73982P83563Q07166Q96871
1807.1G83386707R34363Q58128O85453N56410P11023R85086P92742K10703L8445L71277
1827.5G89530337P57158J050889P33972K03490K93076O24180L84569j21832J4544M89115
1847.9G93959498P32840O81757K86580o5506k980L84986N76794K43307l55959m12107
1868.3G96029210M78804J027405O52850J22845M1247L70323O62923N33939R5069j30653
1888.7G99883962K65538O94216N44011J76311l576J39236M23074M13596J0193k61724
1909.1H02284837L4332M54724L58820r1255k57134k8968M09841O80209L43084j40607
1929.5H04047883j46509K61784N25117K67148k63870m01437J62840O81817N07713L2544
$$ y = [775848091, 776297808, 776724279, 777729571, 778945267, 780025125, 780899107, 781682670, 782489836, 783386707, 784321070, 785179198, 785864651, 786421061, 787132084, 788117170, 788909912, 789120615, 789159060, 789530337, 790287495, 791338384, 792072356, 792275846, 792568922, 793193102, 793577671, 793455839, 793470383, 793959498, 794692338, 795374095, 795660675, 795595169, 795592189, 795977175, 796553969, 796797276, 796441317, 796029210, 796508014, 797535419, 798188269, 798311114, 798352361, 798722684, 799385607, 799919546, 800014615, 799883962, 800149500, 800843716, 801387727, 801564038, 801560462, 801699698, 802122772, 802536368, 802546561, 802284837, 802319169, 802773893, 803132713, 803041458, 802784324, 802755356, 803165197, 803845406, 804188490, 804047883, 803901374, 804163158, 804688275, 804955423, 804691553, 804290116, 804452956, 805134773, 805642486, 805675030]
1949.9H05675030j25647J87397N56708M81784O1512j50383P4327L95418M30882J20639
1970.3H07707667j36613M6432M31656M77851R5129k39372j46151K08676L38554K7001
1990.7H08810830k66909q5652K77578L66569P4863l05414l57568n8770J83642j9431
2011.1H08619738m81010o74486m28140j31726k98799q28743r49502l09705K09749o0
2031.5H04727316m68075o77526m74751j25587o9976l49164n54800l83437j0490J27256
2051.9H01740766r7573l28124k00808J79053L43382J06811j69575j19805J50263L04997
2072.3H01909387J37925j66118j93059J11639L60668K44141o8605j60039R4414L82125
2092.7H02652478L59595P2658p6294J18554L87311L73304O4194j42932K7120L24190
$$ y = [805675030, 805549383, 805736780, 806293488, 806775272, 806836784, 806686401, 806760728, 807156146, 807587028, 807707667, 807571054, 807617486, 808049142, 808526993, 808622122, 808382750, 808236599, 808445275, 808783829, 808810830, 808543921, 808458269, 808735847, 809102416, 809177279, 808871865, 808514297, 808455527, 808639169, 808619738, 808138728, 807464242, 807036102, 806904376, 806605577, 805776834, 804827332, 804517627, 804727376, 804727316, 804259241, 803581715, 803106964, 802981377, 802911401, 802562237, 802007437, 801624000, 801613510, 801740766, 801643193, 801315069, 801114261, 801293314, 801636696, 801743507, 801573932, 801454127, 801604390, 801909387, 802047312, 801881194, 801688135, 801799774, 802160442, 802404583, 802335978, 802175939, 802270353, 802652478, 803012073, 803084731, 803008437, 803126991, 803514302, 803887606, 803951800, 803808868, 803835988, 804160178]
2113.1H04160178L48091P1406j69337r7990J51277K30014N7161j65105j83701P2062
2133.5H04474056K85864J48713j26600j70767M3273K36094J53541q0704j09435J32859
2153.9H04986894L43025L01957J11639P4685K89321M95076M79698L52264L28481M61936
2174.3H08224976O32167O29365M19319K73526L96549O23703O58751M51982K62201L20256
2194.6H12892795N02526N49794M20451K78234K87533M63545O04570N14269L16560K77043
2215H17107320M18663N17964M27962K46226J90676L11315M41253M08590K34246J46747
2235.4H20450962K48968L45111K85566J74165J35362J98781K79129K62558J57774R4294
2255.8H22632670J82689L00467K82704J68086J21831K15054L23772L10481K10583J44840
$$ y = [804160178, 804508269, 804579675, 804410338, 804312348, 804463625, 804693639, 804750800, 804585695, 804401994, 804474056, 804759920, 804908633, 804782033, 804611266, 804654539, 804890633, 805044174, 804963470, 804854035, 804986894, 805329919, 805631876, 805743515, 805818200, 806107521, 806602597, 807082295, 807434559, 807763040, 808224976, 808857143, 809486508, 809905827, 810179353, 810575902, 811199605, 811858356, 812310338, 812572539, 812892795, 813395321, 813945115, 814365566, 814643800, 814931333, 815394878, 815999448, 816513717, 816830277, 817107320, 817525983, 818043947, 818471909, 818718135, 818908811, 819220126, 819661379, 820069969, 820304215, 820450962, 820699930, 821045041, 821330607, 821504772, 821640134, 821838915, 822118044, 822380602, 822538376, 822632670, 822815359, 823115826, 823398530, 823566616, 823688447, 823903501, 824227273, 824537754, 824748337, 824893177]
2276.2H24893177J53482K21669K61784K15888J48296J32621J61230J49012Q8572M6492
2296.6H26472223Q3864J71482J63019N6445o198L6895J23203J27554M0650k6882K444
2319.1H27244699Q6904J06871L3438n0247l3915k0444j13964k00689k20776j77085
2339.5H26654792j30654j80304l10421k72691r0599N5075J02937K2411j65581k70129
2359.9H25414836j04308r2208l43144m10616l01779j94609j53124k09868k74182k12371
2380.2H23118627o4850m768r7633k54511l07799j54376k6583j66357l76701l97087
2400.6H21267962k51233j52409k35379m00662m73380m19558l31819l35812m76420n96106
2421H17595184n27144l91662m19318n78642o78242o03675m61877m56571o20068p69972
$$ y = [824893177, 825046659, 825268328, 825530112, 825746000, 825894296, 826026917, 826188147, 826337159, 826425731, 826472223, 826556087, 826727569, 826890588, 826947033, 826940835, 826977730, 827100933, 827228487, 827269137, 827242255, 827244699, 827331603, 827438474, 827471912, 827421665, 827387750, 827367306, 827253342, 827052653, 826831877, 826654792, 826524138, 826343834, 826033413, 825760722, 825670123, 825725198, 825828135, 825850546, 825684965, 825414836, 825310528, 825218320, 824875176, 824464560, 824162781, 823968172, 823815048, 823605180, 823330998, 823118627, 823053777, 823049009, 822951376, 822696865, 822389066, 822234690, 822208107, 822041750, 821665049, 821267962, 821016729, 820864320, 820628941, 820228279, 819754899, 819335341, 819003522, 818667710, 818191290, 817595184, 817068040, 816676378, 816257060, 815678418, 815000176, 814396501, 813934624, 813478053, 812857985, 812088013]
2441.4H12088013p10726n31554m78387o10531p46786p07209n10693l90947n20348o95944
2461.8H06184888o69003m85122l57449m42266o48559p02261n22256l50237l96133n57959
2482.2H01053643n90563m30584k76804k95937m15146m81546l90529j99438j50561l31700
2502.6G97490835m72665l68178j91688j62661k87712m32968m42445l07679k49267m15981
2523G94159591o39796o67214m98713l87310m97818p11620p72655o25134n04315n84066
2543.4G88270950p62343q07941o44803m82500n32448p26521q29756p16448n36919n12182
2563.8G81719089o35028p12216o29127m88639m86255o39915p32839o34671m79877m41014
2584.2G75839508n22852n98610n48839m00126l11554l80099n13315n37336m23372l32891
$$ y = [812088013, 811377287, 810845733, 810367346, 809756815, 809010029, 808302820, 807792127, 807401180, 806880832, 806184888, 805515885, 805030763, 804673314, 804231048, 803582489, 802880228, 802357972, 802007735, 801611602, 801053643, 800463080, 800032496, 799755692, 799459755, 799044609, 798563063, 798172534, 797973096, 797822535, 797490835, 797018170, 796649992, 796458304, 796295643, 796007931, 795574963, 795132518, 794824839, 794575572, 794159591, 793519795, 792852581, 792353868, 791966558, 791468740, 790757120, 789984465, 789359331, 788855016, 788270950, 787508607, 786700666, 786055863, 785573363, 785040915, 784314394, 783484638, 782768190, 782231271, 781719089, 781084061, 780371845, 779742718, 779254079, 778767824, 778127909, 777395070, 776760399, 776280522, 775839508, 775316656, 774718046, 774169207, 773769081, 773457527, 773077428, 772564113, 772026777, 771603405, 771270514]
2604.6G71270514m34459o57916p50422o64532o19889p55191r49323j016676r46880
2623G64475226r02176r94026j152754j247883j215935j105129j084686j212895j312196
2641.3G54247546j254320j137137j113773j204908j289606j245677j123727j064300
2657.6G44814098j100361j168192j173973j080692r90271j014591j072287j053751
2673.9G36159980r87112q94845q61585r34362r70781r22799q51691q42154r57251j051306
2694.3G26886094j023114r69410r98080j128733j234293j216948j154661j135171j150310
2712.7G16875374j154840j102268j016736r83537r94026r91881r52542q74102q40306
2731.1G07965136q79288q79586q31306p85470p31766p03871p37369p92861p79689o94155
$$ y = [771270514, 770836055, 770178139, 769427717, 768763185, 768143296, 767388105, 766438782, 765422106, 764475226, 763573050, 762579024, 761426270, 760178387, 758962452, 757857323, 756772637, 755559742, 754247546, 752993226, 751856089, 750742316, 749537408, 748247802, 747002125, 745878398, 744814098, 743713737, 742545545, 741371572, 740290880, 739300609, 738286018, 737213731, 736159980, 735172868, 734278023, 733416438, 732482076, 731511295, 730588496, 729736805, 728894651, 727937400, 726886094, 725862980, 724893570, 723895490, 722766757, 721532464, 720315516, 719160855, 718025684, 716875374, 715720534, 714618266, 713601530, 712617993, 711623967, 710632086, 709679544, 708805442, 707965136, 707085848, 706206262, 705374956, 704589486, 703857720, 703153849, 702416480, 701623619, 700843930, 700149775]
2751.4G00149775o40631o43611o54459o31452n76198n40256n53251o06775o60837o72519
2771.8F93969786o79374p57098q87275r61244r44733r36151j016557j157641j258374
2790.2F85371339j268983j271307j357317j525939j659750j648069j616359j717150
2806.5F73306465j884103j996755k008856k017915k130806k267003k348543k379655
2822.8F56272829k379895k426803k554178k711475k844393k925515k990663l120006
2839.1F34319901l325223l523291l666460l767371l788293l666460l426373l159762
2855.5F05996668l013193l110349l438890l918946m430354m894078n295157n620956
2871.8E72274745n849422n889475n661309n190909m571497l867090l096819k327382
$$ y = [700149775, 699509144, 698865533, 698211074, 697579622, 697003424, 696463168, 695909917, 695303142, 694642305, 693969786, 693290412, 692533314, 691646039, 690684795, 689740062, 688803911, 687787354, 686629713, 685371339, 684102356, 682831049, 681473732, 679947793, 678288043, 676639974, 675023615, 673306465, 671422362, 669425607, 667416751, 665398836, 663268030, 661001027, 658652484, 656272829, 653892934, 651466131, 648911953, 646200478, 643356085, 640430570, 637439907, 634319901, 630994678, 627471387, 623804927, 620037556, 616249263, 612582803, 609156430, 605996668, 602983475, 599873126, 596434236, 592515290, 588084936, 583190858, 577895701, 572274745, 566425323, 560535848, 554874539, 549683630, 545112133, 541245043, 538148224, 535820842]
2888.1E35820842j641751j121819p98404o50584o74665p74324r08375j149535j472474
2906.5E26628911j820147k221405k725959l263295l668367l844023l785491l502190
2922.8E01798034l021002k344072j464933m60625O27399J787126K912134L914177M747093
2941.1E08495331N320787N647004N848944O031275O185651O217062O151438O066859
2957.4E55964351N952716N751490N402386M940510M526973M288316M188299M115462
2973.8E95130503L997326L860116L750324L583253L293633K971709K690792K478004
2990.1F21755660K248227J892030J546741J247644Q93295N47648K46226n0127l32773
3008.4F29994571n87463q53598j148701j436591j682162j847208j940370k056241k206266
$$ y = [535820842, 534179091, 533057272, 532258868, 531608284, 530933619, 530159295, 529250920, 528101385, 526628911, 524808764, 522587359, 519861400, 516598105, 512929738, 509085715, 505300224, 501798034, 498777032, 496432960, 494968027, 494507402, 495134801, 496921927, 499834061, 503748238, 508495331, 513816118, 519463122, 525312066, 531343341, 537528992, 543746054, 549897492, 555964351, 561917067, 567668557, 573070943, 578011453, 582538426, 586826742, 591015041, 595130503, 599127829, 602987945, 606738269, 610321522, 613615155, 616586864, 619277656, 621755660, 624003887, 625895917, 627442658, 628690302, 629583597, 630131245, 630377471, 630327344, 629994571, 629407108, 628553510, 627404809, 625968218, 624286056, 622438848, 620498478, 618442237, 616235971]
3026.8F16235971k303540k366841k410054k477944k587915k606570k624512k759814
3043.1E96098781k889097k923071k874434k872408k973676l027260k999306k996921
3059.4E72542608l010273k958000k874553k920985l084302l144682l045141k882958
3075.7E48621714k796054k902090l057719l083169l042519l005624l000677l056585
3092.1E24677277l092766l018856k878189k852142k961517k993881k872646k765536
3108.4E01241744k808601k786517k634138k637237k794624k959996l030390k923310
3124.7D78666931k730816k607316k658278k743304k646029k482473k476454k641469
3141D57680792k726823k622962k491892k325892k179891k303869k555221k581328k434761
$$ y = [616235971, 613932431, 611565590, 609155536, 606677592, 604089677, 601483107, 598858595, 596098781, 593209684, 590286613, 587412179, 584539771, 581566095, 578538835, 575539529, 572542608, 569532335, 566574335, 563699782, 560778797, 557694495, 554549813, 551504672, 548621714, 545825660, 542923570, 539865851, 536782682, 533740163, 530734539, 527733862, 524677277, 521584511, 518565655, 515687466, 512835324, 509873807, 506879926, 504007280, 501241744, 498433143, 495646626, 493012488, 490375251, 487580627, 484620631, 481590241, 478666931, 475936115, 473328799, 470670521, 467927217, 465281188, 462798715, 460322261, 457680792, 454953969, 452331007, 449839115, 447513223, 445333332, 443029463, 440474242, 437892914, 435458153]
3159.4D35458153k312898k284795k291799k234459k156317k122313k118379k113282
3175.7D17823911k098352k053678k030909k026707j939952j835972j824469j873880
3192D02139992j899660j863301j778245j707882j690477j672536j629561j617909j580953
3210.3C86699468j507193j493454j468480j423329j441121j457542j405746j327395
3226.7C75175208j242876j131207j118869j298725j410872j315117j210153j137107
3243C65310282j035661j024395j143575j174867j030684r15080r69261j011431r04620
3261.3C56100708q34048q67456p92324o35714p12424r27925r85116r06974q21203p91818
3281.7C47825706p74384p34388o76781n77838n65737p07001q25196q68917q23020o33449
$$ y = [435458153, 433145255, 430860460, 428568661, 426334202, 424177885, 422055572, 419937193, 417823911, 415725559, 413671881, 411640972, 409614265, 407674313, 405838341, 404013872, 402139992, 400240332, 398377031, 396598786, 394890904, 393200427, 391527891, 389898330, 388280421, 386699468, 385192275, 383698821, 382230341, 380807012, 379365891, 377908349, 376502603, 375175208, 373932332, 372801125, 371682256, 370383531, 368972659, 367657542, 366447389, 365310282, 364274621, 363250226, 362106651, 360931784, 359901100, 358986020, 358016759, 357005328, 356100708, 355266660, 354399204, 353606880, 352971166, 352258742, 351330817, 350345701, 349438727, 348617524, 347825706, 347051322, 346316934, 345640153, 345062315, 344496578, 343789577, 342964381, 342095464, 341272444, 340638995]
3302.1C40638995m62770n66781q96424j110166j060486r21905q75294q55804q00162
3320.5C33089203p32154p12991q55028j003206r80646q57263o87510o01500p66248
3338.8C25892657r47565r45598r75012r35793p30962p89672j114190j187622r45330
3357.2C17320913p72625q19177q38965o55263n59003p98940j126945j138240q54224
3375.5C09757531o78003p17133q08239p70539n71669l06964j34021l20017o63251o13689
3395.9C04174006k11895o8813m57913p92473n78344k47210j49489j99586l60936m22180
3416.3C00685167k52962j33663j38700k5690J76788K54809J64569J84476L00437J30982
3436.7C01346213j45913r8288J72377L39657L47644L52413M22746M46736M76689O33239
$$ y = [340638995, 340176225, 339609444, 338713020, 337602854, 336542368, 335620463, 334745169, 333889365, 333089203, 332357049, 331644058, 330789030, 329785824, 328805178, 327947915, 327260405, 326658905, 325892657, 324945092, 323999494, 323024482, 322088689, 321357727, 320568055, 319453865, 318266243, 317320913, 316548288, 315729111, 314890146, 314234883, 313675880, 312876940, 311749995, 310611755, 309757531, 309079528, 308362395, 307554156, 306783617, 306211948, 305904984, 305770963, 305450946, 304787695, 304174006, 303962111, 303893298, 303435385, 302642912, 302064568, 301817358, 301667869, 301468283, 301107347, 300685167, 300432205, 300298542, 300159842, 300134152, 300310940, 300565749, 300730318, 300914794, 301215231, 301346213, 301200300, 301102012, 301274389, 301614046, 301961690, 302314103, 302736849, 303183585, 303660274, 304293513]
3457.1C04293513P39128O12437O10114R22471J029819O55323K60264L33011O77765
3475.5C10133845R49740Q83758N58823N63682Q31037Q23826P42584Q87692R83507R47773
3495.9C18306267Q88229Q76873Q98749Q09550O96212P70212J029312J252830J163036
3514.2C26691270R13203R05275J101762J236886J089752Q48174R05513J204968J452088
3532.6C36348891J515240J330137J156747J327038J500398J405180J248896J304596
3548.9C47137123J421482J546263J782030J926929J940519J907438J732588J526325
3565.2C60920697J960844K748281K807617K537906K525032K672613K906590L156931
3581.5C82236511L092110K631664K543539L277659L480882L229677L437311L747910
$$ y = [304293513, 305032641, 305645078, 306255192, 307177663, 308207482, 308862805, 309123069, 309456080, 310133845, 311083585, 311967343, 312526166, 313089848, 313920885, 314744711, 315487295, 316374987, 317358494, 318306267, 319194496, 320071369, 320970118, 321779668, 322475880, 323246092, 324275404, 325528234, 326691270, 327604473, 328509748, 329611510, 330848396, 331938148, 332786322, 333691835, 334896803, 336348891, 337864131, 339194268, 340351015, 341678053, 343178451, 344583631, 345832527, 347137123, 348558605, 350104868, 351886898, 353813827, 355754346, 357661784, 359394372, 360920697, 362881541, 365629822, 368437439, 370975345, 373500377, 376172990, 379079580, 382236511, 385328621, 387960285, 390503824, 393781483, 397262365, 400492042, 403929353, 407677263]
3597.9D07677263L660023L643900L679991L378868L313124L638447L841400M051477
3614.2D36884493L973573L740251M232764M510701L980696L139764L012807M366487
3630.5D67841536M733801M306882M128337M002810L985256L993243L571510K844989
3646.8D99408364L111601M661739M830241L984750M017412M329920L868997L460467
3663.1E31673491L389776K910018K500236L211558L101647K457201L368974L896773
3679.4E56509674L634929L359318K842784K113104J861036K652824L108978K799392
3695.8E78882039K321779J839817J753449K278447K349377J651645R15527J304984
3712.1E93297064K497435K528012J833915J393795J326859J350284J595557J923263
$$ y = [407677263, 411337286, 414981186, 418661177, 422040045, 425353169, 428991616, 432833016, 436884493, 440858066, 444598317, 448831081, 453341782, 457322478, 460462242, 463475049, 467841536, 472575337, 476882219, 481010556, 485013366, 488998622, 492991865, 496563375, 499408364, 502519965, 507181704, 512011945, 515996695, 520014107, 524344027, 528213024, 531673491, 535063267, 537973285, 540473521, 543685079, 546786726, 549243927, 552612901, 556509674, 560144603, 563503921, 566346705, 568459809, 570320845, 572973669, 576082647, 578882039, 581203818, 583043635, 584797084, 587075531, 589424908, 591076553, 591992080, 593297064, 595794499, 598322511, 600156426, 601550221, 602877080, 604227364, 605822921, 607746184]
3728.4F07746184J525044P10726M96626J428366K293825J848042M21047j311J432657
3746.7F17901206J227915M20094J567900K233863J485884J001597J431882J532614
3763.1F28802955J096845Q74996P92384J099169J502574J323104Q45194O12259R06825
3781.4F37856305J027822R82463J118839J120508R97841P08759M16041N21898K41578
3799.8F44992054J34348J137555J124859Q97348J400709J227617L29972p093M70221
3818.1F51707590J60932N51820J519203J238167Q45910O22093M97520N52893J13368
3836.5F57809496j46985O01113J137137J307428J333416Q72254l21031j574218L1233
3854.8F61049843K015412J616597O35445j1086K67803O04868J53542L15666R10342
$$ y = [607746184, 609271228, 609981954, 610478580, 611906946, 614200771, 616048813, 616469860, 616468549, 617901206, 619129121, 619549215, 621117115, 623350978, 624836862, 625838459, 627270341, 628802955, 629899800, 630774796, 631567180, 632666349, 634168923, 635492027, 636337221, 636949480, 637856305, 638884127, 639866590, 640985429, 642105937, 643103778, 643812537, 644228578, 644750476, 644992054, 645126402, 646263957, 647388816, 648286164, 649686873, 650914490, 651244462, 651237369, 651707590, 651868522, 652420342, 653939545, 655177712, 656023622, 656645715, 657143235, 657696128, 657809496, 657662511, 658263624, 659400761, 660708189, 662041605, 662913859, 662592828, 661018610, 661049843, 663065255, 664681852, 665317297, 665306211, 665574014, 666178882, 666332424, 666648090, 667558432]
3873.2F67558432J103639R24886J79409J01209M79341L84509O76334N03600P5579O59823
3893.6F72646761Q92699J77979l41236k91110Q6189Q92818J235068Q25464M61996K10524
3914F76797152q4460L8445M54724M01139J40846K62439L34024J11997K08438N76317
3934.4F79241061N40555K64585O3181J2695K30074K97726J73330L04043M48168L68714
3954.8F81944132K79844K68221K41339K39968K36869J60396J53899J86086J80483K17795
3975.2F84109032K60472J99557J35481J68383K05934K29657K16305J69814J62959K05636
3995.6F86063230K31683
3997.6F86294913
$$ y = [667558432, 668662071, 669586957, 669766366, 669867575, 670346916, 670731425, 671407759, 671911359, 671986938, 672646761, 673539460, 673717439, 673376203, 673085093, 673171282, 674064100, 675299168, 676124632, 676586628, 676797152, 676712692, 676751137, 677205861, 677607000, 677747846, 678010285, 678344309, 678456306, 678664744, 679241061, 679781616, 680046201, 680109382, 680122077, 680352151, 680649877, 680823207, 681127250, 681575418, 681944132, 682223976, 682492197, 682733536, 682973504, 683210373, 683370769, 683524668, 683710754, 683891237, 684109032, 684369504, 684569061, 684704542, 684872925, 685078859, 685308516, 685524821, 685694635, 685857594, 686063230, 686294913]
##END=$$ End of the data block
