##TITLE=$$ Begin of the data block
##JCAMP-DX=5.00 $$ ACD/SpecManager v 10.08
##SPECTROMETER/DATA SYSTEM=Alpha
##DATE=23 Dec 2014 10:50:12
##DATA TYPE=INFRARED SPECTRUM
##DATA CLASS=XYDATA
##ORIGIN=
##OWNER=
##NPOINTS=1765
##FIRSTX=399.76428223
##LASTX=3997.64306641
##MAXX=3997.64306641
##MINX=399.76428223
##MAXY=0.82852519
##MINY=0.22330688
##XFACTOR=1.0000000000
##YFACTOR=1.000000000000000e-9
##FIRSTY=0.52606595
##DELTAX=2.03961372
##XUNITS=1/CM
##YUNITS=ARBITRARY UNITS
##XYDATA=(X++(Y..Y))
$$ plain form
399.8 526065946 520929396 517130792 515203476 515138209 515939415 517162859 519048333 521102548 521961510
418.1 521961510 520352364 517785311 515685141 513994336 511867404 508573294 504816711 501993656
434.4 501993656 500614882 500580132 502314448 506348372 511716545 516757429 520722628 523224711 524396360
452.8 524396360 525007427 525275290 524634719 522986352 520662844 518013477 515120804 511831582 507995367
471.2 507995367 504002690 500983059 499142408 497841150 496620774 495752901 495624930 495955944 496120930
489.5 496120930 495591193 494374305 492836535 491232574 489455640 487175345 484602690 481969982 478917003
507.9 478917003 475358307 471449107 467166007 462536663 457840681 453563422 450084746 447664231
524.2 447664231 446449399 446242452 446664900 447749704 450023144 453998953 459552795 465731978 471145898
$$ packed form
399.8E26065946n136550l798604j927316o5267Q01206J223444J885474K054215Q58962
418.1E21961510j609146k567053k100170j690805k126932l294110l756583k823055
434.4E01993656j378774l4750J734316M033924N368173N040884L965199K502083J171649
452.8E24396360O11067K67863o40571j648367k323508k649367k892673l289222l836215
471.2E07995367l992677l019631j840651j301258j220376q67873j27971L31014J64986
489.5D96120930n29737j216888j537770j603961j776934k280295k572655k632708l052979
507.9D78917003l558696l909200m283100m629344m695982m277259l478676k420515
524.2D47664231j214832k06947M22448J084804K273440L975809N553842O179183N413920
$$ plain form
542.5 471145898 474863827 476804763 477170050 476225138 474329084 471684098 468320131 464129597 459103733
560.9 459103733 453362137 446871519 439622313 432268858 426111817 422255397 421167761 422821254
577.2 422821254 426910967 432929307 440221548 448073298 455529511 461441696 465266287 467338830
593.5 467338830 468365729 468755662 468590409 468013346 467498273 467612714 468418628 469568700 470835090
611.9 470835090 472469985 474987149 478561312 482732594 486915469 490988761 495116085 499246597
628.2 499246597 502813518 505384147 507275879 509156406 511185765 512957275 514176071 514954567 515855610
646.6 515855610 517332077 518966556 520096660 520774782 521595597 522982657 524605513 525786817 526458085
664.9 526458085 527365565 529363692 531385064 532757640 533783019 535043836 537023604 539267123 540906966
$$ packed form
542.5D71145898L717929J940936L65287r44912j896054k644986l363967m190534n025864
560.9D59103733n741596o490618p249206p353455o157041l856420j087636J653493
577.2D22821254M089713O018340P292241P851750P456213N912185L824591K072543
593.5D67338830J026899L89933j65253n77063n15073J14441Q05914J150072J266390
611.9D70835090J634895K517164L574163M171282M182875M073292M127324M130512
628.2D99246597L566921K570629J891732J880527K029359J771510J218796P78496R01043
646.6E15855610J476467J634479J130104O78122Q20815J387060J622856J181304O71268
664.9E26458085R07480J998127K021372J372576J025379J260817J979768K243519J639843
$$ plain form
683.3 540906966 541727126 542274058 543013394 543531060 542887270 540759981 537757516 534706891 531765342
701.6 531765342 528643131 525588036 523565650 523524404 525569081 528925955 532847881 537409365 543247521
720 543247521 550237000 557273567 563574672 569209933 574655652 579966724 584498048 587635458 589512646
738.3 589512646 590717733 591373146 590853631 588392794 584106982 579091668 574164033 569047868 563331783
756.7 563331783 557526410 552840173 550209463 549636543 550789654 553885460 559479237 567601442 577359498
775.1 577359498 587397754 596719146 605112731 612762332 619568169 625137269 629402995 633045316
791.4 633045316 637098134 641881227 646866381 651486039 655666769 659713149 663682520 667065978
807.7 667065978 669276655 670529008 671668470 673007131 673890710 673627615 672293365 670370817 667958379
$$ packed form
683.3E40906966Q20160N46932P39336N17666o43790k127289l002465l050625k941549
701.6E31765342l122211l055095k022386m1246K044677L356874L921926M561484N838156
720E43247521O989479P036567O301105N635261N445719N311072M531324L137410J877188
738.3E89512646J205087O55413n19515k460837m285812n015314m927635n116165n716085
756.7E63331783n805373m686237k630710n72920J153111L095806N593777Q122205R758056
775.1E77359498J0038256R321392Q393585P649601O805837N569100M265726L642321
791.4F33045316M052818M783093M985154M619658M180730M046380L969371L383458
807.7F67065978K210677J252353J139462J338661Q83579k63095j334250j922548k412438
$$ plain form
826 667958379 664572716 659700871 653488398 646819353 640485168 634564817 628762960 623148441 618195415
844.4 618195415 614094436 610474050 606734395 602434039 597565353 592598021 588448167 586625040
860.7 586625040 588790417 595515549 605973423 618762076 632141769 644166768 653472304 659624398
877 659624398 662557781 662112057 658421934 652364135 645191133 637831926 630658329 623745620 617247641
895.4 617247641 611359358 605967760 600539744 594404876 587187588 578919470 569770217 559768677
911.7 559768677 548942745 537723899 527051747 518042326 511455238 507328331 505107820 504215777
928 504215777 504475653 505959630 508595765 512170613 516529500 521501482 526468992 529900849 529811740
946.4 529811740 525071800 515980780 503603160 488952100 472719610 455384970 437315047 418722212
$$ packed form
826F67958379l385663m871845o212473o669045o334185n920351n801857n614519m953026
844.4F18195415m100979l620386l739655m300356m868686m967332m149854j823127
860.7E86625040K165377O725132J0457874J2788653J3379693J2024999R305536O152094
877F59624398K933383m45724l690123o057799p173002p359207p173597o912709o497979
895.4F17247641n888283n391598n428016o134868p217288q268118r149253j0001540
911.7E59768677j0825932j1218846j0672152r009421o587088m126907k220511q92043
928E04215777K59876J483977K636135L574848M358887M971982M967510L431857q9109
946.4E29811740m739940r091020j2377620j4651060j6232490j7334640j8069923j8592835
$$ plain form
962.7 418722212 399697781 380302995 360612005 340804160 321230739 302332819 284619868
977 284619868 268668979 254990548 243891045 235457808 229581028 225912496 223971084 223306879
993.3 223306879 223596409 224577263 225945085 227369279 228551567 229309127 229585201 229411304 228983507
1011.6 228983507 228659511 228787065 229635894 231262922 233534917 236336321 239605412 243232504 247035980
1030 247035980 250795722 254148394 256738335 258525789 259760201 260732561 261677802 262816757 264473200
1048.4 264473200 267082840 270989001 276255757 282730460 290360332 299287677 309538245 320254505
1064.7 320254505 328972965 332199961 327941090 317974597 306833208 298351347 293698311 292345315
1081 292345315 293486685 296396166 300454170 305357188 311037838 317259938 323350370 328402191 331873298
$$ packed form
962.7D18722212j9024431j9394786j9690990j9807845j9573421j8897920j7712951
977B84619868j5950889j3678431j1099503q433237n876780l668532j941412o64205
993.3B23306879K89530R80854J367822J424194J182288P57560K76074j73897m27797
1011.6B28983507l23996J27554Q48829J627028K271995K801404L269091L627092L803476
1030B47035980L759742L352672K589941J787454J234412R72360R45241J138955J656443
1048.4B64473200K609640L906161N266756O474703P629872Q927345J0250568J0716260
1064.7C20254505Q718460L226996m258871r966493j1141389q481861m653036j352996
1081B92345315J141370K909481M058004M903018N680650O222100O090432N051821L471107
$$ plain form
1099.4 331873298 333860725 334984154 336083591 337917298 340852737 344728202 349094987 353402972
1115.7 353402972 357105494 359908193 361950576 363783568 366138428 369481802 373799980 378467590
1132 378467590 382236004 383763582 382179230 377362669 370045513 361506075 352903455 344999373 338257760
1150.3 338257760 332958817 329290301 327300698 326874495 327906519 330450982 334743977 341091335
1166.7 341091335 349556297 359903097 371744663 384690315 398436159 412707806 427120477
1180.9 427120477 441162825 454441309 466684043 477475882 486311466 492963046 497630596 500862002
1197.3 500862002 503339052 505544782 507717073 510115027 513145685 517150879 522125423 527688444
1213.6 527688444 533331335 538629770 543189526 546592355 548549891 549070060 548487902 547281384 545778394
$$ packed form
1099.4C31873298J987427J123429J099437J833707K935439L875465M366785M307985
1115.7C53402972L702522K802699K042383J832992K354860L343374M318178M667610
1132C78467590L768414J527578j584352m816561p317156q539438q602620p904082o741613
1150.3C38257760n298943l668516j989603m26203J032024K544463M292995O347358
1166.7C41091335Q464962J0346800J1841566J2945652J3745844J4271647J4412671
1180.9D27120477J4042348J3278484J2242734J0791839Q835584O651580M667550L231406
1197.3E00862002K477050K205730K172291K397954L030658M005194M974544N563021
1213.6E27688444N642891N298435M559756L402829J957536N20169n82158j206518j502990
$$ plain form
1231.9 545778394 544121087 542408466 540794790 539540172 538906515 539026499 539911151 541461766 543526947
1250.3 543526947 545936227 548393548 550529540 552164435 553443193 554674685 556125104 557936728
1266.6 557936728 560051918 562249422 564241111 565699220 566369057 566220105 565512538 564621925 563703299
1285 563703299 562685788 561479270 560041606 558394551 556561112 554535270 552371204 550171316 548067987
1303.3 548067987 546136558 544322670 542616606 541069329 539679646 538396120 537082672 535548210
1319.6 535548210 533483863 530458689 526236832 520975649 515150666 509376168 504220903 500076354
1336 500076354 497162402 495657027 495385498 495712519 496166706 496544898 496706575 496532619 495954603 495051384
1356.4 495051384 493933409 492586493 491124481 490006298 489244729 488665879 488499850 488793075 489503115
$$ packed form
1231.9E45778394j657307j712621j613676j254618o33657J19984Q84652J550615K065181
1250.3E43526947K409280K457321K135992J634895J278758J231492J450419J811624
1266.6E57936728K115190K197504J991689J458109O69837j48952p07567q90613r18626
1285E63703299j017511j206518j437664j647055j833439k025842k164066k199888k103329
1303.3E48067987j931429j813888j706064j547277j389683j283526j313448j534462
1319.6E35548210k064347l025174m221857n261183n824983n774498n155265m144549
1336E00076354k913952j505375k71529L27021M54187L78192J61677j73956n78016r03219
1356.4D95051384j117975j346916j462012j118183p61569n78850j66029K93225P10040
$$ plain form
1374.7 489503115 490457088 491398692 492425203 493882328 496198356 499781311 504013062 507465839 509640336
1393.1 509640336 510592580 510558367 509882510 508976579 507769644 506114364 504369795 502560914 500679553
1411.4 500679553 499050558 497695804 496334404 495358288 495348692 495907038 496785074 497851849 499047488
1429.8 499047488 500516176 502089381 503831029 506098330 508347392 510287762 511884570 512913823
1446.1 512913823 513229370 512913764 512002826 510449052 507837236 505512178 505477309 506484628 508461893
1464.5 508461893 512095332 516850352 522850692 531747162 542274773 551937938 560650051 568798125
1480.8 568798125 576556385 583386302 589494467 595822930 602555871 608129084 612556279 617072225
1497.1 617072225 621794939 625985444 629145801 631462455 634410083 638251126 641614854 644314349
$$ packed form
1374.7D89503115R53973R41604J026511J457125K316028L582955M231751L452777K174497
1393.1E09640336R52244l4213o75857r05931j206935j655280j744569j808881j881361
1411.4E00679553j628995j354754j361400r76116r596N58346Q78036J066775J195639
1429.8D99047488J468688J573205J741648K267301K249062J940370J596808J029253
1446.1E12913823L15547l15606r10938j553774k611816k325058l4869J007319J977265
1464.5E08461893L633439M755020O000340Q896470J0527611R663165Q712113Q148074
1480.8E68798125P758260O829917O108165O328463O732941N573213M427195M515946
1497.1F17072225M722714M190505L160357K316654K947628L841043L363728K699495
$$ plain form
1513.4 644314349 646384776 648346961 650298119 652386963 654698610 656678200 658451021 659995437
1529.7 659995437 661095321 662090719 663140655 663408279 662764013 662823796 663777590 664610028 664788544
1548.1 664788544 664393067 663904369 663376212 662422895 660456061 659292221 659734070 659828365 659421980
1566.4 659421980 658633649 657871723 657634795 657212377 656584263 656523407 656476855 656039357 655493677 654875815
1586.8 654875815 653996944 652757645 651289761 649769485 648211777 646382928 644076228 641440868
1603.2 641440868 638704121 635827363 632604003 629165411 625628650 621380806 616721630 613499761
1619.5 613499761 610495806 606581569 602925658 599683642 596682668 594220996 591541767 588303745
1635.8 588303745 586656928 586407959 586192548 585709095 585180640 585851908 587333977 588689744 591397524
$$ packed form
1513.4F44314349K070427J962185J951158K088844K311647J979590J772821J544416
1529.7F59995437J099884R95398J049936K67624o44266N9783R53794Q32438J78516
1548.1F64788544l95477m88698n28157r53317j966834j163840M41849R4295m06385
1566.4F59421980p88331p61926k36928m22418o28114o0856m6552m37498n45680o17862
1586.8F54875815q78871j239299j467884j520276j557708j828849k306700k635360
1603.2F41440868k736747k876758l223360l438592l536761m247844m659176l221869
1619.5F13499761l003955l914237l655911l242016l000974k461672k679229l238022
1635.8E88303745j646817k48969k15411m83453n28455O71268J482069J355767K707780
$$ plain form
1654.1 591397524 594968379 598183572 601461947 605325401 609636426 613417089 617272198 622350931
1670.5 622350931 627509415 632548094 637907624 642793357 647130072 651620567 657692432 663638413
1686.8 663638413 668511093 673405230 677711964 681475520 685136914 688810766 693384409 697552502
1703.1 697552502 700873733 704106152 707015336 709567547 711842775 713790715 715860546 718354225
1719.4 718354225 720702350 722931504 725227773 727160096 728639662 729871035 731542647 734103978
1735.7 734103978 736233532 737815678 739532709 741570950 743671596 745574653 747565508 750091136
1752 750091136 752640545 754959166 757082343 758725226 760269046 762085974 763760924 765010595 765785992
1770.4 765785992 766611338 768205404 770032942 771441936 772376120 773148596 774097443 775322139 776357234
$$ packed form
1654.1E91397524L570855L215193L278375L863454M311025L780663L855109N078733
1670.5F22350931N158484N038679N359530M885733M336715M490495O071865N945981
1686.8F63638413M872680M894137M306734L763556L661394L673852M573643M168093
1703.1F97552502L321231L232419K909184K552211K275228J947940K069831K493679
1719.4G18354225K348125K229154K296269J932323J479566J231373J671612K561331
1735.7G34103978K129554J582146J717031K038241K100646J903057J990855K525628
1752G50091136K549409K318621K123177J642883J543820J816928J674950J249671P75397
1770.4G65785992Q25346J594066J827538J408994R34184P72476R48847J224696J035095
$$ plain form
1788.8 776357234 776804686 777265608 778290451 779483438 780525208 781394899 782214165 783055723 783962309
1807.1 783962309 784890592 785715461 786352336 786909640 787648380 788628042 789422154 789675832 789737940 790074885
1827.5 790074885 790795326 791840494 792588770 792810380 793109417 793729067 794111252 793985605 793999732 794512570
1847.9 794512570 795261204 795935988 796219587 796158493 796160221 796546519 797116756 797347248 796987057 796590626
1868.3 796590626 797094405 798133969 798784852 798894465 798918962 799283504 799944103 800476491 800574601 800460815
1888.7 800460815 800763071 801475823 802009225 802186608 802208960 802370787 802787483 803158641 803128779 802870572
1909.1 802870572 802931488 803404748 803772032 803681314 803423703 803392231 803800106 804490209 804840326 804706395
1929.5 804706395 804574311 804834068 805337429 805592358 805342853 804959238 805134058 805823743 806302726 806295514
$$ packed form
1788.8G76357234M47452M60922J024843J192987J041770Q69691Q19266Q41558R06586
1807.1G83962309R28283Q24869O36875N57304P38740R79662P94112K53678O2108L36945
1827.5G90074885P20441J045168P48276K21610K99037O19650L82185j25647J4127N12838
1847.9G94512570P48634O74784K83599o1094J728L86298N70237K30492l60191l96431
1868.3G96590626N03779J039564O50883J09613K4497L64542O60599N32388R8110j13786
1888.7H00460815L02256P12752N33402J77383K2352J61827M16696L71158k9862k58207
1909.1H02870572O0916M73260L67284r0718k57611l1472M07875O90103L50117j33931
1929.5H04706395j32084K59757N03361K54929k49505l83615J74820O89685M78983p212
$$ plain form
1949.9 806295514 806176245 806387544 806937873 807403445 807466805 807310939 807371974 807793260 808274448 808428526
1970.3 808428526 808320165 808380425 808770776 809184611 809269845 809074044 808975220 809201419 809509337 809493124
1990.7 809493124 809228778 809170127 809465110 809847474 809921920 809601963 809253395 809212863 809379458 809316635
2011.1 809316635 808789313 808090150 807694554 807605028 807303369 806478441 805549502 805232286 805457532 805527687
2031.5 805527687 805103719 804400980 803882718 803745627 803676248 803303957 802719474 802340031 802371919 802529335
2051.9 802529335 802413404 802061796 801868320 802043676 802343190 802415848 802275062 802222669 802432299 802771866
2072.3 802771866 802900732 802681983 802444160 802562058 802950323 803213358 803161144 803003371 803097248 803466380
2092.7 803466380 803771019 803803921 803726614 803847253 804259717 804685116 804783404 804633975 804641604 804968357
$$ packed form
1949.9H06295514j19269K11299N50329M65572O3360j55866O1035M21286M81188J54078
1970.3H08428526j08361O0260L90351M13835Q5234j95801r8824K26199L07918j6213
1990.7H09493124k64346n8651K94983L82364P4446l19957l48568m0532J66595o2823
2011.1H09316635n27322o99163l95596q9526l01659q24928r28939l17216K25246P0155
2031.5H05527687m23968p02739n18262j37091o9379l72291n84483l79443L1888J57416
2051.9H02529335j15931l51608j93476J75356K99514P2658j40786n2393K09630L39567
2072.3H02771866J28866k18749k37823J17898L88265K63035n2214j57773R3877L69132
2092.7H03466380L04639L2902p7307J20639M12464M25399R8288j49429P629L26753
$$ plain form
2113.1 804968357 805332124 805400550 805207431 805101871 805281937 805554092 805615783 805429757 805264413 805369377
2133.5 805369377 805665016 805795670 805599868 805361152 805421650 805722594 805907130 805820405 805688024 805782020
2153.9 805782020 806102991 806441009 806615174 806718588 807003498 807507694 808013439 808358550 808648348 809067130
2174.3 809067130 809655786 810280442 810751915 811076701 811495066 812140405 812803686 813220978 813451052 813775837
2194.6 813775837 814305127 814869404 815284491 815562129 815866053 816339076 816934168 817432165 817722380 817993760
2215 817993760 818462670 819039702 819479644 819704711 819873035 820169747 820593178 820975065 821212947 821393490
2235.4 821393490 821652949 821999490 822305799 822478116 822572112 822739601 823029041 823310375 823466122 823559403
2255.8 823559403 823744059 824044585 824348152 824560285 824710906 824909329 825207114 825503826 825692594 825836062
$$ packed form
2113.1H04968357L63767O8426j93119j05560J80066K72155O1691j86026j65344J04964
2133.5H05369377K95639J30654j95802k38716O0498L00944J84536q6725j32381R3996
2153.9H05782020L20971L38018J74165J03414K84910N04196N05745L45111K89798M18782
2174.3H09067130N88656O24656M71473L24786M18365O45339O63281M17292K30074L24785
2194.6H13775837N29290N64277M15087K77638L03924M73023N95092M97997K90215K71380
2215H17993760M68910N77032M39942K25067J68324K96712M23431L81887K37882J80543
2235.4H21393490K59459L46541L06309J72317R3996J67489K89440K81334J55747R3281
2255.8H23559403J84656L00526L03567K12133J50621J98423K97785K96712J88768J43468
$$ plain form
2276.2 825836062 826025009 826273561 826548874 826777399 826924741 827049553 827220023 827402711 827500403 827531576
2296.6 827531576 827610612 827748299 827872753 827931464 827936053 827994764 828152657 828296542 828353763 828365028 828384459
2319.1 828384459 828432262 828489542 828525186 828508258 828506231 828517020 828396499 828141093 827845693 827632070 827559173
2341.5 827559173 827480733 827235937 826968431 826864541 826945424 827109814 827139020 826931238 826600432 826386571
2361.9 826386571 826287031 826024055 825600266 825233340 825016558 824868381 824645281 824366331 824170470 824113071
2382.3 824113071 824119806 824014902 823724568 823414207 823277473 823258936 823104203 822726965 822315037 822039425
2402.7 822039425 821884573 821684718 821299076 820807934 820392311 820087552 819756389 819249153 818620443 818084896
2423.1 818084896 817707539 817327499 816774189 816062510 815416873 814961791 814520836 813881755 813103437 812428474
$$ packed form
2276.2H25836062J88947K48552K75313K28525J47342J24812J70470J82688R7692L1173
2296.6H27531576P9036J37687J24454N8711M589N8711J57893J43885N7221J1265J9431
2319.1H28384459M7803N7280L5644j6928k027J0789j20521k55406k95400k13623p2897
2341.5H27559173p8440k44796k67506j03890Q0883J64390K9206k07782l30806k13861
2361.9H26386571r9540k62976m23789l66926k16782j48177k23100k78950j95861n7399
2382.3H24113071O735j04904k90334l10361j36734j8537j54733l77238m11928k75612
2402.7H22039425j54852j99855l85642m91142m15623l04759l31163n07236o28710n35547
2423.1H18084896l77357l80040n53310p11679o45637m55082m40955o39081p78318o74963
$$ plain form
2443.5 812428474 811941385 811496019 810905218 810159922 809464097 808964193 808541477 807982981 807285070 806633770
2463.9 806633770 806159616 805792809 805342615 804718614 804062903 803569496 803210914 802787364 802197814 801579654
2484.3 801579654 801137447 800869286 800596833 800189197 799707651 799351871 799177110 799004912 798672438 798229218
2504.7 798229218 797867060 797667921 797502160 797215879 796783745 796323955 796006978 795773208 795352519 794695973
2525.1 794695973 794052184 793602645 793221831 792672157 791929424 791176975 790576279 790080786 789487362 788711905
2545.5 788711905 787904143 787260354 786774814 786229908 785487056 784691095 784045875 783525646 782982230 782343626
2565.8 782343626 781645656 781009674 780493677 779959917 779280007 778532147 777886212 777416766 777029037 776561320
2586.2 776561320 775971830 775399029 774979174 774672568 774318993 773812413 773269296 772858083 772515178 772049308
$$ packed form
2443.5H12428474m87089m45366n90801p45296o95825m99904m22716n58496o97911o51300
2463.9H06633770m74154l66807m50194o24001o55711m93407l58582m23550n89550o18160
2484.3H01579654m42207k68161k72453m07636m81546l55780j74761j72198l32474m43220
2504.7G98229218l62158j99139j65761k86281m32134m59790l16977k33770m20689o56546
2525.1G94695973o43789m49539l80814n49674p42733p52449o00696m95493n93424p75457
2545.5G88711905q07762o43789m85540n44906p42852p95961o45220n20229n43416o38604
2565.8G82343626o97970o35982n15997n33760o79910p47860o45935m69446l87729m67717
2586.2G76561320n89490n72801m19855l06606l53575n06580n43117m11213l42905m65870
$$ plain form
2606.6 772049308 771389961 770661831 770016730 769415140 768680692 767739475 766692579 765699863 764785647
2625 764785647 763809860 762682676 761461318 760263383 759152472 758068621 756873310 755539238 754248261
2643.4 754248261 753107786 752008200 750829577 749547064 748273551 747147620 746114373 745010555
2659.7 745010555 743792415 742577136 741496444 740533769 739533126 738441944 737383842 736450613 735619187
2678 735619187 734776199 733837426 732857287 731909811 731017649 730148673 729204416 728168070 727144599 726168573
2698.4 726168573 725147367 724017382 722827375 721652985 720515013 719397783 718268812 717120588
2714.7 717120588 716021001 714997470 713988364 712982178 711999357 711027384 710105956 709265232 708422601
2733.1 708422601 707551003 706719339 705947340 705204606 704461038 703686059 702879906 702128589 701480925 700859904
$$ packed form
2606.6G72049308o59347p28130o45101o01590p34448r41217j046896r92716r14216
2625G64785647r75787j127184j221358j197935j110911j083851j195311j334072j290977
2643.4G54248261j140475j099586j178623j282513j273513j125931j033247j103818
2659.7G45010555j218140j215279j080692r62675j000643j091182j058102r33229q31426
2678G35619187q42988r38773r80139r47476q92162q68976r44257j036346j023471r76026
2698.4G26168573j021206j129985j190007j174390j137972j117230j128971j148224
2714.7G17120588j099587j023531j009106j006186r82821r71973r21428q40724q42631
2733.1G08422601q71598q31664p71999p42734p43568p74979q06153p51317o47664o21021
$$ plain form
2753.5 700859904 700212717 699554980 698921859 698360145 697842658 697260737 696592152 695918620 695276558 694616973
2773.9 694616973 693850577 692944944 691976368 691025436 690089762 689095020 687977552 686755121 685493052
2792.2 685493052 684203744 682814062 681267202 679609060 677949846 676312983 674605787 672748625
2808.6 672748625 670765162 668740690 666696072 664591312 662399709 660112381 657734931 655290067
2824.9 655290067 652776003 650167644 647451758 644637406 641762257 638804972 635672510 632318377
2841.2 632318377 628771722 625085115 621291518 617475331 613812506 610417545 607260644 604208946
2857.5 604208946 601064324 597614229 593686461 589227200 584288478 578949690 573301256 567444623
2873.8 567444623 561547339 555871785 550661504 546056271 542153239 539048731 536740422 535111189
$$ packed form
2753.5G00859904o47187o57737o33121n61714n17487n81921o68585o73532o42062o59585
2773.9F94616973p66396r05633r68576r50932r35674r94742j117468j222431j262069
2792.2F85493052j289308j389682j546860j658142j659214j636863j707196j857162
2808.6F72748625j983463k024472k044618k104760k191603k287328k377450k444864
2824.9F55290067k514064k608359k715886k814352k875149k957285l132462l354133
2841.2F32318377l546655l686607l793597l816187l662825l394961l156901l051698
2857.5F04208946l144622l450095l927768m459261m938722n338788n648434n856633
2873.8E67444623n897284n675554n210281m605233l903032l104508k308309j629233
$$ plain form
2890.1 535111189 533992290 533185244 532518983 531853914 531084478 530149877 528981864 527519047 525700569
2908.5 525700569 523427665 520649135 517404377 513777673 509932816 506114721 502574682 499529749
2924.8 499529749 497197926 495753258 495281756 495897800 497702122 500651419 504601896 509356618 514699042
2943.2 514699042 520411849 526287138 532287419 538453639 544653475 550772727 556840837 562824368
2959.5 562824368 568594694 574013412 578988612 583569646 587901711 592108607 596245170 600283623
2975.8 600283623 604199350 607981384 611559749 614876091 617902219 620629430 623131871 625397742
2992.1 625397742 627303123 628855348 630091071 630998194 631607771 631920636 631920993 631593466 630950987 630078614
3012.5 630078614 628978670 627592862 625932395 624050915 622062445 620024920 617864907 615559757
$$ packed form
2890.1E35111189j118899q07046o66261o65069p69436r34601j168013j462817j818478
2908.5E25700569k272904k778530l244758l626704l844857l818095l540039l044933
2924.8D99529749k331823j444668m71502O16044J804322K949297L950477M754722N342424
2943.2E14699042N712807N875289O000281O166220O199836O119252O068110N983531
2959.5E62824368N770326N418718M975200M581034M332065M206896M136563M038453
2975.8F00283623L915727L782034L578365L316342L026128K727211K502441K265871
2992.1F25397742J905381J552225J235723R07123O09577L12865L57l27527o42479q72373
3012.5F30078614j099944j385808j660467j881480j988470k037525k160013k305150
$$ plain form
3028.8 615559757 613185585 610811889 608361125 605751932 603117645 600509942 597792625 594928265
3045.1 594928265 592004955 589107454 586198628 583223403 580238521 577249825 574214160 571173906
3061.5 571173906 568204284 565311134 562363684 559260249 556102633 553055048 550201654 547432959
3077.8 547432959 544508994 541414261 538300991 535218000 532209277 529264629 526239157 523117483
3094.1 523117483 520071149 517206609 514357686 511346877 508318126 505458415 502665639 499773175
3110.4 499773175 496945232 494318455 491684318 488903672 485959470 482898086 479929239 477199733
3126.7 477199733 474609762 471955001 469204068 466537118 464039981 461549282 458880305 456115961
3143 456115961 453465462 450974435 448643833 446439862 444131047 441600204 439016461 436506152 434113920
$$ packed form
3028.8F15559757k374172k373696k450764k609193k634287k607703k717317k864360
3045.1E94928265k923310k897501k908826k975225k984882k988696l035665l040254
3061.5E71173906k969622k893150k947450l103435l157616l047585k853394k768695
3077.8E47432959k923965l094733l113270l082991l008723k944648l025472l121674
3094.1E23117483l046334k864540k848923l010809l028751k859711k792776k892464
3110.4D99773175k827943k626777k634137k780646k944202l061384k968847k729506
3126.7D77199733k589971k654761k750933k666950k497137k490699k668977k764344
3143D56115961k650499k491027k330602k203971k308815k530843k583743k510309k392232
$$ plain form
3161.4 434113920 431827873 429581702 427376390 425192893 423012257 420871735 418777436 416692108
3177.7 416692108 414630473 412616700 410627246 408670425 406773806 404918909 403039992 401151240
3194 401151240 399335355 397560328 395791113 394089907 392452180 390819579 389166534 387548596 386023074
3212.4 386023074 384538114 383070886 381611198 380125463 378653318 377236098 375880837 374615610
3228.7 374615610 373481572 372378707 371077418 369624883 368263870 367040604 365930408 364928216
3245 364928216 363905013 362718761 361488372 360427380 359505236 358558863 357571036 356617391 355707139
3263.4 355707139 354839563 354087859 353449374 352715015 351797134 350829035 349907845 349072725 348301589 347564727
3283.8 347564727 346844822 346133024 345531136 345013827 344353944 343466192 342487752 341646552 341059417 340609610
$$ packed form
3161.4D34113920k286047k246171k205312k183497k180636k140522k094299k085328
3177.7D16692108k061635k013773j989454j956821j896619j854897j878917j888752
3194D01151240j815885j775027j769215j701206j637727j632601j653045j617938j525522
3212.4C86023074j484960j467228j459688j485735j472145j417220j355261j265227
3228.7C74615610j134038j102865j301289j452535j361013j223266j110196j002192
3245C64928216j023203j186252j230389j060992r22144r46373r87827r53645r10252
3263.4C55707139q67576p51704o38485p34359r17881r68099r21190q35120p71136p36862
3283.8C47564727p19905p11798o01888n17309o59883q87752r78440q41200n87135m49807
$$ plain form
3304.2 340609610 340016603 339117199 338035494 336990625 336100161 335285276 334448576 333633959 332888633
3322.5 332888633 332141340 331246555 330223799 329251111 328398436 327662945 326992661 326213330 325282305
3340.9 325282305 324306667 323321819 322432369 321688652 320837766 319749713 318650991 317742169 316965342
3359.2 316965342 316135824 315278739 314622343 314058423 313213468 312068462 310961425 310078651 309306592
3377.6 309306592 308552712 307784468 307036668 306455135 306138247 306023031 305754483 305096000 304433227 304186612
3398 304186612 304112554 303673595 302903205 302340597 302113891 301957577 301728249 301358044 300917327 300610274
3418.4 300610274 300425172 300271720 300279140 300521046 300829142 301027149 301249593 301599830 301775038 301613092
3438.8 301613092 301406533 301437318 301717430 302118957 302534342 302970320 303407073 303866237 304505408 305259615
$$ packed form
3304.2C40609610n93007q99404j081705j044869q90464q14885q36700q14617p45326
3322.5C32888633p47293q94785j022756r72688q52675p35491o70284p79331r31025
3340.9C25282305r75638r84848q89450p43717q50886j088053j098722r08822p76827
3359.2C16965342q29518q57085o56396n63920q44955j145006j107037q82774p72059
3377.6C09306592p53880p68244p47800n81533l16888j15216k68548o58483o62773k46615
3398C04186612p4058m38959p70390n62608k26706j56314k29328l70205m40717l07053
3418.4C00610274j85102j53452P420K41906L08096J98007K22444L50237J75208j61946
3438.8C01613092k06559L0785K80112M01527M15385M35978M36753M59164O39171P54207
$$ plain form
3459.2 305259615 305839568 306407481 307333171 308399171 309105337 309392869 309689134 310303271 311213493
3477.5 311213493 312093735 312706888 313345164 314194292 315003037 315743238 316639513 317654043 318628579
3495.9 318628579 319516301 320403188 321289301 322047651 322725356 323500663 324540466 325828373 327012688
3514.2 327012688 327924430 328840196 329956979 331213385 332334012 333189934 334077984 335262716 336677134
3532.6 336677134 338140547 339461118 340665072 342056572 343612283 345031083 346286714 347635686
3548.9 347635686 349087387 350630879 352371663 354240954 356191248 358171910 359954506 361455321
3565.2 361455321 363400698 366211385 369013757 371489823 374052495 376836002 379802525 382965952
3581.5 382965952 386051148 388661832 391197681 394492835 398006231 401288748 404738486 408462852
$$ packed form
3459.2C05259615N79953N67913R25690J066000P06166K87532K96265O14137R10222
3477.5C11213493Q80242O13153O38276Q49128Q08745P40201Q96275J014530R74536
3495.9C18628579Q87722Q86887Q86113P58350O77705P75307J039803J287907J184315
3514.2C27012688R11742R15766J116783J256406J120627Q55922Q88050J184732J414418
3532.6C36677134J463413J320571J203954J391500J555711J418800J255631J348972
3548.9C47635686J451701J543492J740784J869291J950294J980662J782596J500815
3565.2C61455321J945377K810687K802372K476066K562672K783507K966523L163427
3581.5C82965952L085196K610684K535849L295154L513396L282517L449738L724366
$$ plain form
3597.9 408462852 412176639 415933460 419686139 423074096 426359326 430027306 433946669 437999427
3614.2 437999427 441930115 445706666 450019658 454559237 458538979 461646706 464604408 468965530
3630.5 468965530 473746419 478095680 482233912 486246407 490232825 494194984 497759163 500668466
3646.8 500668466 503835499 508421719 513151288 517146885 521247923 525624871 529546618 533069432
3663.1 533069432 536454380 539322197 541782439 544947386 548023880 550464332 553854346 557810307
3679.4 557810307 561443031 564762533 567587495 569715142 571645021 574318647 577371716 580137312
3695.8 580137312 582451284 584291875 586085677 588411272 590768993 592419565 593377948 594740212
3712.1 594740212 597227335 599720180 601557434 602951586 604217350 605516195 607094347 608994663
$$ packed form
3597.9D08462852L713787L756821L752679L387957L285230L667980L919363M052758
3614.2D37999427L930688L776551M312992M539579L979742L107727K957702M361122
3630.5D68965530M780889M349261M138232M012495L986418L962159L564179K909303
3646.8E00668466L167033M586220M729569L995597M101038M376948L921747L522814
3663.1E33069432L384948K867817K460242L164947L076494K440452L390014L955961
3679.4E57810307L632724L319502K824962K127647J929879K673626L053069K765596
3695.8E80137312K313972J840591J793802K325595K357721J650572R58383J362264
3712.1E94740212K487123K492845J837254J394152J265764J298845J578152J900316
$$ plain form
3728.4 608994663 610537708 611326396 611888826 613295496 615525603 617366612 617853820 617902279 619308829
3746.7 619308829 620533943 621015131 622600436 624787152 626235604 627202570 628605962 630153716 631261706
3765.1 631261706 632119536 632926643 634077013 635618210 636934638 637739182 638331950 639224112 640199125
3783.5 640199125 641135514 642247796 643392920 644445062 645188272 645590544 646116495 646411240 646600008
3801.8 646600008 647691488 648687303 649565876 651082397 652386189 652671635 652544260 652985513 653226018
3820.2 653226018 653814793 655292153 656493962 657354295 657998025 658487797 659044206 659187496 659055054
3838.5 659055054 659654677 660837948 662182689 663432658 664220989 663982153 662507713 662462950 664444625
3856.9 664444625 666066468 666678965 666708887 667052388 667644024 667770803 668075800 668924212 669966698
$$ packed form
3728.4F08994663J543045P88688N62430J406670K230107J841009M87208M8459J406550
3746.7F19308829J225114M81188J585305K186716J448452R66966J403392J547754J107990
3765.1F31261706Q57830Q07107J150370J541197J316428Q04544N92768Q92162R75013
3783.5F40199125R36389J112282J145124J052142P43210M02272N25951K94745J88768
3801.8F46600008J091480R95815Q78573J516521J303792K85446j27375M41253K40505
3820.2F53226018N88775J477360J201809Q60333O43730M89772N56409J43290j32442
3838.5F59055054N99623J183271J344741J249969P88331k38836j474440m4763J981675
3856.9F64444625J621843O12497K9922L43501N91636J26779L04997Q48412J042486
$$ plain form
3875.2 669966698 670864701 671055317 671222866 671752572 672128081 672796190 673349321 673448563 674042404 674909472
3895.6 674909472 675147951 674864113 674588561 674659491 675453722 676606059 677477658 678030014 678294778 678225100
3916 678225100 678209364 678566873 678937674 679124773 679451168 679816246 679873526 680027485 680649281 681224525
3936.4 681224525 681446552 681500077 681590557 681894779 682182968 682293177 682547271 682978272 683372080 683685482
3956.8 683685482 683924735 684085131 684240639 684483528 684793651 685047209 685165823 685253918 685482919 685824811
3977.2 685824811 686059237 686171532 686332881 686580300 686807334 686947584 687081456 687270522 687487662 687697947
3997.6 687697947
$$ packed form
3875.2F69966698Q98003J90616J67549N29706L75509O68109N53131R9242N93841Q67068
3895.6F74909472K38479k83838k75552P0930P94231J152337Q71599N52356K64764o9678
3916F78225100j5736L57509L70801J87099L26395L65078N7280J53959O21796N75244
3936.4F81224525K22027N3525R0480L04222K88189J10209K54094M31001L93808L13402
3956.8F83685482K39253J60396J55508K42889L10123K53558J18614Q8095K29001L41892
3977.2F85824811K34426J12295J61349K47419K27034J40250J33872J89066K17140K10285
3997.6F87697947
##END=$$ End of the data block
