##TITLE=$$ Begin of the data block
##JCAMP-DX=5.00 $$ ACD/SpecManager v 10.08
##SPECTROMETER/DATA SYSTEM=Alpha
##DATE=23 Dec 2014 10:50:12
##DATA TYPE=INFRARED SPECTRUM
##DATA CLASS=XYDATA
##ORIGIN=
##OWNER=
##NPOINTS=1765
##FIRSTX=399.76428223
##LASTX=3997.64306641
##MAXX=3997.64306641
##MINX=399.76428223
##MAXY=0.82980359
##MINY=0.22338080
##XFACTOR=1.0000000000
##YFACTOR=1.000000000000000e-9
##FIRSTY=0.52658200
##DELTAX=2.03961372
##XUNITS=1/CM
##YUNITS=ARBITRARY UNITS
##XYDATA=(X++(Y..Y))
399.8E26582003n634249m240155j910031K91944J209319J359343J673579J538396J44661
418.1E21014810j493514j857758j981914k031505k258360k991617l566623k975642
434.4E01857877j341582J84596J713216L673017M992307N009770M175305K717197J283348
452.8E24265051N51343K44915n22256j616537k362013k719104k850890l099025l721118
471.2E08170366l887891k833486j798272j436830j285463q93414j12325M22626J78397
489.5D96523708n51045j170963j291484j407057j958876k536774k736807k736956k934456
507.9D79199290l393382l927916m355222m715711m825711m351616l474802k354324
524.2D47800606j183331l11523L27110J121610K338171L946603N465090O123781N438298
$$ y = [526582003, 520947754, 516707599, 514797568, 515089512, 516298831, 517658174, 519331753, 520870149, 521014810, 519521296, 517663538, 515681624, 513650119, 511391759, 508400142, 504833519, 501857877, 500516295, 500700891, 502414107, 506087124, 511079431, 516089201, 520264506, 522981703, 524265051, 524816394, 525061309, 524539053, 522922516, 520560503, 517841399, 514990509, 511891484, 508170366, 504282475, 501448989, 499650717, 498213887, 496928424, 496035010, 495922685, 496345311, 496523708, 495972663, 494801700, 493510216, 492103159, 490144283, 487607509, 484870702, 482133746, 479199290, 475805908, 471877992, 467522770, 462807059, 457981348, 453629732, 450154930, 447800606, 446617275, 446305752, 446632862, 447754472, 450092643, 454039246, 459504336, 465628117, 471066415]
542.5D71066415L787935J953274L72380r05841j849890k493859l300756m323780n087346
560.9D59218532n739153o519615p234097p326036o125927l748775r05842J804799M043371
579.3D27467257N836665P223070P921845P494092N873918L759384J977921R86546M35204
597.6D68975902r7514m50909l89814P5221O84023J132429J344978J657009K383203
616D75314528L398388M092068M192859M162520M302204M303246L640056K506912J770794
634.3E07683575J886964K182186J903236J136958N87702Q71181J537502J678050J179874
652.7E20647228O92844Q57055J476407J652599J115739N76258Q68916K035916K040565
671E31963527J390636J114011J434684K095461K213299J517594O39856M40240P94291
$$ y = [471066415, 474854350, 476807624, 477180004, 476274163, 474424273, 471930414, 468629658, 464305878, 459218532, 453479379, 446959764, 439725667, 432399631, 426273704, 422524929, 421619087, 423423886, 427467257, 433303922, 440526992, 448448837, 455942929, 461816847, 465576231, 467554152, 468540698, 468975902, 468878388, 468427479, 468037665, 468112886, 468796909, 469929338, 471274316, 472931325, 475314528, 478712916, 482804984, 486997843, 491160363, 495462567, 499765813, 503405869, 505912781, 507683575, 509570539, 511752725, 513655961, 514792919, 515380621, 516251802, 517789304, 519467354, 520647228, 521340072, 522197127, 523673534, 525326133, 526441872, 527018130, 527887046, 529922962, 531963527, 533354163, 534468174, 535902858, 537998319, 540211618, 541729212, 542369068, 542809308, 543603599]
689.4E43603599O31452n69523k131343l055811l111898k971769l099441l017962j937688
707.7E24339616J10269K136111L292740L804385M514396N838693O977677P009864O273746
726.1E64297497N616129N509972N421043M526674L025353J797617J252711P40111n61893
744.5E91625214k551854m267991m972159m972578n202293n752206n770206m694283
760.8E53441644k723098n88179J271248L237546N673825Q131028R742558J0010182
777.1E88196754R256065Q298278P651329O944061N633831M216253L596962M044771
793.4F37838304M810810M980862M581392M187942M136443M079222L369749K124965
809.7F70109689J231969J145601J326322Q79229k63453j368225j983046k475023l441692
$$ y = [543603599, 544235051, 543665528, 541534185, 538478374, 535366476, 532394707, 529295266, 526277304, 524339616, 524449885, 526585996, 529878736, 533683121, 538197517, 544036210, 551013887, 558023751, 564297497, 569913626, 575423598, 580844641, 585371315, 588396668, 590194285, 591446996, 592187107, 591625214, 589073360, 584805369, 579833210, 574860632, 569658339, 563906133, 558135927, 553441644, 550718546, 550130367, 551401615, 554639161, 560312986, 568444014, 578186572, 588196754, 597452819, 605751097, 613402426, 620346487, 625980318, 630196571, 633793533, 637838304, 642649114, 647629976, 652211368, 656399310, 660535753, 664614975, 667984724, 670109689, 671341658, 672487259, 673813581, 674692810, 674429357, 673061132, 671078086, 668603063, 665161371]
828.1F65161371m919648o270647o711841o332695n902350n792975n645574n009651
844.4F18575990m083037l559292l764212m386246m875839m875481m111409j873136
860.7E87047338K127529O757915J0528564J2821615J3388991J2001455R196758O000400
877F59870565K819300m76718l646374o018996p205069p397950p157981o915749o567120
895.4F17303908n954981n411625n423188o114483p189453q274376r192288j0003447
911.7E59740067j0773302j1188328j0681450r034276o612420m127682k197444q87692
928E04237473K39909J483321K666116L594696M345894M954696M946172L405750q6248
946.4E29787779m732549r109915j2400865j4668822j6248972j7366200j8113196j8587917
$$ y = [665161371, 660241723, 653971076, 647259235, 640926540, 635024190, 629231215, 623585641, 618575990, 614492953, 610933661, 607169449, 602783203, 597907364, 593031883, 588920474, 587047338, 589174867, 595932782, 606461346, 619282961, 632671952, 644673407, 653870165, 659870565, 662689865, 662213147, 658566773, 652547777, 645342708, 637944758, 630786777, 623871028, 617303908, 611348927, 605937302, 600514114, 594399631, 587210178, 578935802, 569743514, 559740067, 548966765, 537778437, 527096987, 518062711, 511450291, 507322609, 505125165, 504237473, 504477382, 505960703, 508626819, 512221515, 516567409, 521522105, 526468277, 529874027, 529787779, 525055230, 515945315, 503544450, 488875628, 472626656, 455260456, 437147260, 418559343]
962.7D18559343j8980295j9389599j9715131j9827842j9591004j8871904j7652571
977B84530997j5954017j3727934j1070504q314506n789488l667235j960442o66067
993.3B23380804K83167R48161J334816J424923J200885P69347K60994k05070m36515
1011.6B28961512l07500J39475Q32573J582488K231091K809286L314674L666699L817067
1030B47047365L721296L295929K582788J797915J226216R45747R04590J143158J728445
1048.4B64393449K688378L939122N262554O467789P629842Q927494J0239661J0687649
1064.7C20235938Q691162L218054m275858r992778j1138022q459687m610628j270026
1081B92398155J194417K882958M017770M884362N647570O171167O066322N079955L514528
$$ y = [418559343, 399579048, 380189449, 360474318, 340646476, 321055472, 302183568, 284530997, 268576980, 254849046, 243778542, 235464036, 229674548, 226007313, 224046871, 223380804, 223663971, 224612132, 225946948, 227371871, 228572756, 229342103, 229603097, 229398027, 228961512, 228654012, 228793487, 229626060, 231208548, 233439639, 236248925, 239563599, 243230298, 247047365, 250768661, 254064590, 256647378, 258445293, 259671509, 260617256, 261521846, 262665004, 264393449, 267081827, 271020949, 276283503, 282751292, 290381134, 299308628, 309548289, 320235938, 328927100, 332145154, 327869296, 317876518, 306738496, 298278809, 293668181, 292398155, 293592572, 296475530, 300493300, 305377662, 311025232, 317196399, 323262721, 328342676, 331857204]
1099.4C31857204K007843J120507J096755J841009K931506L871083M358142M283220
1115.7C53367269L691256K801389K060562J868069K339333L288895M283339M654080
1132C78354192L781706J567900j571983m830033p304132q538216q603483p852465o697119
1150.3C38306367n300492l684342j990139m15742J022934K539218M324973O391555
1166.7C41194332Q470147J0281265J1764974J2934684J3777942J4288485J4407188
1180.9D27119017J4048785J3287425J2223005J0778159Q855522O650477M630685L226191
1197.3E00819266K518535K246558K178610K375066L003716M001499M996955N562603
1213.6E27702808N606711N269409M546701L404677J976610N17487o05583j202345j471102
$$ y = [331857204, 333865047, 334985554, 336082309, 337923318, 340854824, 344725907, 349084049, 353367269, 357058525, 359859914, 361920476, 363788545, 366127878, 369416773, 373700112, 378354192, 382135898, 383703798, 382131815, 377301782, 369997650, 361459434, 352855951, 345003486, 338306367, 333005875, 329321533, 327331394, 326915652, 327938586, 330477804, 334802777, 341194332, 349664479, 359945744, 371710718, 384645402, 398423344, 412711829, 427119017, 441167802, 454455227, 466678232, 477456391, 486311913, 492962390, 497593075, 500819266, 503337801, 505584359, 507762969, 510138035, 513141751, 517143250, 522140205, 527702808, 533309519, 538578928, 543125629, 546530306, 548506916, 549024403, 548418820, 547216475, 545745373]
1231.9E45745373j635194j709759j606286j237333o02126J57953Q89599J534879K061486
1250.3E43598592K414108K470791K131581J600623J272440J250983J454293J821995
1266.6E58015406K139151K205312J982153J450539O70552j35243p02977q99196q96275
1285E63829422r86099j198232j434684j655281j828253j990795k149105k205968k095878
1303.3E48285127j907528j786947j692116j553476j396299j269102j317441j584113
1319.6E35778105k111375l044844m227280n255819n804896n735457n114615m115283
1336E00368536k886713j499802k87533L20405M56393L66568J38402j75356n63771q86887
1356.4D95350242j092017j331508j480729j154720p85858n98132j96696K68549P01070
$$ y = [545745373, 544110179, 542400420, 540794134, 539556801, 538954675, 539112628, 540002227, 541537106, 543598592, 546012700, 548483491, 550615072, 552215695, 553488135, 554739118, 556193411, 558015406, 560154557, 562359869, 564342022, 565792561, 566463113, 566327870, 565624893, 564725697, 563829422, 562843323, 561645091, 560210407, 558555126, 556726873, 554736078, 552586973, 550381005, 548285127, 546377599, 544590652, 542898536, 541345060, 539948761, 538679659, 537362218, 535778105, 533666730, 530621886, 526394606, 521138787, 515333891, 509598434, 504483819, 500368536, 497481823, 495982021, 495694488, 496014893, 496471286, 496837854, 496976256, 496800900, 496237129, 495350242, 494258225, 492926717, 491445988, 490291268, 489505410, 488907278, 488710582, 488979131, 489680201]
1374.7D89680201R53555R41396J013517J450270K316356L577560M218966L422082K140879
1393.1E09714782R35972k8551o80804r22441j198769j649082j762271j812338j871944
1411.4E00724554j636177j343131j304001r36627l3260N30005Q77529J065076J177460
1429.8D99121428J456916J575768J751184K298832K288282J950383J593650J036048
1446.1E13072491L01897l38495r18388j583695k656341k306819J1504J030266J986802
1464.5E08599222L643751M758954O003082Q903444J0496377R629906Q747756Q212388
1480.8E68994880P768631O800413O121516O361723O702602N543053M452765M544795
1497.1F17290378M708588M189789L192544K374768L017187L849388L335833K682984
$$ y = [489680201, 490633756, 491575152, 492588669, 494038939, 496355295, 499932855, 504151821, 507573903, 509714782, 510650754, 510622203, 509941399, 509018958, 507820189, 506171107, 504408836, 502596498, 500724554, 499088377, 497745246, 496441245, 495504618, 495471358, 496001363, 496878892, 497943968, 499121428, 500578344, 502154112, 503905296, 506204128, 508492410, 510442793, 512036443, 513072491, 513374388, 513035893, 512117505, 510533810, 507877469, 505570650, 505582154, 506612420, 508599222, 512242973, 517001927, 523005009, 531908453, 542404830, 552034736, 560782492, 568994880, 576763511, 583563924, 589685440, 596047163, 602749765, 608292818, 612745583, 617290378, 621998966, 626188755, 629381299, 631756067, 634773254, 638622642, 641958475, 644641459]
1513.4F44641459K060652J913905J874804K062858K383947K073049J801491J516164
1529.7F60328329J072228R99271J073838K68697o59406Q2195R80079Q48651J87218
1548.1F65181100m01258n02110n27680r44376j994967j180291M79102J43528l80039
1566.4F59873009q28386q03530j99139l63290o05703q0108q3566m60148n37634n97596
1586.8F55313909q65996j246035j485825j532495j551389j805902k289653k619564
1603.2F41917050k720058k872944l212690l393233l467679m200220m657567l223300
1619.5F14169359l004014l928006l640234l201604k991498k462864k644002l177047
1635.8E89120090j605451k23696j99676m78089n23865O95944J527309J395405K679228
$$ y = [644641459, 646702111, 648616016, 650490820, 652553678, 654937625, 657010674, 658812165, 660328329, 661400557, 662399828, 663473666, 663742363, 663082957, 663165152, 664145231, 664993882, 665181100, 664779842, 664277732, 663750052, 662805676, 660810709, 659630418, 660109520, 660253048, 659873009, 659044623, 658241093, 658041954, 657678664, 657072961, 656992853, 656909287, 656449139, 655911505, 655313909, 654447913, 653201878, 651716053, 650183558, 648632169, 646826267, 644536614, 641917050, 639196992, 636324048, 633111358, 629718125, 626250446, 622050226, 617392659, 614169359, 611165345, 607237339, 603597105, 600395501, 597404003, 594941139, 592297137, 589120090, 587514639, 587290943, 587091267, 586613178, 586089313, 586785257, 588312566, 589707971, 592387199]
1654.1E92387199L547252L259956L333331L867745M280210L766655L864825N091310
1670.5F23398483N163610N058169N389989M887282M308463M448235O047010N959868
1686.8F64661109M873097M860461M262686L737569L664493L638685M482091M139661
1703.1F98319852L323853L210724K906501K575278K277792J923680K054095K483070
1719.4G19074845K352596K258539K327084J951158J465500J191318J654625K564728
1735.7G34840393K125740J562894J684427K023577K116800J934171J999974K508580
1752G50796556K548516K324879K113402J633108J541853J824200J704455J265525P31051
1770.4G66483545P66218J581371J845836J428664R33826P52092R36806J256704J093924
$$ y = [592387199, 595934451, 599194407, 602527738, 606395483, 610675693, 614442348, 618307173, 623398483, 628562093, 633620262, 639010251, 643897533, 648205996, 652654231, 658701241, 664661109, 669534206, 674394667, 678657353, 682394922, 686059415, 689698100, 694180191, 698319852, 701643705, 704854429, 707760930, 710336208, 712614000, 714537680, 716591775, 719074845, 721427441, 723685980, 726013064, 727964222, 729429722, 730621040, 732275665, 734840393, 736966133, 738529027, 740213454, 742237031, 744353831, 746288002, 748287976, 750796556, 753345072, 755669951, 757783353, 759416461, 760958314, 762782514, 764486969, 765752494, 766483545, 767249763, 768831134, 770676970, 772105634, 773039460, 773791552, 774728358, 775985062, 777078986]
1788.8G77078986M62771L99530R87112J230121J073956Q58665Q10265Q37565Q99911
1807.1G84638882R30607Q34942O61611N86629P57277R76622P48158K13325R4056L96133
1827.5G90838242P16507R76384P17878K70009L56734O31869L71098j48237n364N33223
1847.9G95258343P87318O81281K58386q9109j4722L91722N81264K22802l75688l87728
1868.3G97313869N37574J051426O28054Q6487L4928M02212O82354N16415P2896j16467
1888.7H01209748L15428P27236N47111J62482k5511J33336M29809M07219J1325k26200
1909.1H03691983O6996M46737L28958j13190k48789J1205M48287O76453L10659j44481
1929.5H05474818j16647K73765N00619K45273k47955l69907J74582O81103N07474L0934
$$ y = [777078986, 777541757, 777941287, 778928399, 780158520, 781232476, 782091141, 782901406, 783738971, 784638882, 785569489, 786404431, 787066042, 787652671, 788409948, 789386570, 790134728, 790348053, 790442109, 790838242, 791554749, 792531133, 793249011, 793519020, 793875754, 794507623, 794878721, 794730484, 794725120, 795258343, 796045661, 796726942, 796985328, 796896219, 796881497, 797273219, 797854483, 798077285, 797701597, 797313869, 797851443, 798902869, 799530923, 799617410, 799652338, 800054550, 800736904, 801253319, 801326215, 801209748, 801525176, 802252412, 802799523, 802962005, 802936494, 803069830, 803499639, 803906858, 803918183, 803691983, 803758979, 804205716, 804534674, 804421484, 804172695, 804183900, 804632187, 805308640, 805619299, 805474818, 805358171, 805631936, 806132555, 806377828, 806129873, 805759966, 805934548, 806615651, 807123125, 807154059]
1949.9H07154059j20341J89125N50211M93705P9513j47224P5221L91901M28378J45793
1970.3H09240341j06871N3465M29452M60803O7473k30849r1791K40505L03268j5259
1990.7H10350537k60889o9857K77043L80456J05679k76029l23951m5896J42634q0109
2011.1H10199618n17845o63876l65377p8261l02613q43226r45926l10600K41339P0513
2031.5H06483746m39346p03216m93824j13428p5042l87430n67794l53515Q106R5546
2051.9H03453803j32084l21328j83106J88112L65019J43349j69634j51158J72973L75926
2072.3H03741872J84596j75238k34127J13487M03226K50280r8765j74463J39475M41313
2092.7H04591656L40283J5437j13725J01387M16458M17292P3492j48892L8922L46660
$$ y = [807154059, 807033718, 807222843, 807773054, 808266759, 808346272, 808199048, 808274269, 808666170, 809094548, 809240341, 809133470, 809186935, 809616387, 810077190, 810144663, 809913814, 809822023, 810062528, 810365796, 810350537, 810089648, 810019791, 810296834, 810677290, 810782969, 810506940, 810182989, 810137093, 810279727, 810199618, 809681773, 809017897, 808652520, 808574259, 808271646, 807428420, 806482494, 806171894, 806413233, 806483746, 806044400, 805341184, 804847360, 804733932, 804658890, 804271460, 803703666, 803350151, 803358257, 803453803, 803321719, 803000391, 802817285, 803005397, 803370416, 803513765, 803344131, 803192973, 803365946, 803741872, 803926468, 803751230, 803517103, 803630590, 804033816, 804284096, 804185331, 804010868, 804150343, 804591656, 804931939, 804947376, 804833651, 804935038, 805351496, 805768788, 805842280, 805693388, 805732310, 806078970]
2113.1H06078970L41952M4346j85668j02461J65999K60055N9307j57714j08659J19507
2133.5H06515634K51830J10566j48654j68144O4373K25126J26422p9692r7334J33753
2153.9H06933880L42846K99096J12593J02341L22104M99189M67181L40879L35038N07414
2174.3H10262561O84857O42240M29869L07202L86358N77151O40512M38034K49207L38018
2194.6H14956009N28157N73814M28677K64048K94984M85777N92232M83871L16798L01362
2215H19225729M46796N47051M32849K23041J83105L34502M54187L85225K10643J59263
2235.4H22602391K78235L72886K85983J19210Q4400J97112K94507K81274J81616J15454
2255.8H24813068J96934L08573K86043J72555J35601K34365L33071K84135J67668J65939
$$ y = [806078970, 806420922, 806465268, 806279600, 806177139, 806343138, 806603193, 806662500, 806504786, 806396127, 806515634, 806767464, 806878030, 806729376, 806561232, 806625605, 806850731, 806977153, 806897461, 806800127, 806933880, 807276726, 807575822, 807688415, 807790756, 808112860, 808612049, 809079230, 809420109, 809755147, 810262561, 810947418, 811589658, 812019527, 812326729, 812713087, 813290238, 813930750, 814368784, 814617991, 814956009, 815484166, 816057980, 816486657, 816750705, 817045689, 817531466, 818123698, 818607569, 818924367, 819225729, 819672525, 820219576, 820652425, 820875466, 821058571, 821393073, 821847260, 822232485, 822443128, 822602391, 822880626, 823253512, 823539495, 823658705, 823743105, 823940217, 824234724, 824515998, 824697614, 824813068, 825010002, 825318575, 825604618, 825777173, 825912774, 826147139, 826480210, 826764345, 826932013, 827097952]
2276.2H27097952K34664K55942K44200K20716J61171J02878J20878J67549J35362P5996
2296.6H28817308J08242J78575J53363L6717k2233O0260J60039J36673M7207n066J0908
2319.1H29681993O2227N9366j431o1273o1333k3604o3598k17557k91943j89662j30356
2341.5H28762829j88052k84851k20478l7014Q5771J21176K5153k03609l17216j63615
2361.9H27580094j00076l03686m54306l35097j26660p4447j72078k57909j92881m9412
2382.3H25513542j4007j41204k78890k57850j11341n2393j87099l39090l40104k38121
2402.7H23553443j81317k64824m26650m90427l81529k58088l19720n27501o36339n32508
2423.1H19534540l90172m12226n77807o98388o19113m53532m50313o34551p67708o71446
$$ y = [827097952, 827332616, 827588558, 827832758, 828053474, 828214645, 828317523, 828438401, 828605950, 828741312, 828817308, 828925550, 829104125, 829257488, 829294205, 829271972, 829332232, 829492271, 829628944, 829676151, 829671085, 829681993, 829744220, 829803586, 829802155, 829740882, 829679549, 829655945, 829592347, 829374790, 829082847, 828893185, 828762829, 828574777, 828289926, 828069448, 828032434, 828118205, 828239381, 828264534, 828060925, 827743709, 827580094, 827480018, 827176332, 826722026, 826386929, 826260269, 826185822, 826013744, 825755835, 825562954, 825513542, 825499535, 825358331, 825079441, 824821591, 824710250, 824657857, 824470758, 824131668, 823791564, 823553443, 823372126, 823107302, 822680652, 822190225, 821808696, 821550608, 821230888, 820703387, 820067048, 819534540, 819144368, 818732142, 818154335, 817455947, 816836834, 816383302, 815932989, 815298438, 814530730, 813859284]
2443.5H13859284m92632m60446n96881p32959o80148m90427m24862n66781p05301o47545
2463.9H08061302m41671l30925m55796o53804o73175m99308l61800m35173n84841n62787
2484.3H03062022l74019k40088k79486m10140m84645l95834k25962j90615l45290m79698
2504.7G99636245l75450j60158j24991k90632m63009m68194l11852k23815l90947o40988
2525.1G96186209o42896m50134l78847n19872p24971p67827n98133m87208o09458p87556
2545.5G90219307p92444o17862m85360n48780p31766q10564o55472m90666n27978o67870
2565.8G83890545p30216o29842m87268n05627o46770p06493o33955n20230m48048m89294
2586.2G78092802n78702n43177l94344k99871l71218n08964n27799m17471l28899m26471
$$ y = [813859284, 813366652, 812906206, 812309325, 811576366, 810896218, 810405791, 809980929, 809414148, 808708847, 808061302, 807619631, 807288706, 806832910, 806179106, 805505931, 805006623, 804644823, 804209650, 803624809, 803062022, 802688003, 802447915, 802168429, 801758289, 801273644, 800877810, 800651848, 800461233, 800115943, 799636245, 799260795, 799100637, 798975646, 798685014, 798222005, 797753811, 797441959, 797218144, 796827197, 796186209, 795543313, 795093179, 794714332, 794194460, 793469489, 792701662, 792103529, 791616321, 791006863, 790219307, 789426863, 788809001, 788323641, 787774861, 787043095, 786232531, 785577059, 785086393, 784558415, 783890545, 783160329, 782530487, 782043219, 781537592, 780890822, 780184329, 779550374, 779030144, 778582096, 778092802, 777514100, 776970923, 776576579, 776276708, 775905490, 775396526, 774868727, 774451256, 774122357, 773695886]
2606.6G73695886o62386p69198o70374o06358p41183r49860j021445r37581q91387
2625G66446114r99332j160085j235187j188159j086354j071275j199484j320362j269042
2643.4G55916834j135409j103222j177669j273990j270055j129747j039266j113952
2659.7G46673524j222074j218974j108349r82344r69410j061380j072406r63450q60035
2678G37215102q59380r30607r42231r05573q84294q94189r70662j042485j029015r87768
2698.4G27768898j030087j127601j164973j150668j136243j134336j149237j147986
2714.7G18727767j081585j009167j001715j008332r92119r55820q96752q53777q57115
2733.1G10071385q60036q21888p63118p32184p41481p74384q08418p63058o38783n67914
$$ y = [773695886, 773033500, 772264302, 771593928, 770987570, 770246387, 769296527, 768275082, 767337501, 766446114, 765446782, 764286697, 763051510, 761863351, 760776997, 759705722, 758506238, 757185876, 755916834, 754781425, 753678203, 752500534, 751226544, 749956489, 748826742, 747787476, 746673524, 745451450, 744232476, 743124127, 742141783, 741172373, 740110993, 739038587, 738075137, 737215102, 736355722, 735425115, 734482884, 733577311, 732693017, 731798828, 730828166, 729785681, 728756666, 727768898, 726738811, 725611210, 724446237, 723295569, 722159326, 721024990, 719875753, 718727767, 717646182, 716637015, 715635300, 714626968, 713634849, 712679029, 711782277, 710928500, 710071385, 709211349, 708389461, 707626343, 706894159, 706152678, 705378294, 704569876, 703806818, 703168035, 702600121]
2753.5G02600121o12020o85811o85573n91576n10335n67674o70433o79791o49155o63459
2773.9F96284294p45475q59738r29772r38416r38773j006425j141369j228034j261354
2792.2F87234938j307368j379967j521468j657486j657903j630247j713574j864373
2808.6F74502552j993180k025544k011955k088011k237915k349794k394379k407312
2824.9F56994462k457082k584160k733588k857804k930045k988220l149211l379404
2841.2F33914948l549874l671348l784955l816187l700018l455818l172576l006697
2857.5F05757475l130376l532708m022956m503667m956603n348862n659938n878686
2873.8E68723679n942703n730211n242050m602850l891289l124595k352833j679004
$$ y = [702600121, 701988101, 701302290, 700616717, 700025141, 699514806, 698947132, 698276699, 697596908, 696947753, 696284294, 695538819, 694679081, 693749309, 692810893, 691872120, 690865695, 689724326, 688496292, 687234938, 685927570, 684547603, 683026135, 681368649, 679710746, 678080499, 676366925, 674502552, 672509372, 670483828, 668471873, 666383862, 664145947, 661796153, 659401774, 656994462, 654537380, 651953220, 649219632, 646361828, 643431783, 640443563, 637294352, 633914948, 630365074, 626693726, 622908771, 619092584, 615392566, 611936748, 608764172, 605757475, 602627099, 599094391, 595071435, 590567768, 585611165, 580262303, 574602365, 568723679, 562780976, 557050765, 551808715, 547205865, 543314576, 540189981, 537837148, 536158144]
2890.1E36158144j162171q04901o48975o77109p68006r37641j216292j501203j802921
2908.5E26638925k224266k758444l310859l725827l861189l741145l473043l062070
2924.8E00482082k385467j466691m74394O02454J784653K925664L923476M770278N400181
2943.2E15562236N732060N861878O012082O191314O227731O150484O109178O060005
2959.5E63906968N841195N448103N003512M627824M399955M285157M192114M079699
2975.8F01784527L978014L861428L630876L318608L031015K773583K545417K300262
2992.1F27223730J963079J611710J275301R21249O12319L36527K0743l01123n59091
3010.5F33104444p95365j108467j447082j670182j806080j943171k082765k208173
$$ y = [536158144, 534995973, 534191072, 533542097, 532864988, 532096982, 531159341, 529943049, 528441846, 526638925, 524414659, 521656215, 518345356, 514619529, 510758340, 507017195, 503544152, 500482082, 498096615, 496629924, 496155530, 496757984, 498542637, 501468301, 505391777, 510162055, 515562236, 521294296, 527156174, 533168256, 539359570, 545587301, 551737785, 557846963, 563906968, 569748163, 575196266, 580199778, 584827602, 589227557, 593512714, 597704828, 601784527, 605762541, 609623969, 613254845, 616573453, 619604468, 622378051, 624923468, 627223730, 629186809, 630798519, 632073820, 632995069, 633607388, 633943915, 633964658, 633663535, 633104444, 632309079, 631200612, 629753530, 628083348, 626277268, 624334097, 622251332, 620043159]
3026.8F20043159k285243k312541k336263k467156k647459k662659k639651k744496
3043.1E99947691k865791k937079k934694k919018k976180l014147l014684l028750
3059.4E76257348l002584k939761k903938k979278l139496l182471l046215k856970
3075.7E52206635k812922k971529l080309l064573l056526l003478k979040l114045
3092.1E28124213l200650l067732k871513k877236l037035l021538k817631k744317
3108.4E04486561k880752k880961k706975k688497k794474k927602l056168l006041
3124.7D81545091k797246k645016k662510k731710k663911k520382k528995k707929
3141D60287392k782255k671093k528459k324611k171874k338976k616643k623767k474904
$$ y = [620043159, 617757916, 615445375, 613109112, 610641956, 607994497, 605331838, 602692187, 599947691, 597081900, 594144821, 591210127, 588291109, 585314929, 582300782, 579286098, 576257348, 573254764, 570315003, 567411065, 564431787, 561292291, 558109820, 555063605, 552206635, 549393713, 546422184, 543341875, 540277302, 537220776, 534217298, 531238258, 528124213, 524923563, 521855831, 518984318, 516107082, 513070047, 510048509, 507230878, 504486561, 501605809, 498724848, 496017873, 493329376, 490534902, 487607300, 484551132, 481545091, 478747845, 476102829, 473440319, 470708609, 468044698, 465524316, 462995321, 460287392, 457505137, 454834044, 452305585, 449980974, 447809100, 445470124, 442853481, 440229714, 437754810]
3159.4D37754810k379179k323657k291143k242029k163947k128631k148091k154261
3175.7D19923872k135694k068460k003342k021372k011270j906991j855045j913965
3192D04007733j924336j870632j827359j759291j699835j675964j650214j632273j611441
3210.3C88356388j563967j517146j481563j485080j523763j508891j439423j373857
3226.7C76462698j286536j145959j110673j311422j447499j326262j208246j162648
3243C66463453j057566j018047j135856j189560j088827j008928j017034r96203r36090
3261.3C57015342r11505q86112p57366n89967o68615r21279j018674r49680q27879
3279.7C49484265p54297p71224p81954p21603o02425n61416p15613r01312r36240q02278
$$ y = [437754810, 435375631, 433051974, 430760831, 428518802, 426354855, 424226224, 422078133, 419923872, 417788178, 415719718, 413716376, 411695004, 409683734, 407776743, 405921698, 404007733, 402083397, 400212765, 398385406, 396626115, 394926280, 393250316, 391600102, 389967829, 388356388, 386792421, 385275275, 383793712, 382308632, 380784869, 379275978, 377836555, 376462698, 375176162, 374030203, 372919530, 371608108, 370160609, 368834347, 367626101, 366463453, 365405887, 364387840, 363251984, 362062424, 360973597, 359964669, 358947635, 357951432, 357015342, 356103837, 355217725, 354460359, 353870392, 353201777, 352280498, 351261824, 350312144, 349484265, 348729968, 347958744, 347176790, 346455187, 345852762, 345291346, 344575733, 343674421, 342738181, 341935903]
3300.1C41935903n70387m33266n83857r11147j098394j041949r24080q96037q78185
3318.4C34598601q06779p26849p26431q87603j043379j012594q73357p09057o20544
3336.8C27192008p25597q97735r78559j029969r68843p71791q16524j061112j086533
3355.2C18855345r18925q25762q74549q56281o50733n81414q42661j147061j157880
3373.5C11000079r08047p30842p36595q09490p80940n95093l35664j32829k62469o10977
3393.9C05097133o15805k24680n7668m38004p65980n33461k23846k10583k90215l72618
3414.3C01364273l77089k34097j44273j56909n1767J97381L11106J58370J65671L49194
3434.7C01581860K04652j13278j50651P1764K67148L23206L52085M26024M83513N44160
$$ y = [341935903, 341365516, 340932250, 340348393, 339437246, 338338852, 337296903, 336372823, 335476786, 334598601, 333791822, 333064973, 332338542, 331450939, 330407560, 329394966, 328521609, 327812552, 327192008, 326466411, 325568676, 324590117, 323560148, 322591305, 321819514, 321002990, 319941878, 318855345, 317936420, 317110658, 316236109, 315379828, 314729095, 314147681, 313305020, 312157959, 311000079, 310092032, 309361190, 308624595, 307815105, 307034165, 306439072, 306103408, 305970579, 305708110, 305097133, 304481328, 304256648, 304198980, 303760976, 302994996, 302461535, 302237689, 302027106, 301736891, 301364273, 300987184, 300753087, 300608814, 300451905, 300400138, 300597519, 300908625, 301066995, 301232666, 301581860, 301786512, 301673234, 301522583, 301594347, 301861495, 302184701, 302536786, 302962810, 303446323, 303990483]
3455.1C03990483O64741P28041N86957N77658R13292J067996P22677K91198K69711
3473.4C09812754N56022Q55714Q73804O13153O15806Q58158Q33213P53939R23634J032531
3493.8C17728728R88931R41067R25631Q54462P24703O99461Q00311J021535J281201
3512.2C25966030J217872R05633Q58993J100629J314908J154602Q10474Q72374J231402
3530.6C35432917J441985J495570J399785J281530J440287J577645J403869J205623
3546.9C46679211J319766J483202J560449J738549J926153J987249J951695J801729
3563.2C60448003J578569J970500K797514K851218K525479K534300K737701K961874
3579.5C80405158L183842L119915K688319K619356L310591L484517L271282L497630
$$ y = [303990483, 304655224, 305383265, 305970222, 306547880, 307461172, 308529168, 309251845, 309543043, 309812754, 310368776, 311224490, 312098294, 312711447, 313327253, 314185411, 315018624, 315772563, 316696197, 317728728, 318717659, 319658726, 320584357, 321438819, 322163522, 322862983, 323663294, 324684829, 325966030, 327183902, 328089535, 328948528, 330049157, 331364065, 332518667, 333329141, 334201515, 335432917, 336874902, 338370472, 339770257, 341051787, 342492074, 344069719, 345473588, 346679211, 347998977, 349482179, 351042628, 352781177, 354707330, 356694579, 358646274, 360448003, 362026572, 363997072, 366794586, 369645804, 372171283, 374705583, 377443284, 380405158, 383589000, 386708915, 389397234, 392016590, 395327181, 398811698, 402082980, 405580610]
3595.8D05580610L805518L778219L782124L753751L402442L324091L662259L875285
3612.1D34964299M058600L925025L698588M306167M635483M051864L189862L072291
3628.5D65902179M395962M742056M292816M101485M008413M022807M024505L588200
3644.8D99078423K886325L147125M587293M757702M004061M074097M388988L930926
3661.1E30854940L491283L391981K924204K500653L191352L116131K463519L354848
3677.4E55288911L909409L639579L369689K889931K160013J882016K608240L036082
3693.7E78783870K768993K290845J830041J822532K322971K302170J609385R64046
3710E94694853J331746K439380K525151J901984J422465J298010J349211J623929J925885
$$ y = [405580610, 409386128, 413164347, 416946471, 420700222, 424102664, 427426755, 431089014, 434964299, 439022899, 442947924, 446646512, 450952679, 455588162, 459640026, 462829888, 465902179, 470298141, 475040197, 479333013, 483434498, 487442911, 491465718, 495490223, 499078423, 501964748, 505111873, 509699166, 514456868, 518460929, 522535026, 526924014, 530854940, 534346223, 537738204, 540662408, 543163061, 546354413, 549470544, 551934063, 555288911, 559198320, 562837899, 566207588, 569097519, 571257532, 573139548, 575747788, 578783870, 581552863, 583843708, 585673749, 587496281, 589819252, 592121422, 593730807, 594694853, 596026599, 598465979, 600991130, 602893114, 604315579, 605613589, 606962800, 608586729, 610512614]
3728.4F10512614J519978P61092N59866J392127K231240J861512N00024P7486J401663
3746.7F20817602J120269L90470J618862K270520J505852R76860J377583J477360J044095
3765.1F32599473R10640Q95023J125991J498044J346350Q76128O44744R03725R80616
3783.5F41780734R15289J092255J141489R98795P09533M72308N94914K69889J35124
3801.8F48110330J086176J021325Q65400J480937J335978L80278l7193M68433K16245
3820.2F54927909N53251J461684J202226Q31962O28173N10752N34833R5606j62781
3838.5F60583615N41568J102150J322686J329363Q95261k40027j541615R1255K127528
3856.9F66211784J621306N67913o3658K06411N64098J86921L39508Q63313J063347
$$ y = [610512614, 612032592, 612793684, 613353550, 614745677, 616976917, 618838429, 619338453, 619415939, 620817602, 621937871, 622328341, 623947203, 626217723, 627723575, 628700435, 630078018, 631555378, 632599473, 633510113, 634405136, 635531127, 637029171, 638375521, 639251649, 639896393, 640800118, 641780734, 642696023, 643788278, 644929767, 645928562, 646638095, 647110403, 647705317, 647975206, 648110330, 649196506, 650217831, 651083231, 652564168, 653900146, 654280424, 654243231, 654711664, 654927909, 655481160, 656942844, 658145070, 658977032, 659605205, 660115957, 660650790, 660746396, 660583615, 661125183, 662227333, 663550019, 664879382, 665774643, 665534616, 663993001, 664084256, 666211784, 667833090, 668401003, 668337345, 668543756, 669107854, 669294775, 669634283, 670497596, 671560943]
3875.2F71560943R45449K20656J07587M46260L76940P49230O40333J67608N93722Q09610
3895.6F76618338K23219k78413l18706O0022Q66234J229226Q82924N31018K60770j03891
3916F79970741q4519L32832M06921K33770L21269L23712N7102J80006O05285N71847
3936.4F82918966K74420P0512J8179K30789L04103J66178K38776L85821M19378L47078
3956.8F85374200K12968J34825K05100L13580K66254J40786J14680J96993K94864L21984
3977.2F87576234K14756J23262J63138J98782J75714J58012J53840J58906K26974K60174
3997.6F89409792
$$ y = [671560943, 672506392, 672727048, 672834635, 673280895, 673657835, 674407065, 675047398, 675215006, 675808728, 676618338, 676841557, 676563144, 676244438, 676304460, 677170694, 678399920, 679282844, 679813862, 680074632, 679970741, 679886222, 680219054, 680625975, 680859745, 681181014, 681504726, 681561828, 681741834, 682347119, 682918966, 683193386, 683263898, 683282077, 683512866, 683816969, 683983147, 684221923, 684607744, 685027122, 685374200, 685587168, 685721993, 685927093, 686240673, 686506927, 686647713, 686762393, 686959386, 687254250, 687576234, 687790990, 687914252, 688077390, 688276172, 688451886, 688609898, 688763738, 688922644, 689149618, 689409792]
##END=$$ End of the data block
