##TITLE=7 $$ Begin of the data block
##JCAMP-DX=5.00 $$ ACD/SpecManager v 10.08
##SPECTROMETER/DATA SYSTEM=Alpha
##DATE=16 Apr 2014 10:35:00
##DATA TYPE=INFRARED SPECTRUM
##DATA CLASS=XYDATA
##ORIGIN=
##OWNER=
##NPOINTS=1765
##FIRSTX=399.75695801
##LASTX=3997.56933594
##MAXX=3997.56933594
##MINX=399.75695801
##MAXY=0.87280250
##MINY=0.25206852
##XFACTOR=1.0000000000
##YFACTOR=1.000000000000000e-9
##FIRSTY=0.74914610
##DELTAX=2.03957629
##XUNITS=1/CM
##YUNITS=ARBITRARY UNITS
##XYDATA=(X++(Y..Y))
399.8 749146104 746901333 744487405 744153917 743933737 741830051 740055799 740115762 740011454 738160431
418.1 738160431 736543238 737022340 737233579 735678494 734484553 734984934 734801471 732370138 729980946
436.5 729980946 729327142 728256345 724960446 721452057 719633102 717900395 714845061 712036788 710844934
454.8 710844934 709678054 707316458 705459952 705154240 704931736 703682303 702770114 703231692 703628421
473.2 703628421 702602565 701236725 700915098 700732410 699201703 697379947 696961403 696867108 695504189
491.5 695504189 694013298 693890750 694035649 692855179 690859735 689528704 688433468 686065614 683135629
509.9 683135629 681365609 680038631 677527189 674718380 673470080 673079431 671839654 670357883 670315146
528.3 670315146 670880020 670176327 668625593 667843401 667672455 666577339 664681077 663607121 663290977
546.6 663290977 662269890 660686076 659944415 659937024 659192026 657640696 656906664 657203853 656917810 655743241
567 655743241 655070603 655300498 655263007 654540062 654283464 654985309 655426502 655038774 654946625 655683339
587.4 655683339 656208873 655938506 655923784 656925201 657837391 657673299 657508194 658444345 659523606 659605503
607.8 659605503 659478426 660319328 661478937 661716461 661569953 662322283 663592458 664209127 664501011
626.1 664501011 665749967 667762399 669208050 670016527 671416163 673459768 674850345 675492346 676695824
644.5 676695824 678588092 679865301 680333674 681272388 682996929 684214175 684558153 685410619 687262356
662.9 687262356 688752711 689218998 690294087 692602456 694492042 695638418 696992636 699276686 701545596
681.2 701545596 702879727 704075992 705949843 707485676 707380831 706063271 704709232 703414738 702136040
699.6 702136040 702227533 705114722 710162938 715487421 720398724 725418091 730267882 733780146 736039937
717.9 736039937 738457203 741371989 743712008 745298624 747207642 749842823 752165914 753488123
734.2 753488123 754669487 756398976 757922709 758532882 759050429 760490894 762361526 763765991 765212893
752.6 765212893 767626345 770471990 772564173 774098396 776214957 778773606 780545235 781488478 782919228
771 782919228 785040200 786547244 787251472 788528502 790686309 792394996 793217063 794441164 796695054
789.3 796695054 798612595 799302816 800044119 801771224 803185880 803325772 803496420 804844558 806419790
807.7 806419790 807111561 807808101 809681535 811709523 812379479 812427819 813319921 814426243 814296544
826 814296544 813703656 814528763 816455007 817828298 818864226 821095228 824145317 826029718 826502621
844.4 826502621 827234089 828615069 829252601 829043806 829697311 831537247 832730174 832532823 832508028
862.7 832508028 833485126 833972096 832995951 831947267 831967533 831962943 830984294 830406427 831546962 833179414
883.1 833179414 833726406 833937705 835184634 836713910 837020159 836733580 837455750 838722467 838882864
901.5 838882864 838214040 838363945 839157104 838807285 837201655 836053789 835693121 834617376 832687318
919.8 832687318 831911922 832991421 834049582 834005415 834191084 835455537 836396456 836048007 835819662
938.2 835819662 836798370 837568820 836809754 835777760 835940361 836212695 835094631 833613873 833382428
956.6 833382428 833552003 832502723 830893099 830323100 830210626 828882039 826838017 825850368 825625062
974.9 825625062 824397981 822310567 821141541 820986331 820205748 818617642 817811728 818111420 817984641
993.3 817984641 816906571 816223264 816318095 815699220 813827991 812108517 811159432 809579492 806511819
1011.6 806511819 803155184 800464809 797468483 793297827 788993359 785784125 783019662 779606581
1027.9 779606581 776252151 774152279 772633016 770187676 766974270 764248788 762059510 759546459
1044.3 759546459 756935060 755396187 755129039 755081654 754809260 755006850 755733371 755911708 755107105
1062.6 755107105 754201889 753732741 752948284 751282990 749502718 748376608 747424841 746080160 744974077
1081 744974077 744911790 745331764 745133221 744420826 743992388 743615329 742377818 740508378 739172220 738601387
1101.4 738601387 738071918 737584293 737905085 738818824 739016593 738110483 737088263 736397564 735225439
1119.7 735225439 733257115 731661797 731420398 732054174 732918739 734289706 736205637 737594485 737595558
1138.1 737595558 736748397 735798955 734231114 731318057 727728367 724608123 721917748 719065070 716423690
1156.4 716423690 714791358 713868141 712646902 710956275 709377944 708065391 707006454 707049251 709053040
1174.8 709053040 712210774 714590788 715306163 715090394 714651048 713800311 712501407 711369693 710542738
1193.1 710542738 709200799 706851482 704126358 701748908 699566185 697276711 695228875 693733931
1209.5 693733931 692201853 689829409 686734438 683557034 680378437 676840901 673070550 669614613
1225.8 669614613 666566372 663518190 660497248 658122241 656619787 655579448 654821038 654726565 655470967
1244.1 655470967 656569958 657589078 658739328 660243154 661658108 662492335 663033962 663794160 664613008
1262.5 664613008 665099144 665491700 666294456 667346120 668101132 668586791 669268727 670111597 670673192
1280.8 670673192 671057343 671859264 673133850 674257338 674929798 675426662 675765336 675458133 674450576
1299.2 674450576 673466325 672969699 672597110 672090292 671953142 672618508 673812151 675153315 676767111
1317.6 676767111 678758860 680664420 682046533 683114886 684186697 685016870 685271740 685208201 685352445
1335.9 685352445 685750127 686144114 686687350 687801301 689414144 691027224 692479074 693993807 695489347
1354.3 695489347 696427107 696538866 695785165 693545163 689349055 684717298 682443440 683813512 686813295
1372.6 686813295 688461781 687734902 685243309 681195438 675968766 671378970 669630289 671218038
1388.9 671218038 674200714 676659048 677667737 676871240 674353480 670776248 666945100 662902474
1405.3 662902474 658803582 654945552 651588976 649068236 647370636 646103799 644984901 643906116
1421.6 643906116 642183185 639125228 634636641 628492475 621040821 613243461 604639649 596184492
1437.9 596184492 590117276 585433483 581231058 577862501 575768471 575358689 576811969 580804467
1454.2 580804467 589817584 602953911 613237739 620636463 627083778 632490516 637598276 645059824
1470.5 645059824 656569362 668057144 674929321 677115023 674979806 668890595 659556329 647103786
1486.8 647103786 630939424 612143040 594459474 577283859 558944225 542462707 529227436
1501.1 529227436 517813146 504872262 487488925 472078353 459805280 448431671 439484656
1515.4 439484656 434315681 432437181 431439847 429473162 426401079 422719330 419563740 417229116
1531.7 417229116 415650964 415223628 416281343 419669271 425487489 432783365 441787779 452807397
1548 452807397 466465205 482185751 499178052 516709566 539007485 565046072 582960963 598020911
1564.3 598020911 613477290 628272355 642010391 652174354 659742117 666007400 668953061 668663800
1580.7 668663800 665779293 660414398 652588129 642411828 630125701 616392493 601730824 586692989
1597 586692989 571370900 555305064 538558066 521723330 504937947 487902075 471503943 456812322
1613.3 456812322 442393154 426778167 413401991 401193261 386997908 372573674 358916461
1627.6 358916461 345724016 334261745 323552430 311125487 299852580 291395873 284003139 277154565
1643.9 277154565 270140678 263650954 259458512 256087542 252925903 252068520 252704173 254404366 257291019
1662.2 257291019 261128843 265234262 270215601 276400506 282543808 289300025 297065228 304704696
1678.6 304704696 312283725 321361512 333666265 345993727 357617170 370839387 384804368 401767671
1694.9 401767671 421961486 443377197 468588114 491167307 511719048 533247352 552489758
1709.2 552489758 569407105 584850848 599373460 613898933 626623929 636453032 645267069 653703153
1725.5 653703153 661491632 668929577 675882399 683188736 690336764 696214497 702121794 708177090
1741.8 708177090 713965058 719908834 726065159 732365251 738604426 744314253 749768555 754892111
1758.1 754892111 759512067 764142990 768349230 771827042 775049746 778292656 781591237 784461260
1774.4 784461260 786806703 789273024 791952133 794391453 796555817 798806727 801148355 803330600
1790.7 803330600 805336356 807321906 809393704 811316848 812950015 814544976 816245496 817822993
1807 817822993 819157183 820530951 822057247 823477387 824643910 825799882 827109396 828389883 829432964
1825.4 829432964 830412090 831659675 832953215 833877325 834625542 835593700 836661458 837485015 838170767
1843.8 838170767 839088321 840069711 840754807 841260374 841970623 842856526 843505800 843913019 844489634 845302105
1864.2 845302105 845946431 846281648 846664190 847236872 847693384 847920537 848257899 848864734 849385500 849592209
1884.6 849592209 849824905 850357056 850880921 851127148 851386428 851920307 852469206 852757514 852979422 853422940
1904.9 853422940 853918195 854171216 854349911 854746342 855223775 855476320 855600774 855902135 856313169 856536210
1925.3 856536210 856617153 856872737 857263148 857450008 857437551 857555389 857820868 857953131 857909739 857975364
1945.7 857975364 858222425 858374774 858340383 858376026 858606040 858787298 858793199 858849406 859104991 859353900
1966.1 859353900 859423041 859475315 859672606 859909177 860010326 860037088 860162437 860359371 860433996 860421240
1986.5 860421240 860524595 860708654 860783041 860775352 860882938 861097515 861225009 861202896 861204565 861313164 861411750
2009 861411750 861445785 861513793 861656189 861760199 861763179 861752748 861816466 861873806 861861110 861895740 862060308
2031.4 862060308 862218142 862260640 862273932 862346947 862452209 862510443 862528205 862588644 862719774 862831593 862892449
2053.8 862892449 862949431 863011539 863063931 863118589 863193452 863272488 863347411 863397956 863434017 863494575 863597810
2076.3 863597810 863728583 863873124 864014268 864136279 864252925 864358544 864461064 864581823 864738345 864889562
2096.7 864889562 865000427 865119934 865274549 865399480 865459383 865546703 865714610 865880609 865975857 866075039
2117.1 866075039 866246641 866412640 866487086 866534710 866677165 866878211 867003024 867078841 867241621 867446780
2137.5 867446780 867550790 867590845 867715299 867907822 868046820 868130207 868264973 868461490 868570387 868567884
2157.9 868567884 868635595 868836164 868993461 869013488 869059920 869248390 869413793 869426548 869426787 869526863 869644821
2180.3 869644821 869687617 869724810 869856715 870000005 870026290 870005369 870100379 870273709 870364130 870378435 870455742
2202.7 870455742 870603561 870659053 870609701 870675504 870895505 871040702 871048868 871101677 871254802 871358037 871350229
2225.2 871350229 871382058 871529400 871629238 871606469 871620059 871761143 871907592 871930003 871929705 872055888 872188270
2247.6 872188270 872170687 872135222 872263014 872438550 872449458 872371912 872431576 872577727 872600019 872537792 872596264
2270 872596264 872736216 872733295 872611046 872611225 872764230 872802496 872658014 872579336 872649968 872678339 872554123
2292.5 872554123 872449875 872521579 872588038 872464716 872335255 872356117 872347891 872176468 872010112 871977270 871906102
2314.9 871906102 871667862 871416807 871314526 871282220 871177018 870993912 870902240 870944977 870876253 870662332
2335.3 870662332 870567083 870635211 870598018 870481014 870595515 870852590 870919824 870712101 870405078 870182693
2355.7 870182693 869981825 869755626 869661033 869807780 869992733 870041311 870147824 870412409 870669961 870806217
2376.1 870806217 870906532 871075630 871231496 871250570 871184409 871160388 871154070 871069133 870925486 870841205 870809078
2398.5 870809078 870693088 870498955 870352983 870263278 870111465 869883716 869709849 869620323 869499385 869302630
2418.9 869302630 869107962 868982673 868879914 868708611 868509054 868382454 868290424 868134797 867960334 867860496
2439.3 867860496 867789030 867631376 867411375 867266119 867190242 867036879 866798282 866617978 866519034 866367936
2459.7 866367936 866106808 865856946 865699708 865526140 865286171 865080655 864934027 864750683 864501417 864274740
2480.1 864274740 864111066 863946199 863752961 863584995 863453031 863290131 863074839 862891138 862798870 862725675
2500.5 862725675 862594783 862463057 862388492 862318277 862199903 862052441 861930370 861832023 861699820 861531734
2520.9 861531734 861386240 861293495 861201644 861060917 860895038 860724032 860529542 860320032 860137582 859984338
2541.3 859984338 859806657 859552562 859257340 859014750 858822405 858597994 858309686 857999086 857733786 857498527
2561.7 857498527 857213616 856915891 856700003 856513798 856239557 855898380 855594218 855338812 855041862 854693830
2582.1 854693830 854409695 854213357 853976071 853626132 853266478 852995813 852744818 852423489 852092743 851846159
2602.5 851846159 851613700 851286232 850967765 850791752 850638807 850375533 850110948 849971473 849858284 849652708
2622.9 849652708 849445164 849330306 849195242 848929703 848660350 848548651 848519802 848408043 848237574 848122776
2643.3 848122776 848021805 847815156 847554862 847395360 847317278 847148538 846872032 846638739 846457362 846188366
2663.7 846188366 845829248 845546782 845375836 845148802 844789684 844435394 844193757 843942046 843547881 843130529
2684.1 843130529 842843056 842573941 842197239 841832519 841548622 841221571 840791166 840340912 839951456 839567482
2704.5 839567482 839080811 838522017 837972403 837405086 836749613 836035132 835407376 834888041 834322333 833727777
2724.8 833727777 833262205 832890511 832452893 831926405 831464291 831124187 830756485 830288231 829824746 829433560
2745.2 829433560 829046607 828571022 828034282 827531397 827009678 826363266 825682223 825105131 824561119 823917925
2765.6 823917925 823235512 822643340 822111905 821528792 820883811 820225596 819557369 818835139 818063319 817353249
2786 817353249 816732883 816039443 815212011 814401805 813684523 812941492 812065482 811138749 810291648 809476078
2806.4 809476078 808604717 807723820 806892276 806059122 805171072 804293573 803477228 802653909 801723361 800679207
2826.8 800679207 799572349 798349738 796897411 795158327 793084979 790463865 787007749 782695472
2843.1 782695472 777718186 772272885 766630530 761240661 756614983 752948344 749888957 746686935
2859.5 746686935 742484629 736758351 729752243 722507656 716461241 712747335 711683393 712898016
2875.8 712898016 715681195 719168842 722560287 725289345 727037668 727718830 727372348 726067245 723943830
2894.1 723943830 721215487 718072534 714661062 711066544 707233131 703014851 698304057 693104208
2910.4 693104208 687495828 681535661 675286174 668906808 662640274 656736791 651444972 647037566
2926.8 647037566 643745542 641697824 640970290 641580284 643403828 646055818 648804545 650656223 650631368
2945.1 650631368 648193657 643500149 637297153 630608082 624599218 620463431 618924916 620022416
2961.4 620022416 623338163 628326535 634519577 641479373 648874998 656539619 664341509 672214270
2977.8 672214270 680140734 687990665 695583224 702786922 709479213 715532124 720844150 725341260
2994.1 725341260 728960931 731693685 733629346 734932125 735765100 736245096 736436188 736372769 736081064
3012.4 736081064 735595107 734893620 733870983 732453883 730682075 728715360 726778388 725059748 723619044
3030.8 723619044 722384274 721272290 720184267 718991756 717702150 716420233 715143800 713794589
3047.1 713794589 712380528 711006403 709674478 708297372 706954062 705826700 704985380 704415262 704138875
3065.5 704138875 704206407 704530180 704915941 705292225 705690026 706104159 706487834 706812024 707135737 707539141
3085.8 707539141 707987010 708446860 708944261 709413409 709743977 709873259 709792972 709534526 709111869 708520114
3106.2 708520114 707771480 706901014 705913424 704771698 703481615 702053905 700422108 698558390 696552396
3124.6 696552396 694490314 692328930 689986467 687484086 684895217 682255805 679485321 676493227
3140.9 676493227 673393190 670280874 667052329 663711965 660367548 656915903 653213322 649355471
3157.2 649355471 645497143 641658902 637762427 633746743 629668415 625598550 621508479 617368281
3173.5 617368281 613234460 609181881 605204463 601224720 597257912 593442917 589833617 586375654
3189.9 586375654 583066881 579959810 577060878 574326158 571760833 569407165 567232072 565168083
3206.2 565168083 563203037 561357439 559605360 557897329 556204200 554504275 552788436 551058233
3222.5 551058233 549265623 547326803 545251489 543053746 540678799 538103104 535329461 532358825
3238.8 532358825 529208064 525880754 522394538 518810868 515118599 511277020 507301927 503248870
3255.1 503248870 499185652 495127201 491090804 487115771 483204216 479350060 475605816 472053736
3271.4 472053736 468692899 465439528 462296575 459338397 456561953 453925967 451417714 449060321
3287.8 449060321 446869612 444859952 443046868 441393733 439845771 438394994 437057644 435836554
3304.1 435836554 434756458 433809727 432961822 432247967 431647420 431080401 430536598 430037558 429596126
3322.4 429596126 429207921 428876460 428617060 428443700 428324461 428211600 428120732 428079635 428099602 428174496
3342.8 428174496 428277165 428410381 428589076 428818345 429090202 429353207 429583043 429797411 430011809 430229813
3363.2 430229813 430451751 430677712 430908263 431136906 431344420 431531221 431717336 431922376 432139128 432348698
3383.6 432348698 432531595 432715386 432903707 433021843 433085024 433189034 433343321 433497727 433615416 433675528
3404 433675528 433760077 433943659 434221625 434566706 434938550 435329527 435814381 436467379 437225491 438084662
3424.4 438084662 439145505 440392941 441694438 443070680 444592595 446111202 447541624 449044615
3440.7 449044615 450739592 452589512 454530984 456463516 458366126 460345179 462460428 464660108
3457 464660108 466871738 469057262 471301973 473729759 476263374 478658587 480827749 483046383 485529989
3475.4 485529989 488280416 491160899 493965566 496768624 499771595 502909362 506054699 509233475
3491.7 509233475 512505949 515873790 519191802 522465408 525838912 529178321 532336056 535485566
3508 535485566 538780928 542198181 545592010 548804820 551928520 555165350 558578908 561902702 564997017
3526.4 564997017 568134964 571405590 574715316 578116238 581555307 584889948 588288248 591921091
3542.7 591921091 595635533 599110782 602399349 605841815 609459758 613099873 616778195 620553136
3559 620553136 624372363 628156424 632000625 636160374 640418172 644444704 648439705 652627766 656947911
3577.4 656947911 661330342 665774822 670201600 674618721 679121137 683589160 687896192 692254066
3593.7 692254066 696773887 701355278 705883801 710250735 714424551 718501747 722731173 727090836
3610 727090836 731356740 735460401 739355147 743305564 747441530 751243412 754588127 757856250 761547923
3628.4 761547923 765405297 768701732 771736324 774732351 777636230 780483663 783206165 785755455
3644.7 785755455 788347721 791256547 793993711 796052933 797976792 800211072 802360415 804118216
3661 804118216 805700541 807259619 808723629 810185075 811706126 813089371 814433694 815783501 817078292
3679.4 817078292 818458021 819907546 821388721 823039293 824602067 825727105 826729894 827749372
3695.7 827749372 828624249 829339981 830004036 830629885 831198812 831752539 832363486 832982063 833443105 833794236
3716.1 833794236 834148109 834529281 834896863 835147798 835327923 835631013 836048961 836459994 836823821 837176919
3736.5 837176919 837454438 837533534 837498069 837581873 837847173 838113666 838297606 838499665 838783622 839046538
3756.9 839046538 839267731 839482963 839670181 839807451 839917362 840052187 840166211 840222776 840333879 840592921
3777.3 840592921 840873897 840957999 840908110 840894699 840957701 841094494 841251016 841369092 841451824 841509521 841545343
3799.7 841545343 841579735 841649234 841705024 841741204 841817081 841913223 841997206 842041731 842032671 841959476 841882169 841926157
3824.2 841926157 842007577 842056990 842150867 842295766 842460871 842538834 842394948 842193127 842142820 842205465 842272282
3846.6 842272282 842342794 842346549 842158914 842037618 842136800 842230618 842295289 842363417 842371941 842283845 842173934
3869 842173934 842144012 842137396 842116475 842137158 842129469 842057705 842011392 841999292 841959238 841872573 841770947 841714323
3893.5 841714323 841730118 841762960 841728449 841590464 841448128 841448367 841520846 841507137 841419220 841379464 841406345
3915.9 841406345 841407716 841396868 841394961 841354907 841301978 841282845 841294348 841293335 841281712 841285348 841296196 841328144
3940.4 841328144 841382265 841430366 841473460 841515303 841518879 841517568 841552615 841562510 841545701 841546357 841558397 841587722
3964.9 841587722 841637850 841696799 841768205 841836989 841879606 841888905 841863394 841852605 841898680 841980934 842065215 842132926
3989.4 842132926 842156351 842143893 842169404 842201889
3997.5 842201889
##END=$$ End of the data block
