##TITLE=$$ Begin of the data block
##JCAMP-DX=5.00 $$ ACD/SpecManager v 10.08
##SPECTROMETER/DATA SYSTEM=Alpha
##DATE=22 Dec 2014 10:36:42
##DATA TYPE=INFRARED SPECTRUM
##DATA CLASS=XYDATA
##ORIGIN=
##OWNER=
##NPOINTS=1765
##FIRSTX=399.76428223
##LASTX=3997.64306641
##MAXX=3997.64306641
##MINX=399.76428223
##MAXY=0.82431543
##MINY=0.25395212
##XFACTOR=1.0000000000
##YFACTOR=1.000000000000000e-9
##FIRSTY=0.51833522
##DELTAX=2.03961372
##XUNITS=1/CM
##YUNITS=ARBITRARY UNITS
##XYDATA=(X++(Y..Y))
399.8E18335223m862129k767146k027989j028120J092493K517999K413094J448154
416.1E15121579K60830p77602j504004k370536l073335k903402k345622k476573k893716
434.4D97037619j787543R80496L259600L928095L891289M135072L917277K553165Q90613
452.8E18805683K0027k09987q68500j993239k763629k620518k356231k933562l664255
471.2E01415789l517240k328187j520634j691103j413435j48684N55545o0707q39114
489.5D90452230q05169n03332j092762k183765k369195j760811j764148k813548l694713
507.9D73464787l290921k751291l321648m233926m402698l644973k653986j918494
524.2D47246850j219720o6638J083404J506895J970678L609032N614191O097257M779845
$$ plain form
399.8 518335223 513473094 510705948 508677959 507649839 508742332 511260331 513673425 515121579
416.1 515121579 515382409 514604807 513100803 510730267 507656932 504753530 502407908 499931335 497037619
434.4 497037619 495250076 496230572 499490172 503418267 507309556 511444628 515361905 517915070 518805683
452.8 518805683 518825710 518615723 517747223 515753984 512990355 510369837 508013606 505080044 501415789
471.2 501415789 497898549 495570362 494049728 492358625 490945190 490796506 491352051 491291344 490452230
489.5 490452230 489647061 489143729 488050967 485867202 483498007 481737196 479973048 477159500 473464787
507.9 473464787 470173866 467422575 464100927 459867001 455464303 451819330 449165344 447246850
524.2 447246850 446027130 445960492 447043896 448550791 450521469 454130501 459744692 465841949 470621794
542.5D70621794K965838J685262P49230o19560k088011k673208k732367l372371m597485
560.9D59939122n530894n746126n826294n953163n225539l058136j15990K261579L787338
579.3D34531897N401522P085145P610947O443709M457772L014802K199412J214474
595.6D71959680K5750n68867k47717J66893J09911O884N58198J579314K112568K047568
616D77750182K423048L532291M281789M007667L380924L304661L361970K733469J735091
634.3E06511092J434386J945376K119482J340508N59271Q24213J589238J577378Q65519
652.7E18766463P45773J421631J704692J034737L95834P46847J935124K154827O14464
671E29520392P05183J945734K392352J496434P52270J246512J887619J219273k20179
$$ plain form
542.5 470621794 473587632 475272894 476022124 475402564 473314553 470641345 467908978 464536607 459939122
560.9 459939122 454408228 448662102 442835808 436882645 431657106 428598970 428482980 430744559 434531897
579.3 434531897 439933419 447018564 454629511 461073220 465530992 468545794 470745206 471959680
595.6 471959680 471985430 471416563 471168846 471335739 471445650 471452534 472010732 473590046 475702614 477750182
616 477750182 480173230 483705521 487987310 491994977 495375901 498680562 502042532 504776001 506511092
634.3 506511092 507945478 509890854 512010336 513350844 513910115 514734328 516323566 517900944 518766463
652.7 518766463 519512236 520933867 522638559 523673296 524069130 524815977 526751101 528905928 529520392
671 529520392 530225575 532171309 534563661 536060095 536812365 538058877 539946496 541165769 540945590
689.4E40945590p29859l24071o59823k257705l544450l277480k324939j956940j714945
707.7E24155378l34739J858949L322423L672182M069567N364478O515026O246626N365253
726.1E60235143N226075N630136N184889L533363K240062K294600K315342P71582j414716
744.5E86016476k431631k547979l393948m979313n737602m978836l878594l618478
760.8E54450095l403068j682520J300872L695547M831910O011904Q068323R641170
777.1E82914233R167254P534206O724000O763101O031394M316449L296733L897846
793.4F30645216M756867M404545L672898L984869M628956L874302J977980R05216J354634
811.8F60205483J676679O40452n73456n07891J0609q68261k868652m079044m140377
$$ plain form
689.4 540945590 540215731 539891660 539231837 536974132 533429682 530152202 527827263 525870323 524155378
707.7 524155378 523820639 525679588 529002011 532674193 536743760 542108238 548623264 554869890 560235143
726.1 560235143 565461218 571091354 576276243 579809606 582049668 584344268 586659610 587431192 586016476
744.5 586016476 583584845 581036866 577642918 572663605 566926003 561947167 558068573 554450095
760.8 554450095 551047027 549364507 550665379 554360926 559192836 565204740 573273063 582914233
777.1 582914233 592081487 599615693 606339693 613102794 619134188 623450637 626747370 630645216
793.4 630645216 635402083 639806628 643479526 647464395 652093351 655967653 657945633 658850849 660205483
811.8 660205483 661882162 662522614 661949158 661441267 661451876 660583615 657714963 653635919 649495542
830.1F49495542m504263n735040o552935n879819m649818m429579m961371m754722
846.4F08027995l719688l313720m208922n308688n326331m121721j821696J778185
862.8E81985414O202161J0095179J2215555J2191415J0673821Q659840O209015K609015
879.1F50841415j552343m443348n600929o306231p306755p747948o886959n671859
895.4F05325043n417526n929529o161094o049931o613612q137286r550810j0095954
911.7E47369301j0207176j0379851j0093629q465588n713105l173024j713604p98255
928D96825069M39435J830578K664745K988756L519237M312396M211008K063215j816809
946.4E17037630o000042r646356j2724638j4982223j6099304j6411216j6658723j7117172
$$ plain form
830.1 649495542 644991279 639256239 632703304 626823485 622173667 617744088 612782717 608027995
846.4 608027995 604308307 600994587 596785665 591476977 586150646 582028925 580207229 581985414
862.8 581985414 588187575 598282754 610498309 622689724 633363545 642023385 648232400 650841415
879.1 650841415 649289072 644845724 639244795 632938564 625631809 617883861 610996902 605325043
895.4 605325043 599907517 593977988 587816894 581766963 575153351 567016065 557465255 547369301
911.7 547369301 537162125 526782274 516688645 508223057 502509952 499336928 497623324 496825069
928 496825069 497264504 499095082 501759827 504748583 508267820 512580216 516791224 518854439 517037630
946.4 517037630 511037588 501391232 488666594 473684371 457585067 441173851 424515128 407397956
962.7D07397956j7432273j7355561j7143577j7016083j6681701j5726686j4111101
977B91930974j2105048r860635p406950m916608k690673r98944J33216Q96812J492142
995.3B56474286J904250J992017J773834J456320J107544O10888Q1658j55538M1485
1013.7B65286744M85956R54777J419843J944512K502769K941668L086179L020347K944469
1032B84587264K695024K051294J233309O98299N64515O04004O96480J037687J857132
1050.4B96025008L044814M227578N169482O051123P141471Q271187Q650780P124901
1066.7C45706344K899646l060281p810563q925616o739080l413231o28322J202524
1083C19231421K384394L308386M152238M777074M977942M754155M138440L084660J776069
$$ plain form
962.7 407397956 389965683 372610122 355466545 338450462 321768761 306042075 291930974
977 291930974 279825926 269965291 262558341 257641733 254951060 253952116 254085332 254982144 256474286
995.3 256474286 258378536 260370553 262144387 263600707 264708251 265319139 265400797 265245259 265286744
1013.7 265286744 265772700 266727477 268147320 270091832 272594601 275536269 278622448 281642795 284587264
1032 284587264 287282288 289333582 290566891 291265190 291829705 292433709 293130189 294167876 296025008
1050.4 296025008 299069822 303297400 308466882 314518005 321659476 329930663 338581443 345706344
1066.7 345706344 348605990 345545709 337735146 328809530 322070450 318657219 318028897 319231421
1083 319231421 321615815 324924201 329076439 333853513 338831455 343585610 347724050 350808710 352584779
1101.4C52584779Q29429P39187J459568K474964L203690L509015L536314L256291K620608
1119.8C74213845J941680J678616K023578K815604L708750M194826L721386K051264
1136.1C96349549n40048l311455n425513o506353o770045o485373n719840m550159
1152.4C57040763l223330k041191j020342Q3715J386076K810747M334419N944938P583439
1170.7C72899234R116471J0310590J1044622J1529177J1939198J2074888J1706441
1185D50620621J0870100R725987Q280397O547719M804164L456444K702802K380759
1201.3D99388993K242207K318263K809644L634215M423379M915953N116701N026221
1217.7E29875576M477859L381968J991570P73489n9783p00117j264810j543641j458943
$$ plain form
1101.4 352584779 353414208 354153395 355612963 358087927 361291617 364800632 368336946 371593237 374213845
1119.8 374213845 376155525 377834141 379857719 382673323 386382073 390576899 394298285 396349549
1136.1 396349549 395809501 392498046 387072533 380566180 373796135 367310762 361590922 357040763
1152.4 357040763 353817433 351776242 350755900 350839615 352225691 355036438 359370857 365315795 372899234
1170.7 372899234 382015705 392326295 403370917 414900094 426839292 438914180 450620621
1185 450620621 461490721 471216708 479497105 486044824 490848988 494305432 497008234 499388993
1201.3 499388993 501631200 503949463 506759107 510393322 514816701 519732654 524849355 529875576
1217.7 529875576 534353435 537735403 539726973 540500462 540440679 539740562 538475752 536932111 535473168
1236E35473168j246631j075447q10802k24829O51479J434207J814008J930356J997650
1254.4E39943159J923322J556337J084626R46343J309812J873553K231955K273262
1270.7E53142369K081811J622260Q76248J09493l27706m01616m26948o29246q64625
1289E55182040r41396j010537j316726j740218j912593j800418j704157j776933j863420
1307.4E41115642j649917j221418j001358j009226j048565j174867j600265k487958
1323.7E29922068l650248m607677n065918n041361m583836l692448k587974j599520
1340D99093086q08478j79559K70128L89070R6917l35306o40065p94768q92609j050741
1360.4D95147675j272440j197993q39889n88120k64883K56390O41376O60687N55426
$$ plain form
1236 535473168 534226537 533151090 532340288 532115459 532766938 534201145 536015153 537945509 539943159
1254.4 539943159 541866481 543422818 544507444 545453787 546763599 548637152 550869107 553142369
1270.7 553142369 555224180 556846440 557722688 557832181 557504475 557102859 556675911 556046665 555182040
1289 555182040 554240644 553230107 551913381 550173163 548260570 546460152 544755995 542979062 541115642
1307.4 541115642 539465725 538244307 537242949 536233723 535185158 534010291 532410026 529922068
1323.7 529922068 526271820 521664143 516598225 511556864 506973028 503280580 500692606 499093086
1340 499093086 498284608 498105049 498375177 498764247 498861164 498525858 497885793 497091025 496198416 495147675
1360.4 495147675 493875235 492677242 491837353 491249233 490984350 491240740 491882116 492542803 493098229
1378.8D93098229N75006J083613K329588L808289M163444L310919K425909J402796
1395.1E12197793J40607q52227j199603j202703j516640j867831j920938j855076j654029
1413.5E00269353j291394j105755j102269o12021k9146K99215O74695J006841J146675
1431.8D99256194J277685J528144J627028J519918J528680J340986R14991K78294m30167
1450.2E08841753q59141j005590j632870k369284j171649K78116J481175K650261L787637
1468.5E10000408N629718Q430362R216189Q133590P526398P329583P132888O643057
1484.9E70042193O531596O584346N919934M738450M574835N000174M412115L601134
1501.2F11404777L404319L984272M367888K749980K045929K391279K718985K735078
$$ plain form
1378.8 493098229 493673235 494756848 497086436 500894725 505058169 508369088 510794997 512197793
1395.1 512197793 512338400 511486173 510286570 509083867 507567227 505699396 503778458 501923382 500269353
1413.5 500269353 498977959 497872204 496769935 496157914 496128768 496427983 497102678 498109519 499256194
1431.8 499256194 500533879 502062023 503689051 505208969 506737649 508078635 508993626 509271920 508841753
1450.2 508841753 507982612 506977022 505344152 502974868 501803219 502081335 503562510 506212771 510000408
1468.5 510000408 515630126 524060488 533276677 541410267 548936665 556266248 563399136 570042193
1484.9 570042193 576573789 583158135 589078069 593816519 598391354 603391528 607803643 611404777
1501.2 611404777 614809096 618793368 623161256 625911236 627957165 630348444 633067429 635802507
1517.5F35802507K455354K346993J998484J680255J573980J488328J695573J678288
1533.8F50719762J379907J514673J612663O28591J5259L4630K29180L62217L65198
1552.2F56862080M80771O90341K23816j318992j022994m97222l64184l51310o25789
1570.5F54076517n35131l44217q41677j108229q47220r40502j166761j296103j408041
1588.9F45588636j671314j986384k261639k409994k489985k718150k980411l057242
1605.2F26013517l092706l427625l678500l478348l709734m524052l736675l008306
1621.5E97357571l534257l628135l460586l359377k457560j549184j666129j729786
1637.8E75972557j043677l31164L87132R26793J011193J101792J876652K535284J972496
$$ plain form
1517.5 635802507 638257861 640604854 642603338 644283593 645857573 647345901 649041474 650719762
1533.8 650719762 652099669 653614342 655227005 655855596 655870855 655905485 656134665 656496882 656862080
1552.2 656862080 657342851 658033192 658257008 656938016 655915022 655417800 655053616 654702306 654076517
1570.5 654076517 653541386 653197169 652355492 651247263 650400043 649459541 648292780 646996677 645588636
1588.9 645588636 643917322 641930938 639669299 637259305 634769320 632051170 629070759 626013517
1605.2 626013517 622920811 619493186 615814686 612336338 608626604 604102552 600365877 597357571
1621.5 597357571 593823314 590195179 586734593 583375216 580917656 579368472 577702343 575972557
1637.8 575972557 574928880 574597716 574984848 575911641 576922834 578024626 579901278 582436562 584409058
1656.2E84409058K132177K941847L770829L930985L650189M192471M844368M453838
1672.5F14325762M624247M926682M615366M732311N493581O215990M872143M165530
1688.8F53971612M479766M233480M366100M403472L920912L650070K660155K131581
1705.1F83817148K057195J889169J929283K049685K088010J764119R55343O70433J021206
1723.5F98241591J672447K193988K379119K292037K353609K178072J891196J978159
1739.8G15180218K028644K238453K631545K871632K924979K889395K876162K972246
1756.1G36613274K776622K453089K475321K281607K002179J886010J864970J816273
1772.4G54169345J410961J027703J024306J235247J326024J156509R66788J116097
$$ plain form
1656.2 584409058 586541235 589483082 593253911 597184896 600835085 605027556 609871924 614325762
1672.5 614325762 618950009 623876691 628492057 633224368 638717949 644933939 649806082 653971612
1688.8 653971612 658451378 662684858 667050958 671454430 675375342 679025412 681685567 683817148
1705.1 683817148 685874343 687763512 689692795 691742480 693830490 695594609 696549952 697220385 698241591
1723.5 698241591 699914038 702108026 704487145 706779182 709132791 711310863 713202059 715180218
1739.8 715180218 717208862 719447315 722078860 724950492 727875471 730764866 733641028 736613274
1756.1 736613274 739389896 741842985 744318306 746599913 748602092 750488102 752353072 754169345
1772.4 754169345 755580306 756608009 757632315 758867562 760193586 761350095 762316883 763432980
1788.8G63432980J413762J298189Q22008P50184J023531J140118Q81910O78301Q52287
1807.1G72293270J112938J028001O72042N80549P72357R23157Q64446P15137P00235
1825.5G79662132Q60811Q07583L63946K16484M83036O72400N75542M56751M38750M15265
1845.9G84952700L22580J25349N7399K83420M94063L68893J45853K07424N18620O40273
1866.3G88116574K87235o2585J46330M35650L38912J56283K86758N82576O33001M32372
1886.7G91353106K79367L18051M39346L38316R4831J40726L93868L81350J32263M6313
1907.1G93917537K25007L43919J83523M5419J40964L01123K86758P6532l2007J71065
1927.5G95659840L27289J70589r120Q8513L20554L43978J05739l9578J70947L54528
$$ plain form
1788.8 763432980 764846742 766144931 766966939 767717123 768740654 769880772 770762682 771440983 772293270
1807.1 772293270 773406208 774434209 775106251 775686800 776459157 777382314 778246760 778961897 779662132
1825.5 779662132 780522943 781330526 781694472 781910956 782393992 783066392 783641934 784098685 784537435 784952700
1845.9 784952700 785275280 785400629 785458028 785741448 786235511 786604404 786750257 786957681 787476301 788116574
1866.3 788116574 788403809 788341224 788487554 788923204 789262116 789418399 789705157 790287733 790920734 791353106
1886.7 791353106 791632473 791950524 792389870 792728186 792823017 792963743 793357611 793738961 793871224 793917537
1907.1 793917537 794142544 794486463 794669986 794715405 794856369 795157492 795444250 795520782 795488775 795659840
1927.5 795659840 795987129 796157718 796148598 796237111 796557665 796901643 797007382 796967804 797138751 797493279
1947.9G97493279K23279N9366J69814L97801L92556J74165P5281K62380M03225K12848
1968.3G99863994m113R6739L19183K83718L9518j6869J98067L02970J25826m1247N3704
1990.7H01221490K02000J22011p7784j21773N2452J44184l0815k35260j93715m5538
2011.1H01037252r3997l35633m97640m43577m25518o34551p05421k96891N1976j38641
2031.5G97517359m74810m96626k83182j97947l33488m46618l26931j05441p4088k16425
2051.9G94561803k17795j967J07706j2339n9247J03295K20299J00255p5519j5497J80602
2074.3G94891596J93536M351j05977K2888J94848J81437M7206L8505J90437K45929
2094.7G95904756J14858N9426K00986L21985K47359Q2850N9784J87635K47658J27554
$$ plain form
1947.9 797493279 797716558 797775924 797945738 798343539 798736095 798910260 798985541 799247921 799651146 799863994
1968.3 799863994 799859881 799956620 800275803 800559521 800599039 800582170 800780237 801083207 801209033 801167786 801221490
1990.7 801221490 801423490 801545501 801467717 801345944 801398396 801542580 801511765 801276505 801082790 801037252
2011.1 801037252 800943255 800607622 800109982 799666405 799240887 798606336 797900915 797604024 797656000 797517359
2031.5 797517359 797042549 796545923 796262741 796064794 795731306 795284688 794957757 794852316 794778228 794561803
2051.9 794561803 794344008 794342041 794449747 794437408 794378161 794481456 794701755 794802010 794726491 794710994 794891596
2074.3 794891596 795085132 795089483 794983506 795006394 795201242 795382679 795429885 795468390 795658827 795904756
2094.7 795904756 796019614 796079040 796280026 796602011 796849370 796932220 796992004 797179639 797427297 797554851
2115.1G97554851J3709O2644J29342N8472n0723m590J47045J52290j4425q9526L6061
2137.5G97995150J56105J01506k3841l6240Q7976J48774M2378J3471J54615K65836
2157.9G98905730K60711K33889K75731L41713L71277M00603M64559N60760O25134N29528
2178.3H02969635L79085M02749N33104N60224M55379L75450M19855M88043M46558L49998
2198.7H07380080L59476M64439M86911M06980L71158M35829N02050M49062L37064L26037
2219.1H11519086M07577M35531L58105K68042K89559L48985K97487K30789K45870K71856
2239.5H14672887K65658K41518K07484K21908K66969K41995J88530J92225K41339K84791
2259.9H17025304K70128K04325J97291K47777K49505K17378J82390J56283J86265K14338
$$ plain form
2115.1 797554851 797568560 797631204 797760546 797819018 797768295 797763705 797910750 798063040 798048615 797959089 797995150
2137.5 797995150 798151255 798252761 798228920 798192680 798280656 798429430 798471808 798485279 798639894 798905730
2157.9 798905730 799166441 799400330 799676061 800017774 800389051 800789654 801254213 801814973 802440107 802969635
2178.3 802969635 803348720 803751469 804284573 804844797 805300176 805675626 806095481 806583524 807030082 807380080
2198.7 807380080 807739556 808203995 808690906 809097886 809469044 809904873 810406923 810855985 811193049 811519086
2219.1 811519086 811926663 812362194 812720299 812988341 813277900 813626885 813924372 814155161 814401031 814672887
2239.5 814672887 814938545 815180063 815387547 815609455 815876424 816118419 816306949 816499174 816740513 817025304
2259.9 817025304 817295432 817499757 817697048 817944825 818194330 818411708 818594098 818750381 818936646 819150984
2280.3H19150984J76430J80900K60711K74598J93656J52945J87815K28882K28107J62363
2300.7H21197391J29580K10762K99454K71261J89781K05457K86758L11732K72691K59757
2321.1H23634624K81156K57909J41740k9803j27077j32620j62900k02894j51396o4373
2341.5H23444366j38223m78863n91398j46746M92096Q13543N39005J51694k2054k02238
2361.9H23861182l72410n16772p14183q34704q46564q30710q08061p23958n46336l97861
2382.3H17269623m04596m20392k71797j37448j93954l01540k84850j73986j71363l14892
2402.7H14594805l95417l49581l16203l76165m90129n15818m05968l65555n29587o59883
2423.1H10190499n43058l92556m74811o77645o97434n51224n27262o57797p19130o49989
$$ plain form
2280.3 819150984 819327414 819508314 819769025 820043623 820237279 820390224 820578039 820806921 821035028 821197391
2300.7 821197391 821326971 821537733 821837187 822108448 822298229 822503686 822790444 823102176 823374867 823634624
2321.1 823634624 823915780 824173689 824315429 824285626 824158549 824025929 823863029 823660135 823508739 823444366
2341.5 823444366 823306143 822827280 822235882 822089136 822581232 823394775 823933780 824085474 824063420 823861182
2361.9 823861182 823488772 822972000 822257817 821423113 820576549 819745839 818937778 818213820 817667484 817269623
2382.3 817269623 816865027 816444635 816172838 816035390 815841436 815539896 815255046 815081060 814909697 814594805
2402.7 814594805 814199388 813849807 813533604 813157439 812667310 812151492 811745524 811379969 810850382 810190499
2423.1 810190499 809647441 809254885 808780074 808102429 807404995 806853771 806326509 805668712 804949582 804299593
2443.5H04299593n62251n76317p01606p16508n52475m73797o00994p08580o09458m75227
2463.9G98322380n23210o61254o58870m98831m18127n47170o59347n48482l89099m14073
2484.3G93003917n54860n66244m04537l01361l81946m69923l76285k28643k77519m58062
2504.7G88984537m62770k63155j57118k79605m61698m74512l45528l41118m99785n81205
2525.1G85118043m86791m31239n72086p24077o76453n52297n74767p29144q16643o88672
2545.5G78865874n28634o11722p95961p73370n85377n39661p06791q04723o55293m80294
2565.8G72384048n41926p06553o96719n47171n37872p01606p45833n93126m65572n22435
2586.2G66325235o65605o31809m10914l25144m84466n79179m40597l18945m46677o69241
$$ plain form
2443.5 804299593 803737342 803161025 802459419 801742911 801190436 800716639 800115645 799407065 798797607 798322380
2463.9 798322380 797799170 797137916 796479046 795980215 795562088 795014918 794355571 793807089 793417990 793003917
2484.3 793003917 792449057 791882813 791478276 791176915 790794969 790325046 789948761 789720118 789442599 788984537
2504.7 788984537 788521767 788258612 788101494 787821889 787360191 786885679 786540151 786199033 785699248 785118043
2525.1 785118043 784631252 784200013 783627927 782903850 782227397 781675100 781100333 780371189 779554546 778865874
2545.5 778865874 778337240 777725518 776929557 776156187 775570810 775031149 774324358 773519635 772864342 772384048
2565.8 772384048 771842122 771135569 770438850 769891679 769353807 768652201 767906368 767313242 766847670 766325235
2586.2 766325235 765659630 765027821 764616907 764291763 763807297 763228118 762787521 762468576 762021899 761352658
2606.6G61352658o96957n71549n70178p88808r90271r54628q52347r36746j114190
2625G53876984j130223j007259j028359j258314j395881j257360j079321j129806j321017
2643.4G43269444j346350j151800j055301j196026j320362j221776j038313j030446
2659.7G33909070j184284j224697j062333r75490j101136j185477j050770q62301q61168
2678G24401414j008868j027524q52943p69436r35733j110375j021266q38161r25958
2696.4G15911150j177967j203239j023411r75311j146734j303673j222193j017153
2712.7G06841469r94861j140714j162827r92775q91030r93430j071811r38893p45773
2731.1F97909355p39574q76367q95441p54714o76930p65204q65996q00610o39915o45519
$$ plain form
2606.6 761352658 760655701 760084152 759513974 758725166 757734895 756780267 755927920 754991174 753876984
2625 753876984 752746761 751739502 750711143 749452829 748056948 746799588 745720267 744590461 743269444
2643.4 743269444 741923094 740771294 739715993 738519967 737199605 735977829 734939516 733909070
2659.7 733909070 732724786 731500089 730437756 729462266 728361130 727175653 726124883 725262582 724401414
2678 724401414 723392546 722365022 721512079 720742643 719806910 718696535 717675269 716837108 715911150
2696.4 715911150 714733183 713529944 712506533 711531222 710384488 709080815 707858622 706841469
2712.7 706841469 705846608 704705894 703543067 702550292 701659262 700665832 699594021 698655128 697909355
2731.1 697909355 697169781 696293414 695397973 694643259 693966329 693201125 692335129 691534519 690894604 690249085
2751.4F90249085p97033p99239o16967m85599n67496p32064p05183n51224n61714p29143
2771.8F83703423q40307q13603p86364r11772j085937j120329j049459j057923j216293
2790.2F74821436j371264j385093j372278j487195j663327j718462j669943j740277
2806.5F62413597j936793k020717j961648j952589k095044k269566k312064k297818
2822.8F45567358k372861k514601k597213k582967k621889k794802k991319l126919
2839.1F23964787l257215l485680l806114m041314m017711l753543l391445l028869
2855.5E95182896k715111k592325k851546l400505l932416m343629m673779m929900
2871.8E65743685n100489n104780m840434m375398l839195l205061k495348j864910
$$ plain form
2751.4 690249085 689452052 688652813 688035846 687550247 686982751 686250687 685545504 684994280 684432566 683703423
2771.8 683703423 682863116 682049513 681263149 680351377 679265440 678145111 677095652 676037729 674821436
2790.2 674821436 673450172 672065079 670692801 669205606 667542279 665823817 664153874 662413597
2806.5 662413597 660476804 658456087 656494439 654541850 652446806 650177240 647865176 645567358
2822.8 645567358 643194497 640679896 638082683 635499716 632877827 630083025 627091706 623964787
2839.1 623964787 620707572 617221892 613415778 609374464 605356753 601603210 598211765 595182896
2855.5 595182896 592467785 589875460 587023914 583623409 579690993 575347364 570673585 565743685
2871.8 565743685 560643196 555538416 550697982 546322584 542483389 539278328 536782980 534918070
2888.1E34918070j384139j008809p04348n38945n81265p60376r60708j143157j359821
2906.5E26476502j699507k179324k686024l114224l459990l655076l581166l197312
2922.8E02903879k576828j859308j068443j63316Q65608J970708K974987L788233M462600
2941.1E11298120M950404N155683N151510N181789N314529N362153N256057N147755
2957.4E52818000N150974N125225M862249M455387M145444L977358L869355L727317
2973.8E88131309L577172L548801L503919L247857K926469K682745K462149K248228
2990.1F12328649J973509J570523J234889J011670P11322L53336M0174j94073l62456
3008.4F18667543n88417r53734j293600j472532j615584j808048j949727k014578k116024
$$ plain form
2888.1 534918070 533533931 532525122 531820774 531281829 530700564 529940188 528979480 527836323 526476502
2906.5 526476502 524776995 522597671 519911647 516797423 513337433 509682357 506101191 502903879
2922.8 502903879 500327051 498467743 497399300 497235984 498101592 500072300 503047287 506835520 511298120
2941.1 511298120 516248524 521404207 526555717 531737506 537052035 542414188 547670245 552818000
2957.4 552818000 557968974 563094199 567956448 572411835 576557279 580534637 584403992 588131309
2973.8 588131309 591708481 595257282 598761201 602009058 604935527 607618272 610080421 612328649
2990.1 612328649 614302158 615872681 617107570 618119240 618830562 619183898 619224072 619029999 618667543
3008.4 618667543 618079126 617125392 615831792 614359260 612743676 610935628 608985901 606971323 604855299
3026.8F04855299k217472k237618k249896k348900k490282k544582k538383k564073
3043.1E85664093k631604k708018k730310k714038k712607k725244k783239k842426
3059.4E63816607k777874k650559k617956k712667k820849k824247k734363k603173
3075.7E42074919k533078k606869k690792k723635k776265k757609k690196k698540
3092.1E20597935k708614k643049k514958k474666k577841k595186k473593k409995
3108.4E00200033k479046k469302k321422k287268k372802k486944k603173k571553
3124.7D80608523k389878k267540k311617k353728k240926k079010k057582k223968
3141D62684274k340496k240211k082228j926482j817822j952440k166420k154559k034187
$$ plain form
3026.8 604855299 602637827 600400209 598150313 595801413 593311131 590766549 588228166 585664093
3043.1 585664093 583032489 580324471 577594161 574880123 572167516 569442272 566659033 563816607
3059.4 563816607 561038733 558388174 555770218 553057551 550236702 547412455 544678092 542074919
3075.7 542074919 539541841 536934972 534244180 531520545 528744280 525986671 523296475 520597935
3092.1 520597935 517889321 515246272 512731314 510256648 507678807 505083621 502610028 500200033
3108.4 500200033 497720987 495251685 492930263 490642995 488270193 485783249 483180076 480608523
3124.7 480608523 478218645 475951105 473639488 471285760 469044834 466965824 464908242 462684274
3141 462684274 460343778 458103567 456021339 454094857 452277035 450324595 448158175 446003616 443969429
3159.4D43969429j965166j907974j852423j834631j820952j770705j726508j705259
3175.7D29385811j690715j668424j659572j656622j606375j573532j598061j552701
3192D16379809j471370j496077j520216j452118j381457j348049j332074j346111j324028
3210.3D03708309j248866j234025j241326j235933j243621j202434j130790j079767
3226.7C94091547j032562r41634q87930j055449j240641j171589j001388q68231q11726
3245C85080397r09120j038134r91911q46892q05974q62926q68112q14140p88599p32452
3265.4C76422137n75274m65721n84215p80642q60125q23706p39187p31737p19309o13749
3285.8C69528472n49316n30988n56678o50256p20978p60436p43747n89758m11302m94748
$$ plain form
3159.4 443969429 442004263 440096289 438243866 436409235 434588283 432817578 431091070 429385811
3175.7 429385811 427695096 426026672 424367100 422710478 421104103 419530571 417932510 416379809
3192 416379809 414908439 413412362 411892146 410440028 409058571 407710522 406378448 405032337 403708309
3210.3 403708309 402459443 401225418 399984092 398748159 397504538 396302104 395171314 394091547
3226.7 394091547 393058985 392117351 391229421 390173972 388933331 387761742 386760354 385892123 385080397
3245 385080397 384171277 383133143 382141232 381294340 380488366 379625440 378757328 377943188 377154589 376422137
3265.4 376422137 375846863 375381142 374796927 374016285 373156160 372332454 371593267 370861530 370142221 369528472
3285.8 369528472 368979156 368448168 367891490 367241234 366520256 365759820 365016073 364426315 364015013 363520265
3306.2C63520265q19952j013010r62139q73684q49456q25733p78645p04408o70254
3324.6C56022984q44449j043379r76891q25584p56293p27981q07226r13471r33647
3342.9C48194063r65983r20534p60317q19266j079500j153200r87560q23766q31246
3361.3C39852691q69155p38830o46263q44598j170277j211882r26733p22736p16895
3379.6C32005322p77602p87616o28561l53634j77115l26246o54519o47783k46078p5579
3400C27330589m55528q12143o34104l05891k38508k94447l54648l55959k58863k22593
3420.4C23397905j93745k0921J68532K36868J28627J27614L21597K18361j20192j52827
3440.8C24111819J20282L63857L84837K82944L32743M68134N20498N84930O62178N90563
$$ plain form
3306.2 363520265 362700313 361687303 360725164 359851480 359002024 358176291 357397646 356693238 356022984
3324.6 356022984 355178535 354135156 353158265 352332681 351576388 350848407 350041181 349127710 348194063
3342.9 348194063 347228080 346307546 345547229 344727963 343648463 342495263 341507703 340683937 339852691
3361.3 339852691 338983536 338244706 337598443 336753845 335583568 334371686 333444953 332722217 332005322
3379.6 332005322 331227720 330440104 329811543 329457909 329280794 328954548 328300029 327652246 327406168 327330589
3400 327330589 326875061 326062918 325428814 325122923 324884415 324589968 324235320 323879361 323620498 323397905
3420.4 323397905 323204160 323183239 323351771 323588639 323717266 323844880 324166477 324384838 324264646 324111819
3440.8 324111819 324232101 324595958 324980795 325263739 325596482 326064616 326585114 327170044 327832222 328422785
3461.2C28422785O09964Q95649J006901O67602K89649L27826N90264Q40992Q73774
3479.6C34525406O18309N68897P84218Q13335P47442Q07852Q34584Q32886Q87274R83865
3500C42404068R75787P57307O43045P75963R18358J029075J031786Q77320Q36641J028210
3520.4C51277560J249224J145035Q72433Q50409J034469J249611J376718J261414J092702
3538.7C61409575J245379J492650J445174J126677J018434J206667J356810J445383
3555C71746749J578211J710922J738042J728356J798093J973122K066523K020270K044052
3573.4C88404340K210527K408773K656758K886206K890765K661765K455503K665817
3589.7D09240454K896876K943992L106177L311127L306360L262072L276438L202885
$$ plain form
3461.2 328422785 329032749 329928398 330935299 331602901 331892550 332220376 332810640 333651632 334525406
3479.6 334525406 335143715 335712612 336496830 337310165 338057607 338865459 339700043 340532929 341420203 342404068
3500 342404068 343379855 344137162 344780207 345556170 346474528 347503603 348535389 349412709 350249350 351277560
3520.4 351277560 352526784 353671819 354544252 355394661 356429130 357678741 359055459 360316873 361409575
3538.7 361409575 362654954 364147604 365592778 366719455 367737889 368944556 370301366 371746749
3555 371746749 373324960 375035882 376773924 378502280 380300373 382273495 384340018 386360288 388404340
3573.4 388404340 390614867 393023640 395680398 398566604 401457369 404119134 406574637 409240454
3589.7 409240454 412137330 415081322 418187499 421498626 424804986 428067058 431343496 434546381
3606D34546381L246069L413707L490538L586053L586591L540635L694653L661633L516078
3624.4D66282338L420889L414363L633171L654957L623366L613949L575415L583073
3640.7D94801521L632397L661543L654838L650665L545105L349245L319979L596425
3657E23211718L632962L224492K985478L190219L279448L033399L053189L005445K559900
3675.4E51176250K526760K756059K769411K840936K982438K868652K280295J986265
3691.7E72187066K185464K240360K122998J933336J752675J851857K107143K101839
3708E88482738J680612J261234J522065J785755J708686J591921J548469J454055J321853
3726.4F02357388J485168J688064J649201J356422J069010J218855J414955J038372
$$ plain form
3606 434546381 437792450 441206157 444696695 448282748 451869339 455409974 459104627 462766260 466282338
3624.4 466282338 469703227 473117590 476750761 480405718 484029084 487643033 491218448 494801521
3640.7 494801521 498433918 502095461 505750299 509400964 512946069 516295314 519615293 523211718
3657 523211718 526844680 530069172 533054650 536244869 539524317 542557716 545610905 548616350 551176250
3675.4 551176250 553703010 556459069 559228480 562069416 565051854 567920506 570200801 572187066
3691.7 572187066 574372530 576612890 578735888 580669224 582421899 584273756 586380899 588482738
3708 588482738 590163350 591424584 592946649 594732404 596441090 598033011 599581480 601035535 602357388
3726.4 602357388 603842556 605530620 607179821 608536243 609605253 610824108 612239063 613277435
3742.7F13277435O00457J138688J271069O89089Q13246J327872J309216R92358R74238
3761F22393668J156211J133620J038075Q61943P80463R71496J114309J062095Q47042
3779.4F31358922P80463Q25584P91251Q47638R48071R71675R26376Q44359Q80778P58648
3799.8F39933765N59568Q30353O98983L79443P16389J074731R06766N89549P54356
3818.1F46443903O82712N05030P23899P20203O85215P26282P74920Q87513O46413K21014
3838.5F53017104L13818N48542O23405P40051R39071Q26299o9439k64585P32064R37104
3858.9F58343434O54102L59356L85046O47128M67062K41041L70622N34653O43730M92812
3879.3F63138986M51445N78940L89397L42548L58939J41561K79367O37591O40393L94701
$$ plain form
3742.7 613277435 613877892 615016580 616287649 616976738 617789984 619117856 620427072 621419430 622393668
3761 622393668 623549879 624683499 625721574 626583517 627363980 628335476 629449785 630511880 631358922
3779.4 631358922 632139385 632964969 633756220 634603858 635551929 636523604 637449980 638294339 639175117 639933765
3799.8 639933765 640493333 641323686 642022669 642402112 643118501 644193232 645099998 645689547 646443903
3818.1 646443903 647126615 647631645 648355544 649075747 649760962 650487244 651262164 652149677 652796090 653017104
3838.5 653017104 653330922 653879464 654502869 655242920 656181991 657008290 656938851 656674266 657406330 658343434
3858.9 658343434 658997536 659356892 659741938 660389066 660856128 661097169 661467791 662002444 662646174 663138986
3879.3 663138986 663590431 664169371 664558768 664901316 665260255 665401816 665681183 666318774 666959167 667353868
3899.7F67353868K09988J07467J50323L04937L79384M49836M92990L66151J95146J80542
3920.1F70190632K36571K26140K13564K42889K14636J85251K52783K96891K80798K39551
3940.5F72579706J74820K03490K91646L21686L03745K29121J86085K23637K28584J59323
3960.9F74901843J34111J94847K45273K20478J63972J58966K11477K56121K08140J80840
3981.3F76876068K24888J92106J35660J32144J87337K60353K13385J40131
3997.6F78362072
$$ plain form
3899.7 667353868 667563856 667671323 667821646 668126583 668505967 668955803 669448793 669814944 670010090 670190632
3920.1 670190632 670427203 670653343 670866907 671109796 671324432 671509683 671762466 672059357 672340155 672579706
3940.5 672579706 672754526 672958016 673249662 673571348 673875093 674104214 674290299 674513936 674742520 674901843
3960.9 674901843 675035954 675230801 675476074 675696552 675860524 676019490 676230967 676487088 676695228 676876068
3981.3 676876068 677100956 677293062 677428722 677560866 677748203 678008556 678221941 678362072
3997.6 678362072
##END=$$ End of the data block
